FailedConsole Output

Skipping 5,044 KB.. Full Log
ne_number_verified",
            "phone_number"
        ]},
        {"profile": [
            "name",
            "family_name",
            "given_name",
            "middle_name",
            "nickname",
            "preferred_username",
            "profile",
            "picture",
            "website",
            "gender",
            "birthdate",
            "zoneinfo",
            "locale",
            "updated_at"
        ]},
        {"mobile_phone": ["phone_mobile_number"]},
        {"test": ["member_of"]}
    ],
    "claims_parameter_supported": true,
    "request_parameter_supported": true,
    "request_uri_parameter_supported": true,
    "require_request_uri_registration": false,
    "op_policy_uri": "http://ox.gluu.org/doku.php?id=oxauth:policy",
    "op_tos_uri": "http://ox.gluu.org/doku.php?id=oxauth:tos",
    "frontchannel_logout_supported": true,
    "frontchannel_logout_session_supported": true
}


#######################################################
TEST: OC5:FeatureTest-Uses Symmetric ID Token Signatures HS256
#######################################################
-------------------------------------------------------
REQUEST:
-------------------------------------------------------
POST /oxauth/restv1/register HTTP/1.1
Content-Type: application/json
Accept: application/json
Host: ce-dev4.gluu.org

{
    "redirect_uris": [
        "https://ce-dev4.gluu.org/oxauth-rp/home.htm",
        "https://client.example.com/cb",
        "https://client.example.com/cb1",
        "https://client.example.com/cb2"
    ],
    "response_types": ["id_token"],
    "application_type": "web",
    "client_name": "oxAuth test app",
    "sector_identifier_uri": "https://ce-dev4.gluu.org/oxauth/sectoridentifier/@!38D4.410C.1D43.8932!0001!37F2.B744!0012!D426.70FD",
    "id_token_signed_response_alg": "HS256"
}

-------------------------------------------------------
RESPONSE:
-------------------------------------------------------
HTTP/1.1 200
Cache-Control: no-store
Connection: Keep-Alive
Content-Length: 1340
Content-Type: application/json
Date: Thu, 05 Jul 2018 18:57:27 GMT
Keep-Alive: timeout=5, max=100
Pragma: no-cache
Server: Jetty(9.4.9.v20180320)
Strict-Transport-Security: max-age=31536000; includeSubDomains
X-Content-Type-Options: nosniff
X-Xss-Protection: 1; mode=block

{
    "client_id": "@!38D4.410C.1D43.8932!0001!37F2.B744!0008!19F6.06D7.BD36.9FB9",
    "client_secret": "1d69cfa0-22a4-45bc-8ceb-e29c69d0efa9",
    "registration_access_token": "db2d4470-b1ea-4292-bc82-81da2a7c6cec",
    "registration_client_uri": "https://ce-dev4.gluu.org/oxauth/restv1/register?client_id=@!38D4.410C.1D43.8932!0001!37F2.B744!0008!19F6.06D7.BD36.9FB9",
    "client_id_issued_at": 1530817047,
    "client_secret_expires_at": 1530903447,
    "redirect_uris": [
        "https://client.example.com/cb2",
        "https://client.example.com/cb1",
        "https://client.example.com/cb",
        "https://ce-dev4.gluu.org/oxauth-rp/home.htm"
    ],
    "response_types": [
        "id_token",
        "token"
    ],
    "grant_types": ["implicit"],
    "application_type": "web",
    "client_name": "oxAuth test app",
    "sector_identifier_uri": "https://ce-dev4.gluu.org/oxauth/sectoridentifier/@!38D4.410C.1D43.8932!0001!37F2.B744!0012!D426.70FD",
    "subject_type": "pairwise",
    "id_token_signed_response_alg": "HS256",
    "token_endpoint_auth_method": "client_secret_basic",
    "require_auth_time": false,
    "frontchannel_logout_session_required": false,
    "scope": "permission uma_protection clientinfo email user_name sub org_name address openid test_scope1 work_phone phone profile test",
    "claims": ""
}

authenticateResourceOwnerAndGrantAccess: Cleaning cookies
authenticateResourceOwnerAndGrantAccess: authorizationRequestUrl:https://ce-dev4.gluu.org/oxauth/restv1/authorize?response_type=id_token&client_id=%40%2138D4.410C.1D43.8932%210001%2137F2.B744%210008%2119F6.06D7.BD36.9FB9&scope=openid+profile+address+email&redirect_uri=https%3A%2F%2Fce-dev4.gluu.org%2Foxauth-rp%2Fhome.htm&state=7cca789b-3ca0-40a5-9be1-9dded7e41d3f&nonce=f3adb898-beed-4614-b90f-a7c5bfe9a452
14:57:49.199 [main] ERROR com.gargoylesoftware.htmlunit.javascript.StrictErrorReporter - runtimeError: message=[An invalid or illegal selector was specified (selector: '*,:x' error: Invalid selector: :x).] sourceName=[https://ce-dev4.gluu.org/oxauth/js/jquery-1.12.4.min.js] line=[2] lineSource=[null] lineOffset=[0]
authenticateResourceOwnerAndGrantAccess: sessionState:ad9144ae-5261-4bd6-96af-f35e97c478d3
-------------------------------------------------------
REQUEST:
-------------------------------------------------------
https://ce-dev4.gluu.org/oxauth/restv1/authorize?response_type=id_token&client_id=%40%2138D4.410C.1D43.8932%210001%2137F2.B744%210008%2119F6.06D7.BD36.9FB9&scope=openid+profile+address+email&redirect_uri=https%3A%2F%2Fce-dev4.gluu.org%2Foxauth-rp%2Fhome.htm&state=7cca789b-3ca0-40a5-9be1-9dded7e41d3f&nonce=f3adb898-beed-4614-b90f-a7c5bfe9a452

-------------------------------------------------------
RESPONSE:
-------------------------------------------------------
HTTP/1.1 302 Found
Location: https://ce-dev4.gluu.org/oxauth-rp/home.htm#scope=address+openid+profile+email&id_token=eyJ0eXAiOiJKV1QiLCJhbGciOiJIUzI1NiJ9.eyJpc3MiOiJodHRwczovL2NlLWRldjQuZ2x1dS5vcmciLCJhdWQiOiJAITM4RDQuNDEwQy4xRDQzLjg5MzIhMDAwMSEzN0YyLkI3NDQhMDAwOCExOUY2LjA2RDcuQkQzNi45RkI5IiwiZXhwIjoxNTMwODIwNjQ4LCJpYXQiOjE1MzA4MTcwNDgsIm5vbmNlIjoiZjNhZGI4OTgtYmVlZC00NjE0LWI5MGYtYTdjNWJmZTlhNDUyIiwiYXV0aF90aW1lIjoxNTMwODE3MDQ4LCJveE9wZW5JRENvbm5lY3RWZXJzaW9uIjoib3BlbmlkY29ubmVjdC0xLjAiLCJzdWIiOiJNRjNBS1piTk4tVEVvcjJCdDNKeWJjTVhDbDRaaU1oRW9nSFMtR0ZWU1lFIn0.83ENwFT1fN6C-URdN-P0ihERQXO_egu3PNOlvdT_tC8&session_id=284f0674-1bb6-483e-bec1-644d7cfdb939&state=7cca789b-3ca0-40a5-9be1-9dded7e41d3f&session_state=ad9144ae-5261-4bd6-96af-f35e97c478d3

#######################################################
TEST: OC5:FeatureTest-Uses Symmetric ID Token Signatures HS384
#######################################################
-------------------------------------------------------
REQUEST:
-------------------------------------------------------
POST /oxauth/restv1/register HTTP/1.1
Content-Type: application/json
Accept: application/json
Host: ce-dev4.gluu.org

{
    "redirect_uris": [
        "https://ce-dev4.gluu.org/oxauth-rp/home.htm",
        "https://client.example.com/cb",
        "https://client.example.com/cb1",
        "https://client.example.com/cb2"
    ],
    "response_types": ["id_token"],
    "application_type": "web",
    "client_name": "oxAuth test app",
    "sector_identifier_uri": "https://ce-dev4.gluu.org/oxauth/sectoridentifier/@!38D4.410C.1D43.8932!0001!37F2.B744!0012!D426.70FD",
    "id_token_signed_response_alg": "HS384"
}

-------------------------------------------------------
RESPONSE:
-------------------------------------------------------
HTTP/1.1 200
Cache-Control: no-store
Connection: Keep-Alive
Content-Length: 1340
Content-Type: application/json
Date: Thu, 05 Jul 2018 18:57:28 GMT
Keep-Alive: timeout=5, max=100
Pragma: no-cache
Server: Jetty(9.4.9.v20180320)
Strict-Transport-Security: max-age=31536000; includeSubDomains
X-Content-Type-Options: nosniff
X-Xss-Protection: 1; mode=block

{
    "client_id": "@!38D4.410C.1D43.8932!0001!37F2.B744!0008!3600.562D.DA44.EFB7",
    "client_secret": "172dba66-c6f6-49e7-a0dc-e5afb80ef778",
    "registration_access_token": "ce1555ee-c70d-45a4-89a8-002de64f5aaf",
    "registration_client_uri": "https://ce-dev4.gluu.org/oxauth/restv1/register?client_id=@!38D4.410C.1D43.8932!0001!37F2.B744!0008!3600.562D.DA44.EFB7",
    "client_id_issued_at": 1530817048,
    "client_secret_expires_at": 1530903448,
    "redirect_uris": [
        "https://client.example.com/cb2",
        "https://client.example.com/cb1",
        "https://client.example.com/cb",
        "https://ce-dev4.gluu.org/oxauth-rp/home.htm"
    ],
    "response_types": [
        "id_token",
        "token"
    ],
    "grant_types": ["implicit"],
    "application_type": "web",
    "client_name": "oxAuth test app",
    "sector_identifier_uri": "https://ce-dev4.gluu.org/oxauth/sectoridentifier/@!38D4.410C.1D43.8932!0001!37F2.B744!0012!D426.70FD",
    "subject_type": "pairwise",
    "id_token_signed_response_alg": "HS384",
    "token_endpoint_auth_method": "client_secret_basic",
    "require_auth_time": false,
    "frontchannel_logout_session_required": false,
    "scope": "permission uma_protection clientinfo email user_name sub org_name address openid test_scope1 work_phone phone profile test",
    "claims": ""
}

authenticateResourceOwnerAndGrantAccess: Cleaning cookies
authenticateResourceOwnerAndGrantAccess: authorizationRequestUrl:https://ce-dev4.gluu.org/oxauth/restv1/authorize?response_type=id_token&client_id=%40%2138D4.410C.1D43.8932%210001%2137F2.B744%210008%213600.562D.DA44.EFB7&scope=openid+profile+address+email&redirect_uri=https%3A%2F%2Fce-dev4.gluu.org%2Foxauth-rp%2Fhome.htm&state=3724865e-337d-425f-ba6b-0aaa7e13beb9&nonce=cd4a7d5f-d5ac-4fa9-b2de-69c2bcfdc32a
14:57:50.355 [main] ERROR com.gargoylesoftware.htmlunit.javascript.StrictErrorReporter - runtimeError: message=[An invalid or illegal selector was specified (selector: '*,:x' error: Invalid selector: :x).] sourceName=[https://ce-dev4.gluu.org/oxauth/js/jquery-1.12.4.min.js] line=[2] lineSource=[null] lineOffset=[0]
authenticateResourceOwnerAndGrantAccess: sessionState:19bbafaa-4dbf-4c8d-9541-50891b022be2
-------------------------------------------------------
REQUEST:
-------------------------------------------------------
https://ce-dev4.gluu.org/oxauth/restv1/authorize?response_type=id_token&client_id=%40%2138D4.410C.1D43.8932%210001%2137F2.B744%210008%213600.562D.DA44.EFB7&scope=openid+profile+address+email&redirect_uri=https%3A%2F%2Fce-dev4.gluu.org%2Foxauth-rp%2Fhome.htm&state=3724865e-337d-425f-ba6b-0aaa7e13beb9&nonce=cd4a7d5f-d5ac-4fa9-b2de-69c2bcfdc32a

-------------------------------------------------------
RESPONSE:
-------------------------------------------------------
HTTP/1.1 302 Found
Location: https://ce-dev4.gluu.org/oxauth-rp/home.htm#scope=address+openid+profile+email&id_token=eyJ0eXAiOiJKV1QiLCJhbGciOiJIUzM4NCJ9.eyJpc3MiOiJodHRwczovL2NlLWRldjQuZ2x1dS5vcmciLCJhdWQiOiJAITM4RDQuNDEwQy4xRDQzLjg5MzIhMDAwMSEzN0YyLkI3NDQhMDAwOCEzNjAwLjU2MkQuREE0NC5FRkI3IiwiZXhwIjoxNTMwODIwNjQ5LCJpYXQiOjE1MzA4MTcwNDksIm5vbmNlIjoiY2Q0YTdkNWYtZDVhYy00ZmE5LWIyZGUtNjljMmJjZmRjMzJhIiwiYXV0aF90aW1lIjoxNTMwODE3MDQ5LCJveE9wZW5JRENvbm5lY3RWZXJzaW9uIjoib3BlbmlkY29ubmVjdC0xLjAiLCJzdWIiOiJHTm81SzFCamg2RlJQU3JPcXZ2UnBLb0N0dDNlN29lSzZuN0cxNnBXWHNjIn0.KJvNugiWyYrS1pV23_COK5TzfvoWf4GnAy707CTTRyk581aYTS9RCYWM1pQMSL-C&session_id=b1f1a4b8-335f-44e5-a94f-4d23a7d38a7c&state=3724865e-337d-425f-ba6b-0aaa7e13beb9&session_state=19bbafaa-4dbf-4c8d-9541-50891b022be2

#######################################################
TEST: OC5:FeatureTest-Uses Symmetric ID Token Signatures HS512
#######################################################
-------------------------------------------------------
REQUEST:
-------------------------------------------------------
POST /oxauth/restv1/register HTTP/1.1
Content-Type: application/json
Accept: application/json
Host: ce-dev4.gluu.org

{
    "redirect_uris": [
        "https://ce-dev4.gluu.org/oxauth-rp/home.htm",
        "https://client.example.com/cb",
        "https://client.example.com/cb1",
        "https://client.example.com/cb2"
    ],
    "response_types": ["id_token"],
    "application_type": "web",
    "client_name": "oxAuth test app",
    "sector_identifier_uri": "https://ce-dev4.gluu.org/oxauth/sectoridentifier/@!38D4.410C.1D43.8932!0001!37F2.B744!0012!D426.70FD",
    "id_token_signed_response_alg": "HS512"
}

-------------------------------------------------------
RESPONSE:
-------------------------------------------------------
HTTP/1.1 200
Cache-Control: no-store
Connection: Keep-Alive
Content-Length: 1340
Content-Type: application/json
Date: Thu, 05 Jul 2018 18:57:29 GMT
Keep-Alive: timeout=5, max=100
Pragma: no-cache
Server: Jetty(9.4.9.v20180320)
Strict-Transport-Security: max-age=31536000; includeSubDomains
X-Content-Type-Options: nosniff
X-Xss-Protection: 1; mode=block

{
    "client_id": "@!38D4.410C.1D43.8932!0001!37F2.B744!0008!5421.5A33.86CE.9B7D",
    "client_secret": "41282bac-2601-40f3-9c09-11f82e9e2125",
    "registration_access_token": "277fec84-97a8-48ab-9cff-1cf50b99a018",
    "registration_client_uri": "https://ce-dev4.gluu.org/oxauth/restv1/register?client_id=@!38D4.410C.1D43.8932!0001!37F2.B744!0008!5421.5A33.86CE.9B7D",
    "client_id_issued_at": 1530817050,
    "client_secret_expires_at": 1530903450,
    "redirect_uris": [
        "https://client.example.com/cb2",
        "https://client.example.com/cb1",
        "https://client.example.com/cb",
        "https://ce-dev4.gluu.org/oxauth-rp/home.htm"
    ],
    "response_types": [
        "id_token",
        "token"
    ],
    "grant_types": ["implicit"],
    "application_type": "web",
    "client_name": "oxAuth test app",
    "sector_identifier_uri": "https://ce-dev4.gluu.org/oxauth/sectoridentifier/@!38D4.410C.1D43.8932!0001!37F2.B744!0012!D426.70FD",
    "subject_type": "pairwise",
    "id_token_signed_response_alg": "HS512",
    "token_endpoint_auth_method": "client_secret_basic",
    "require_auth_time": false,
    "frontchannel_logout_session_required": false,
    "scope": "permission uma_protection clientinfo email user_name sub org_name address openid test_scope1 work_phone phone profile test",
    "claims": ""
}

authenticateResourceOwnerAndGrantAccess: Cleaning cookies
authenticateResourceOwnerAndGrantAccess: authorizationRequestUrl:https://ce-dev4.gluu.org/oxauth/restv1/authorize?response_type=id_token&client_id=%40%2138D4.410C.1D43.8932%210001%2137F2.B744%210008%215421.5A33.86CE.9B7D&scope=openid+profile+address+email&redirect_uri=https%3A%2F%2Fce-dev4.gluu.org%2Foxauth-rp%2Fhome.htm&state=7f02007e-c0e3-401d-a481-90222bcb1b38&nonce=052398ef-5a7a-405a-b6f0-78b9efd82ae9
14:57:51.434 [main] ERROR com.gargoylesoftware.htmlunit.javascript.StrictErrorReporter - runtimeError: message=[An invalid or illegal selector was specified (selector: '*,:x' error: Invalid selector: :x).] sourceName=[https://ce-dev4.gluu.org/oxauth/js/jquery-1.12.4.min.js] line=[2] lineSource=[null] lineOffset=[0]
authenticateResourceOwnerAndGrantAccess: sessionState:5f584aaa-8558-4275-b4c9-37731cd3e567
-------------------------------------------------------
REQUEST:
-------------------------------------------------------
https://ce-dev4.gluu.org/oxauth/restv1/authorize?response_type=id_token&client_id=%40%2138D4.410C.1D43.8932%210001%2137F2.B744%210008%215421.5A33.86CE.9B7D&scope=openid+profile+address+email&redirect_uri=https%3A%2F%2Fce-dev4.gluu.org%2Foxauth-rp%2Fhome.htm&state=7f02007e-c0e3-401d-a481-90222bcb1b38&nonce=052398ef-5a7a-405a-b6f0-78b9efd82ae9

-------------------------------------------------------
RESPONSE:
-------------------------------------------------------
HTTP/1.1 302 Found
Location: https://ce-dev4.gluu.org/oxauth-rp/home.htm#scope=address+openid+profile+email&id_token=eyJ0eXAiOiJKV1QiLCJhbGciOiJIUzUxMiJ9.eyJpc3MiOiJodHRwczovL2NlLWRldjQuZ2x1dS5vcmciLCJhdWQiOiJAITM4RDQuNDEwQy4xRDQzLjg5MzIhMDAwMSEzN0YyLkI3NDQhMDAwOCE1NDIxLjVBMzMuODZDRS45QjdEIiwiZXhwIjoxNTMwODIwNjUxLCJpYXQiOjE1MzA4MTcwNTEsIm5vbmNlIjoiMDUyMzk4ZWYtNWE3YS00MDVhLWI2ZjAtNzhiOWVmZDgyYWU5IiwiYXV0aF90aW1lIjoxNTMwODE3MDUwLCJveE9wZW5JRENvbm5lY3RWZXJzaW9uIjoib3BlbmlkY29ubmVjdC0xLjAiLCJzdWIiOiJEdkhDcWZsQ2k4b1RodWZMZkxNVjRCdnd6SkFqSF9OUms4djh2TU5pRDFvIn0.GSQsx5jmJZbEkM4fbONiUb-EDsvyo4AbvBqqlyoFC5sdcI8gJS28PHg0rZ6fAh0ObHoJalJHsWBpCDRks-e8RQ&session_id=88c48789-463e-4c71-8448-8c16a72e8cf3&state=7f02007e-c0e3-401d-a481-90222bcb1b38&session_state=5f584aaa-8558-4275-b4c9-37731cd3e567

#######################################################
TEST: OpenID Connect Discovery
#######################################################
-------------------------------------------------------
REQUEST:
-------------------------------------------------------
GET /.well-known/webfinger?resource=acct%3Atest_user%40ce-dev4.gluu.org&rel=http%3A%2F%2Fopenid.net%2Fspecs%2Fconnect%2F1.0%2Fissuer HTTP/1.1
Host: ce-dev4.gluu.org

-------------------------------------------------------
RESPONSE:
-------------------------------------------------------
HTTP/1.1 200
Connection: Keep-Alive
Content-Length: 181
Content-Type: application/jrd+json;charset=iso-8859-1
Date: Thu, 05 Jul 2018 18:57:31 GMT
Keep-Alive: timeout=5, max=100
Server: Jetty(9.4.9.v20180320)
Strict-Transport-Security: max-age=31536000; includeSubDomains
X-Content-Type-Options: nosniff
X-Xss-Protection: 1; mode=block

{
    "subject": "acct:test_user@ce-dev4.gluu.org",
    "links": [{
        "rel": "http://openid.net/specs/connect/1.0/issuer",
        "href": "https://ce-dev4.gluu.org"
    }]
}


OpenID Connect Configuration
-------------------------------------------------------
REQUEST:
-------------------------------------------------------
GET /.well-known/openid-configuration HTTP/1.1
Host: ce-dev4.gluu.org

-------------------------------------------------------
RESPONSE:
-------------------------------------------------------
HTTP/1.1 200
Connection: Keep-Alive
Content-Length: 6342
Content-Type: application/json
Date: Thu, 05 Jul 2018 18:57:31 GMT
Keep-Alive: timeout=5, max=100
Server: Jetty(9.4.9.v20180320)
Strict-Transport-Security: max-age=31536000; includeSubDomains
X-Content-Type-Options: nosniff
X-Xss-Protection: 1; mode=block

{
    "issuer": "https://ce-dev4.gluu.org",
    "authorization_endpoint": "https://ce-dev4.gluu.org/oxauth/restv1/authorize",
    "token_endpoint": "https://ce-dev4.gluu.org/oxauth/restv1/token",
    "userinfo_endpoint": "https://ce-dev4.gluu.org/oxauth/restv1/userinfo",
    "clientinfo_endpoint": "https://ce-dev4.gluu.org/oxauth/restv1/clientinfo",
    "check_session_iframe": "https://ce-dev4.gluu.org/oxauth/opiframe",
    "end_session_endpoint": "https://ce-dev4.gluu.org/oxauth/restv1/end_session",
    "jwks_uri": "https://ce-dev4.gluu.org/oxauth/restv1/jwks",
    "registration_endpoint": "https://ce-dev4.gluu.org/oxauth/restv1/register",
    "id_generation_endpoint": "https://ce-dev4.gluu.org/oxauth/restv1/id",
    "introspection_endpoint": "https://ce-dev4.gluu.org/oxauth/restv1/introspection",
    "scopes_supported": [
        "permission",
        "clientinfo",
        "email",
        "user_name",
        "sub",
        "org_name",
        "address",
        "openid",
        "test_scope1",
        "work_phone",
        "phone",
        "profile",
        "mobile_phone",
        "test"
    ],
    "response_types_supported": [
        "code",
        "code id_token",
        "code id_token token",
        "id_token",
        "id_token token",
        "token",
        "code token"
    ],
    "grant_types_supported": [
        "urn:ietf:params:oauth:grant-type:uma-ticket",
        "client_credentials",
        "refresh_token",
        "implicit",
        "password",
        "authorization_code"
    ],
    "acr_values_supported": [
        "super_gluu",
        "u2f",
        "otp",
        "basic",
        "auth_ldap_server"
    ],
    "auth_level_mapping": {
        "-1": ["auth_ldap_server"],
        "50": ["otp"],
        "100": ["basic"],
        "10": ["u2f"],
        "15": ["super_gluu"]
    },
    "subject_types_supported": [
        "public",
        "pairwise"
    ],
    "userinfo_signing_alg_values_supported": [
        "HS256",
        "HS384",
        "HS512",
        "RS256",
        "RS384",
        "RS512",
        "ES256",
        "ES384",
        "ES512"
    ],
    "userinfo_encryption_alg_values_supported": [
        "RSA1_5",
        "RSA-OAEP",
        "A128KW",
        "A256KW"
    ],
    "userinfo_encryption_enc_values_supported": [
        "RSA1_5",
        "RSA-OAEP",
        "A128KW",
        "A256KW"
    ],
    "id_token_signing_alg_values_supported": [
        "none",
        "HS256",
        "HS384",
        "HS512",
        "RS256",
        "RS384",
        "RS512",
        "ES256",
        "ES384",
        "ES512"
    ],
    "id_token_encryption_alg_values_supported": [
        "RSA1_5",
        "RSA-OAEP",
        "A128KW",
        "A256KW"
    ],
    "id_token_encryption_enc_values_supported": [
        "A128CBC+HS256",
        "A256CBC+HS512",
        "A128GCM",
        "A256GCM"
    ],
    "request_object_signing_alg_values_supported": [
        "none",
        "HS256",
        "HS384",
        "HS512",
        "RS256",
        "RS384",
        "RS512",
        "ES256",
        "ES384",
        "ES512"
    ],
    "request_object_encryption_alg_values_supported": [
        "RSA1_5",
        "RSA-OAEP",
        "A128KW",
        "A256KW"
    ],
    "request_object_encryption_enc_values_supported": [
        "A128CBC+HS256",
        "A256CBC+HS512",
        "A128GCM",
        "A256GCM"
    ],
    "token_endpoint_auth_methods_supported": [
        "client_secret_basic",
        "client_secret_post",
        "client_secret_jwt",
        "private_key_jwt"
    ],
    "token_endpoint_auth_signing_alg_values_supported": [
        "HS256",
        "HS384",
        "HS512",
        "RS256",
        "RS384",
        "RS512",
        "ES256",
        "ES384",
        "ES512"
    ],
    "display_values_supported": [
        "page",
        "popup"
    ],
    "claim_types_supported": ["normal"],
    "claims_supported": [
        "birthdate",
        "country",
        "name",
        "email",
        "email_verified",
        "given_name",
        "gender",
        "inum",
        "family_name",
        "updated_at",
        "locale",
        "member_of",
        "middle_name",
        "nickname",
        "oxAuthAppType",
        "oxAuthIdTokenSignedResponseAlg",
        "oxAuthRedirectURI",
        "oxAuthScope",
        "phone_number_verified",
        "picture",
        "preferred_username",
        "profile",
        "zoneinfo",
        "user_name",
        "website"
    ],
    "service_documentation": "http://gluu.org/docs",
    "claims_locales_supported": ["en"],
    "ui_locales_supported": [
        "en",
        "es"
    ],
    "scope_to_claims_mapping": [
        {"permission": []},
        {"uma_protection": []},
        {"clientinfo": [
            "name",
            "inum",
            "oxAuthAppType",
            "oxAuthIdTokenSignedResponseAlg",
            "oxAuthRedirectURI",
            "oxAuthScope"
        ]},
        {"email": [
            "email_verified",
            "email"
        ]},
        {"user_name": ["user_name"]},
        {"sub": []},
        {"org_name": []},
        {"address": [
            "formatted",
            "postal_code",
            "street_address",
            "locality",
            "country",
            "region"
        ]},
        {"openid": []},
        {"test_scope1": []},
        {"work_phone": []},
        {"phone": [
            "phone_number_verified",
            "phone_number"
        ]},
        {"profile": [
            "name",
            "family_name",
            "given_name",
            "middle_name",
            "nickname",
            "preferred_username",
            "profile",
            "picture",
            "website",
            "gender",
            "birthdate",
            "zoneinfo",
            "locale",
            "updated_at"
        ]},
        {"mobile_phone": ["phone_mobile_number"]},
        {"test": ["member_of"]}
    ],
    "claims_parameter_supported": true,
    "request_parameter_supported": true,
    "request_uri_parameter_supported": true,
    "require_request_uri_registration": false,
    "op_policy_uri": "http://ox.gluu.org/doku.php?id=oxauth:policy",
    "op_tos_uri": "http://ox.gluu.org/doku.php?id=oxauth:tos",
    "frontchannel_logout_supported": true,
    "frontchannel_logout_session_supported": true
}


#######################################################
TEST: OC5:FeatureTest-Verifies Correct at hash when Implicit Flow Used
#######################################################
-------------------------------------------------------
REQUEST:
-------------------------------------------------------
POST /oxauth/restv1/register HTTP/1.1
Content-Type: application/json
Accept: application/json
Host: ce-dev4.gluu.org

{
    "redirect_uris": [
        "https://ce-dev4.gluu.org/oxauth-rp/home.htm",
        "https://client.example.com/cb",
        "https://client.example.com/cb1",
        "https://client.example.com/cb2"
    ],
    "response_types": [
        "token",
        "id_token"
    ],
    "application_type": "web",
    "client_name": "oxAuth test app",
    "sector_identifier_uri": "https://ce-dev4.gluu.org/oxauth/sectoridentifier/@!38D4.410C.1D43.8932!0001!37F2.B744!0012!D426.70FD"
}

-------------------------------------------------------
RESPONSE:
-------------------------------------------------------
HTTP/1.1 200
Cache-Control: no-store
Connection: Keep-Alive
Content-Length: 1340
Content-Type: application/json
Date: Thu, 05 Jul 2018 18:57:31 GMT
Keep-Alive: timeout=5, max=100
Pragma: no-cache
Server: Jetty(9.4.9.v20180320)
Strict-Transport-Security: max-age=31536000; includeSubDomains
X-Content-Type-Options: nosniff
X-Xss-Protection: 1; mode=block

{
    "client_id": "@!38D4.410C.1D43.8932!0001!37F2.B744!0008!2CFF.CE5F.FE6A.F638",
    "client_secret": "146c1e6e-11a5-439d-ab16-52b6d42cab5e",
    "registration_access_token": "e3fb9e13-e050-4129-a6bf-7b352db95ecb",
    "registration_client_uri": "https://ce-dev4.gluu.org/oxauth/restv1/register?client_id=@!38D4.410C.1D43.8932!0001!37F2.B744!0008!2CFF.CE5F.FE6A.F638",
    "client_id_issued_at": 1530817051,
    "client_secret_expires_at": 1530903451,
    "redirect_uris": [
        "https://client.example.com/cb2",
        "https://client.example.com/cb1",
        "https://client.example.com/cb",
        "https://ce-dev4.gluu.org/oxauth-rp/home.htm"
    ],
    "response_types": [
        "id_token",
        "token"
    ],
    "grant_types": ["implicit"],
    "application_type": "web",
    "client_name": "oxAuth test app",
    "sector_identifier_uri": "https://ce-dev4.gluu.org/oxauth/sectoridentifier/@!38D4.410C.1D43.8932!0001!37F2.B744!0012!D426.70FD",
    "subject_type": "pairwise",
    "id_token_signed_response_alg": "RS256",
    "token_endpoint_auth_method": "client_secret_basic",
    "require_auth_time": false,
    "frontchannel_logout_session_required": false,
    "scope": "permission uma_protection clientinfo email user_name sub org_name address openid test_scope1 work_phone phone profile test",
    "claims": ""
}

authenticateResourceOwnerAndGrantAccess: Cleaning cookies
authenticateResourceOwnerAndGrantAccess: authorizationRequestUrl:https://ce-dev4.gluu.org/oxauth/restv1/authorize?response_type=token+id_token&client_id=%40%2138D4.410C.1D43.8932%210001%2137F2.B744%210008%212CFF.CE5F.FE6A.F638&scope=openid+profile+address+email&redirect_uri=https%3A%2F%2Fce-dev4.gluu.org%2Foxauth-rp%2Fhome.htm&state=f7e40f6b-2aed-449b-8a82-cc911e3697cb&nonce=a607cef2-0e33-4202-979d-eb678df4df08
14:57:52.726 [main] ERROR com.gargoylesoftware.htmlunit.javascript.StrictErrorReporter - runtimeError: message=[An invalid or illegal selector was specified (selector: '*,:x' error: Invalid selector: :x).] sourceName=[https://ce-dev4.gluu.org/oxauth/js/jquery-1.12.4.min.js] line=[2] lineSource=[null] lineOffset=[0]
authenticateResourceOwnerAndGrantAccess: sessionState:e0eab286-109b-412c-a8dc-a07120d53199
-------------------------------------------------------
REQUEST:
-------------------------------------------------------
https://ce-dev4.gluu.org/oxauth/restv1/authorize?response_type=token+id_token&client_id=%40%2138D4.410C.1D43.8932%210001%2137F2.B744%210008%212CFF.CE5F.FE6A.F638&scope=openid+profile+address+email&redirect_uri=https%3A%2F%2Fce-dev4.gluu.org%2Foxauth-rp%2Fhome.htm&state=f7e40f6b-2aed-449b-8a82-cc911e3697cb&nonce=a607cef2-0e33-4202-979d-eb678df4df08

-------------------------------------------------------
RESPONSE:
-------------------------------------------------------
HTTP/1.1 302 Found
Location: https://ce-dev4.gluu.org/oxauth-rp/home.htm#access_token=04eb6d6f-dd36-4513-bc67-6967e988ca8b&scope=address+openid+profile+email&id_token=eyJraWQiOiI4NzE2OGJjMS1lNTU4LTQxNjktOGRkMS05ZmJkNDUxZGU1ZDciLCJ0eXAiOiJKV1QiLCJhbGciOiJSUzI1NiJ9.eyJpc3MiOiJodHRwczovL2NlLWRldjQuZ2x1dS5vcmciLCJhdWQiOiJAITM4RDQuNDEwQy4xRDQzLjg5MzIhMDAwMSEzN0YyLkI3NDQhMDAwOCEyQ0ZGLkNFNUYuRkU2QS5GNjM4IiwiZXhwIjoxNTMwODIwNjUyLCJpYXQiOjE1MzA4MTcwNTIsIm5vbmNlIjoiYTYwN2NlZjItMGUzMy00MjAyLTk3OWQtZWI2NzhkZjRkZjA4IiwiYXV0aF90aW1lIjoxNTMwODE3MDUyLCJhdF9oYXNoIjoiUkUxdzAzbVNZLVRrelRxWG9sekEtUSIsIm94T3BlbklEQ29ubmVjdFZlcnNpb24iOiJvcGVuaWRjb25uZWN0LTEuMCIsInN1YiI6Ijc1dVRvMXFYak1Ub19xbWZjUFdidjZPNUt1c0tPUzdGTHF1dlBMbUFxT1UifQ.IJTZAA8PQiOhmhJ9GLODIDlAcibglpRUFwnqKJovyRscsNZ8iBLVsHospHmxIQSJc3P_J0hxlmBSLO4XuYb4On97YtI_wL9Fd2N3z-pUjuaza56pt_8imQ-pkgjICI8-gGI-dRP9BHifw-CMYKNvvyIH7ma20AbKn93N6_UC_p9fMYgDHNAb4iMlWKV4xDP9N5Pq1VhLw5Q8KUAoywdRLycjFIEpJXVYHB-d-XDxG6AOYCX0mqggZ6lUemS4n2PRYdbm6cdhhlBxrIMMf2qdI7WAa8tcPdyj35ssLP0Rh9pjdyVrM7svjH2XkEYCG4iMWkgm93LCVX6VRYL4H8MYXA&session_id=2b00d28b-0c1a-431d-ba2b-740d17029f98&state=f7e40f6b-2aed-449b-8a82-cc911e3697cb&token_type=bearer&session_state=e0eab286-109b-412c-a8dc-a07120d53199&expires_in=299

#######################################################
TEST: OpenID Connect Discovery
#######################################################
-------------------------------------------------------
REQUEST:
-------------------------------------------------------
GET /.well-known/webfinger?resource=acct%3Atest_user%40ce-dev4.gluu.org&rel=http%3A%2F%2Fopenid.net%2Fspecs%2Fconnect%2F1.0%2Fissuer HTTP/1.1
Host: ce-dev4.gluu.org

-------------------------------------------------------
RESPONSE:
-------------------------------------------------------
HTTP/1.1 200
Connection: Keep-Alive
Content-Length: 181
Content-Type: application/jrd+json;charset=iso-8859-1
Date: Thu, 05 Jul 2018 18:57:32 GMT
Keep-Alive: timeout=5, max=100
Server: Jetty(9.4.9.v20180320)
Strict-Transport-Security: max-age=31536000; includeSubDomains
X-Content-Type-Options: nosniff
X-Xss-Protection: 1; mode=block

{
    "subject": "acct:test_user@ce-dev4.gluu.org",
    "links": [{
        "rel": "http://openid.net/specs/connect/1.0/issuer",
        "href": "https://ce-dev4.gluu.org"
    }]
}


OpenID Connect Configuration
-------------------------------------------------------
REQUEST:
-------------------------------------------------------
GET /.well-known/openid-configuration HTTP/1.1
Host: ce-dev4.gluu.org

-------------------------------------------------------
RESPONSE:
-------------------------------------------------------
HTTP/1.1 200
Connection: Keep-Alive
Content-Length: 6342
Content-Type: application/json
Date: Thu, 05 Jul 2018 18:57:32 GMT
Keep-Alive: timeout=5, max=100
Server: Jetty(9.4.9.v20180320)
Strict-Transport-Security: max-age=31536000; includeSubDomains
X-Content-Type-Options: nosniff
X-Xss-Protection: 1; mode=block

{
    "issuer": "https://ce-dev4.gluu.org",
    "authorization_endpoint": "https://ce-dev4.gluu.org/oxauth/restv1/authorize",
    "token_endpoint": "https://ce-dev4.gluu.org/oxauth/restv1/token",
    "userinfo_endpoint": "https://ce-dev4.gluu.org/oxauth/restv1/userinfo",
    "clientinfo_endpoint": "https://ce-dev4.gluu.org/oxauth/restv1/clientinfo",
    "check_session_iframe": "https://ce-dev4.gluu.org/oxauth/opiframe",
    "end_session_endpoint": "https://ce-dev4.gluu.org/oxauth/restv1/end_session",
    "jwks_uri": "https://ce-dev4.gluu.org/oxauth/restv1/jwks",
    "registration_endpoint": "https://ce-dev4.gluu.org/oxauth/restv1/register",
    "id_generation_endpoint": "https://ce-dev4.gluu.org/oxauth/restv1/id",
    "introspection_endpoint": "https://ce-dev4.gluu.org/oxauth/restv1/introspection",
    "scopes_supported": [
        "permission",
        "clientinfo",
        "email",
        "user_name",
        "sub",
        "org_name",
        "address",
        "openid",
        "test_scope1",
        "work_phone",
        "phone",
        "profile",
        "mobile_phone",
        "test"
    ],
    "response_types_supported": [
        "code",
        "code id_token",
        "code id_token token",
        "id_token",
        "id_token token",
        "token",
        "code token"
    ],
    "grant_types_supported": [
        "urn:ietf:params:oauth:grant-type:uma-ticket",
        "client_credentials",
        "refresh_token",
        "implicit",
        "password",
        "authorization_code"
    ],
    "acr_values_supported": [
        "super_gluu",
        "u2f",
        "otp",
        "basic",
        "auth_ldap_server"
    ],
    "auth_level_mapping": {
        "-1": ["auth_ldap_server"],
        "50": ["otp"],
        "100": ["basic"],
        "10": ["u2f"],
        "15": ["super_gluu"]
    },
    "subject_types_supported": [
        "public",
        "pairwise"
    ],
    "userinfo_signing_alg_values_supported": [
        "HS256",
        "HS384",
        "HS512",
        "RS256",
        "RS384",
        "RS512",
        "ES256",
        "ES384",
        "ES512"
    ],
    "userinfo_encryption_alg_values_supported": [
        "RSA1_5",
        "RSA-OAEP",
        "A128KW",
        "A256KW"
    ],
    "userinfo_encryption_enc_values_supported": [
        "RSA1_5",
        "RSA-OAEP",
        "A128KW",
        "A256KW"
    ],
    "id_token_signing_alg_values_supported": [
        "none",
        "HS256",
        "HS384",
        "HS512",
        "RS256",
        "RS384",
        "RS512",
        "ES256",
        "ES384",
        "ES512"
    ],
    "id_token_encryption_alg_values_supported": [
        "RSA1_5",
        "RSA-OAEP",
        "A128KW",
        "A256KW"
    ],
    "id_token_encryption_enc_values_supported": [
        "A128CBC+HS256",
        "A256CBC+HS512",
        "A128GCM",
        "A256GCM"
    ],
    "request_object_signing_alg_values_supported": [
        "none",
        "HS256",
        "HS384",
        "HS512",
        "RS256",
        "RS384",
        "RS512",
        "ES256",
        "ES384",
        "ES512"
    ],
    "request_object_encryption_alg_values_supported": [
        "RSA1_5",
        "RSA-OAEP",
        "A128KW",
        "A256KW"
    ],
    "request_object_encryption_enc_values_supported": [
        "A128CBC+HS256",
        "A256CBC+HS512",
        "A128GCM",
        "A256GCM"
    ],
    "token_endpoint_auth_methods_supported": [
        "client_secret_basic",
        "client_secret_post",
        "client_secret_jwt",
        "private_key_jwt"
    ],
    "token_endpoint_auth_signing_alg_values_supported": [
        "HS256",
        "HS384",
        "HS512",
        "RS256",
        "RS384",
        "RS512",
        "ES256",
        "ES384",
        "ES512"
    ],
    "display_values_supported": [
        "page",
        "popup"
    ],
    "claim_types_supported": ["normal"],
    "claims_supported": [
        "birthdate",
        "country",
        "name",
        "email",
        "email_verified",
        "given_name",
        "gender",
        "inum",
        "family_name",
        "updated_at",
        "locale",
        "member_of",
        "middle_name",
        "nickname",
        "oxAuthAppType",
        "oxAuthIdTokenSignedResponseAlg",
        "oxAuthRedirectURI",
        "oxAuthScope",
        "phone_number_verified",
        "picture",
        "preferred_username",
        "profile",
        "zoneinfo",
        "user_name",
        "website"
    ],
    "service_documentation": "http://gluu.org/docs",
    "claims_locales_supported": ["en"],
    "ui_locales_supported": [
        "en",
        "es"
    ],
    "scope_to_claims_mapping": [
        {"permission": []},
        {"uma_protection": []},
        {"clientinfo": [
            "name",
            "inum",
            "oxAuthAppType",
            "oxAuthIdTokenSignedResponseAlg",
            "oxAuthRedirectURI",
            "oxAuthScope"
        ]},
        {"email": [
            "email_verified",
            "email"
        ]},
        {"user_name": ["user_name"]},
        {"sub": []},
        {"org_name": []},
        {"address": [
            "formatted",
            "postal_code",
            "street_address",
            "locality",
            "country",
            "region"
        ]},
        {"openid": []},
        {"test_scope1": []},
        {"work_phone": []},
        {"phone": [
            "phone_number_verified",
            "phone_number"
        ]},
        {"profile": [
            "name",
            "family_name",
            "given_name",
            "middle_name",
            "nickname",
            "preferred_username",
            "profile",
            "picture",
            "website",
            "gender",
            "birthdate",
            "zoneinfo",
            "locale",
            "updated_at"
        ]},
        {"mobile_phone": ["phone_mobile_number"]},
        {"test": ["member_of"]}
    ],
    "claims_parameter_supported": true,
    "request_parameter_supported": true,
    "request_uri_parameter_supported": true,
    "require_request_uri_registration": false,
    "op_policy_uri": "http://ox.gluu.org/doku.php?id=oxauth:policy",
    "op_tos_uri": "http://ox.gluu.org/doku.php?id=oxauth:tos",
    "frontchannel_logout_supported": true,
    "frontchannel_logout_session_supported": true
}


#######################################################
TEST: OC5:FeatureTest-Verifies Correct c hash when Code Flow Used
#######################################################
-------------------------------------------------------
REQUEST:
-------------------------------------------------------
POST /oxauth/restv1/register HTTP/1.1
Content-Type: application/json
Accept: application/json
Host: ce-dev4.gluu.org

{
    "redirect_uris": [
        "https://ce-dev4.gluu.org/oxauth-rp/home.htm",
        "https://client.example.com/cb",
        "https://client.example.com/cb1",
        "https://client.example.com/cb2"
    ],
    "response_types": [
        "code",
        "id_token"
    ],
    "application_type": "web",
    "client_name": "oxAuth test app",
    "sector_identifier_uri": "https://ce-dev4.gluu.org/oxauth/sectoridentifier/@!38D4.410C.1D43.8932!0001!37F2.B744!0012!D426.70FD"
}

-------------------------------------------------------
RESPONSE:
-------------------------------------------------------
HTTP/1.1 200
Cache-Control: no-store
Connection: Keep-Alive
Content-Length: 1425
Content-Type: application/json
Date: Thu, 05 Jul 2018 18:57:32 GMT
Keep-Alive: timeout=5, max=100
Pragma: no-cache
Server: Jetty(9.4.9.v20180320)
Strict-Transport-Security: max-age=31536000; includeSubDomains
X-Content-Type-Options: nosniff
X-Xss-Protection: 1; mode=block

{
    "client_id": "@!38D4.410C.1D43.8932!0001!37F2.B744!0008!F28A.2492.475B.C6FD",
    "client_secret": "bd22dddf-42f5-431f-8ead-c798b6215e9a",
    "registration_access_token": "c6c93ff3-81e4-4240-ba78-ce9f287e5f28",
    "registration_client_uri": "https://ce-dev4.gluu.org/oxauth/restv1/register?client_id=@!38D4.410C.1D43.8932!0001!37F2.B744!0008!F28A.2492.475B.C6FD",
    "client_id_issued_at": 1530817052,
    "client_secret_expires_at": 1530903452,
    "redirect_uris": [
        "https://client.example.com/cb2",
        "https://client.example.com/cb1",
        "https://client.example.com/cb",
        "https://ce-dev4.gluu.org/oxauth-rp/home.htm"
    ],
    "response_types": [
        "code",
        "id_token",
        "token"
    ],
    "grant_types": [
        "refresh_token",
        "implicit",
        "authorization_code"
    ],
    "application_type": "web",
    "client_name": "oxAuth test app",
    "sector_identifier_uri": "https://ce-dev4.gluu.org/oxauth/sectoridentifier/@!38D4.410C.1D43.8932!0001!37F2.B744!0012!D426.70FD",
    "subject_type": "pairwise",
    "id_token_signed_response_alg": "RS256",
    "token_endpoint_auth_method": "client_secret_basic",
    "require_auth_time": false,
    "frontchannel_logout_session_required": false,
    "scope": "permission uma_protection clientinfo email user_name sub org_name address openid test_scope1 work_phone phone profile test",
    "claims": ""
}

authenticateResourceOwnerAndGrantAccess: Cleaning cookies
authenticateResourceOwnerAndGrantAccess: authorizationRequestUrl:https://ce-dev4.gluu.org/oxauth/restv1/authorize?response_type=code+id_token&client_id=%40%2138D4.410C.1D43.8932%210001%2137F2.B744%210008%21F28A.2492.475B.C6FD&scope=openid+profile+address+email&redirect_uri=https%3A%2F%2Fce-dev4.gluu.org%2Foxauth-rp%2Fhome.htm&state=0b480666-6c39-41ad-bf82-fad91542fcb5&nonce=9732aa8c-e90e-4492-a1e9-098cad116617
14:57:54.062 [main] ERROR com.gargoylesoftware.htmlunit.javascript.StrictErrorReporter - runtimeError: message=[An invalid or illegal selector was specified (selector: '*,:x' error: Invalid selector: :x).] sourceName=[https://ce-dev4.gluu.org/oxauth/js/jquery-1.12.4.min.js] line=[2] lineSource=[null] lineOffset=[0]
authenticateResourceOwnerAndGrantAccess: sessionState:d5ebfb10-87b6-4342-9ff8-f86c731237b0
-------------------------------------------------------
REQUEST:
-------------------------------------------------------
https://ce-dev4.gluu.org/oxauth/restv1/authorize?response_type=code+id_token&client_id=%40%2138D4.410C.1D43.8932%210001%2137F2.B744%210008%21F28A.2492.475B.C6FD&scope=openid+profile+address+email&redirect_uri=https%3A%2F%2Fce-dev4.gluu.org%2Foxauth-rp%2Fhome.htm&state=0b480666-6c39-41ad-bf82-fad91542fcb5&nonce=9732aa8c-e90e-4492-a1e9-098cad116617

-------------------------------------------------------
RESPONSE:
-------------------------------------------------------
HTTP/1.1 302 Found
Location: https://ce-dev4.gluu.org/oxauth-rp/home.htm#code=9fb00b24-590a-4544-8837-4d2b7561d3bd&scope=address+openid+profile+email&id_token=eyJraWQiOiI4NzE2OGJjMS1lNTU4LTQxNjktOGRkMS05ZmJkNDUxZGU1ZDciLCJ0eXAiOiJKV1QiLCJhbGciOiJSUzI1NiJ9.eyJpc3MiOiJodHRwczovL2NlLWRldjQuZ2x1dS5vcmciLCJhdWQiOiJAITM4RDQuNDEwQy4xRDQzLjg5MzIhMDAwMSEzN0YyLkI3NDQhMDAwOCFGMjhBLjI0OTIuNDc1Qi5DNkZEIiwiZXhwIjoxNTMwODIwNjUzLCJpYXQiOjE1MzA4MTcwNTMsIm5vbmNlIjoiOTczMmFhOGMtZTkwZS00NDkyLWExZTktMDk4Y2FkMTE2NjE3IiwiYXV0aF90aW1lIjoxNTMwODE3MDUzLCJjX2hhc2giOiJ3NFNPVl9Kdlphc2VSOTlqZmR1LVRnIiwib3hPcGVuSURDb25uZWN0VmVyc2lvbiI6Im9wZW5pZGNvbm5lY3QtMS4wIiwic3ViIjoic1I2YVhpZVoyaVl1MVVwakRFRUlpNGdBSWRyenFNUnpEd05JdlpwRWp2QSJ9.jQy3seGkpx0SaIMIW6IkU3MR2_yWMfcDwt0l1HlrR8SbVCv7ljHRKOFpfHyZNmnlofLsp-CMlA5FfUa_jA7DALER-TWrDYykbix7PNo7o1HYb7e3eXh6ZSmzxpbiCgcAbxaL65FLT2oqhwcYf67vnkKsMwCGckXynys3gNh6g3kaN8qS-Bzd_bZ6fMGI_cicV-zJSqh2g0Lj49w1MednlgjF1213YqntvkkiZ6nTIPTUyjRJxW-awBtZLxTq5wbmlELxq9xIDSmkao4nEC55uFm-8qNa4LzdR2mUxnZHjYmqCPHgXD40bFQI-felc3YicedZpyl9sU7mtl0lYpq_Xw&session_id=b24aa348-1188-4f20-89cd-cef3195be56d&state=0b480666-6c39-41ad-bf82-fad91542fcb5&session_state=d5ebfb10-87b6-4342-9ff8-f86c731237b0

Tests run: 660, Failures: 38, Errors: 0, Skipped: 0, Time elapsed: 705.552 sec <<< FAILURE! - in TestSuite
authorizationRequestObjectWithMultivaluedClaimAlgA128KWEncA128GCM(org.xdi.oxauth.ws.rs.MultivaluedClaims)  Time elapsed: 0.401 sec  <<< FAILURE!
org.openqa.selenium.NoSuchElementException: 
Unable to locate element with name: loginForm:username
For documentation on this error, please visit: http://seleniumhq.org/exceptions/no_such_element.html
Build info: version: '2.53.1', revision: 'a36b8b1cd5757287168e54b817830adce9b0158d', time: '2016-06-30 19:26:09'
System info: host: 'ox.gluu.org', ip: '162.243.99.240', os.name: 'Linux', os.arch: 'amd64', os.version: '3.10.0-229.20.1.el7.x86_64', java.version: '1.8.0_121'
Driver info: driver.version: HtmlUnitDriver
	at org.openqa.selenium.htmlunit.HtmlUnitDriver.findElementByName(HtmlUnitDriver.java:1091)
	at org.openqa.selenium.By$ByName.findElement(By.java:303)
	at org.openqa.selenium.htmlunit.HtmlUnitDriver$5.call(HtmlUnitDriver.java:1707)
	at org.openqa.selenium.htmlunit.HtmlUnitDriver$5.call(HtmlUnitDriver.java:1703)
	at org.openqa.selenium.htmlunit.HtmlUnitDriver.implicitlyWaitFor(HtmlUnitDriver.java:1357)
	at org.openqa.selenium.htmlunit.HtmlUnitDriver.findElement(HtmlUnitDriver.java:1703)
	at org.openqa.selenium.htmlunit.HtmlUnitDriver.findElement(HtmlUnitDriver.java:595)
	at org.xdi.oxauth.BaseTest.processAuthentication(BaseTest.java:341)
	at org.xdi.oxauth.BaseTest.authenticateResourceOwnerAndGrantAccess(BaseTest.java:283)
	at org.xdi.oxauth.BaseTest.authenticateResourceOwnerAndGrantAccess(BaseTest.java:272)
	at org.xdi.oxauth.BaseTest.authenticateResourceOwnerAndGrantAccess(BaseTest.java:262)
	at org.xdi.oxauth.BaseTest.authenticateResourceOwnerAndGrantAccess(BaseTest.java:253)
	at org.xdi.oxauth.ws.rs.MultivaluedClaims.authorizationRequestObjectWithMultivaluedClaimAlgA128KWEncA128GCM(MultivaluedClaims.java:2446)
	at sun.reflect.NativeMethodAccessorImpl.invoke0(Native Method)
	at sun.reflect.NativeMethodAccessorImpl.invoke(NativeMethodAccessorImpl.java:62)
	at sun.reflect.DelegatingMethodAccessorImpl.invoke(DelegatingMethodAccessorImpl.java:43)
	at java.lang.reflect.Method.invoke(Method.java:498)
	at org.testng.internal.MethodInvocationHelper.invokeMethod(MethodInvocationHelper.java:108)
	at org.testng.internal.Invoker.invokeMethod(Invoker.java:661)
	at org.testng.internal.Invoker.invokeTestMethod(Invoker.java:869)
	at org.testng.internal.Invoker.invokeTestMethods(Invoker.java:1193)
	at org.testng.internal.TestMethodWorker.invokeTestMethods(TestMethodWorker.java:126)
	at org.testng.internal.TestMethodWorker.run(TestMethodWorker.java:109)
	at org.testng.TestRunner.privateRun(TestRunner.java:744)
	at org.testng.TestRunner.run(TestRunner.java:602)
	at org.testng.SuiteRunner.runTest(SuiteRunner.java:380)
	at org.testng.SuiteRunner.runSequentially(SuiteRunner.java:375)
	at org.testng.SuiteRunner.privateRun(SuiteRunner.java:340)
	at org.testng.SuiteRunner.run(SuiteRunner.java:289)
	at org.testng.SuiteRunnerWorker.runSuite(SuiteRunnerWorker.java:52)
	at org.testng.SuiteRunnerWorker.run(SuiteRunnerWorker.java:86)
	at org.testng.TestNG.runSuitesSequentially(TestNG.java:1301)
	at org.testng.TestNG.runSuitesLocally(TestNG.java:1226)
	at org.testng.TestNG.runSuites(TestNG.java:1144)
	at org.testng.TestNG.run(TestNG.java:1115)
	at org.apache.maven.surefire.testng.TestNGExecutor.run(TestNGExecutor.java:281)
	at org.apache.maven.surefire.testng.TestNGXmlTestSuite.execute(TestNGXmlTestSuite.java:75)
	at org.apache.maven.surefire.testng.TestNGProvider.invoke(TestNGProvider.java:121)
	at org.apache.maven.surefire.booter.ForkedBooter.invokeProviderInSameClassLoader(ForkedBooter.java:290)
	at org.apache.maven.surefire.booter.ForkedBooter.runSuitesInProcess(ForkedBooter.java:242)
	at org.apache.maven.surefire.booter.ForkedBooter.main(ForkedBooter.java:121)

authorizationRequestObjectWithMultivaluedClaimAlgA256KWEncA256GCM(org.xdi.oxauth.ws.rs.MultivaluedClaims)  Time elapsed: 0.382 sec  <<< FAILURE!
org.openqa.selenium.NoSuchElementException: 
Unable to locate element with name: loginForm:username
For documentation on this error, please visit: http://seleniumhq.org/exceptions/no_such_element.html
Build info: version: '2.53.1', revision: 'a36b8b1cd5757287168e54b817830adce9b0158d', time: '2016-06-30 19:26:09'
System info: host: 'ox.gluu.org', ip: '162.243.99.240', os.name: 'Linux', os.arch: 'amd64', os.version: '3.10.0-229.20.1.el7.x86_64', java.version: '1.8.0_121'
Driver info: driver.version: HtmlUnitDriver
	at org.openqa.selenium.htmlunit.HtmlUnitDriver.findElementByName(HtmlUnitDriver.java:1091)
	at org.openqa.selenium.By$ByName.findElement(By.java:303)
	at org.openqa.selenium.htmlunit.HtmlUnitDriver$5.call(HtmlUnitDriver.java:1707)
	at org.openqa.selenium.htmlunit.HtmlUnitDriver$5.call(HtmlUnitDriver.java:1703)
	at org.openqa.selenium.htmlunit.HtmlUnitDriver.implicitlyWaitFor(HtmlUnitDriver.java:1357)
	at org.openqa.selenium.htmlunit.HtmlUnitDriver.findElement(HtmlUnitDriver.java:1703)
	at org.openqa.selenium.htmlunit.HtmlUnitDriver.findElement(HtmlUnitDriver.java:595)
	at org.xdi.oxauth.BaseTest.processAuthentication(BaseTest.java:341)
	at org.xdi.oxauth.BaseTest.authenticateResourceOwnerAndGrantAccess(BaseTest.java:283)
	at org.xdi.oxauth.BaseTest.authenticateResourceOwnerAndGrantAccess(BaseTest.java:272)
	at org.xdi.oxauth.BaseTest.authenticateResourceOwnerAndGrantAccess(BaseTest.java:262)
	at org.xdi.oxauth.BaseTest.authenticateResourceOwnerAndGrantAccess(BaseTest.java:253)
	at org.xdi.oxauth.ws.rs.MultivaluedClaims.authorizationRequestObjectWithMultivaluedClaimAlgA256KWEncA256GCM(MultivaluedClaims.java:2544)
	at sun.reflect.NativeMethodAccessorImpl.invoke0(Native Method)
	at sun.reflect.NativeMethodAccessorImpl.invoke(NativeMethodAccessorImpl.java:62)
	at sun.reflect.DelegatingMethodAccessorImpl.invoke(DelegatingMethodAccessorImpl.java:43)
	at java.lang.reflect.Method.invoke(Method.java:498)
	at org.testng.internal.MethodInvocationHelper.invokeMethod(MethodInvocationHelper.java:108)
	at org.testng.internal.Invoker.invokeMethod(Invoker.java:661)
	at org.testng.internal.Invoker.invokeTestMethod(Invoker.java:869)
	at org.testng.internal.Invoker.invokeTestMethods(Invoker.java:1193)
	at org.testng.internal.TestMethodWorker.invokeTestMethods(TestMethodWorker.java:126)
	at org.testng.internal.TestMethodWorker.run(TestMethodWorker.java:109)
	at org.testng.TestRunner.privateRun(TestRunner.java:744)
	at org.testng.TestRunner.run(TestRunner.java:602)
	at org.testng.SuiteRunner.runTest(SuiteRunner.java:380)
	at org.testng.SuiteRunner.runSequentially(SuiteRunner.java:375)
	at org.testng.SuiteRunner.privateRun(SuiteRunner.java:340)
	at org.testng.SuiteRunner.run(SuiteRunner.java:289)
	at org.testng.SuiteRunnerWorker.runSuite(SuiteRunnerWorker.java:52)
	at org.testng.SuiteRunnerWorker.run(SuiteRunnerWorker.java:86)
	at org.testng.TestNG.runSuitesSequentially(TestNG.java:1301)
	at org.testng.TestNG.runSuitesLocally(TestNG.java:1226)
	at org.testng.TestNG.runSuites(TestNG.java:1144)
	at org.testng.TestNG.run(TestNG.java:1115)
	at org.apache.maven.surefire.testng.TestNGExecutor.run(TestNGExecutor.java:281)
	at org.apache.maven.surefire.testng.TestNGXmlTestSuite.execute(TestNGXmlTestSuite.java:75)
	at org.apache.maven.surefire.testng.TestNGProvider.invoke(TestNGProvider.java:121)
	at org.apache.maven.surefire.booter.ForkedBooter.invokeProviderInSameClassLoader(ForkedBooter.java:290)
	at org.apache.maven.surefire.booter.ForkedBooter.runSuitesInProcess(ForkedBooter.java:242)
	at org.apache.maven.surefire.booter.ForkedBooter.main(ForkedBooter.java:121)

authorizationRequestObjectWithMultivaluedClaimAlgRSA15EncA128CBCPLUSHS256(org.xdi.oxauth.ws.rs.MultivaluedClaims)  Time elapsed: 1.359 sec  <<< FAILURE!
java.lang.AssertionError: expected [true] but found [false]
	at org.testng.Assert.fail(Assert.java:93)
	at org.testng.Assert.failNotEquals(Assert.java:512)
	at org.testng.Assert.assertTrue(Assert.java:41)
	at org.testng.Assert.assertTrue(Assert.java:51)
	at org.xdi.oxauth.ws.rs.MultivaluedClaims.authorizationRequestObjectWithMultivaluedClaimAlgRSA15EncA128CBCPLUSHS256(MultivaluedClaims.java:2678)
	at sun.reflect.NativeMethodAccessorImpl.invoke0(Native Method)
	at sun.reflect.NativeMethodAccessorImpl.invoke(NativeMethodAccessorImpl.java:62)
	at sun.reflect.DelegatingMethodAccessorImpl.invoke(DelegatingMethodAccessorImpl.java:43)
	at java.lang.reflect.Method.invoke(Method.java:498)
	at org.testng.internal.MethodInvocationHelper.invokeMethod(MethodInvocationHelper.java:108)
	at org.testng.internal.Invoker.invokeMethod(Invoker.java:661)
	at org.testng.internal.Invoker.invokeTestMethod(Invoker.java:869)
	at org.testng.internal.Invoker.invokeTestMethods(Invoker.java:1193)
	at org.testng.internal.TestMethodWorker.invokeTestMethods(TestMethodWorker.java:126)
	at org.testng.internal.TestMethodWorker.run(TestMethodWorker.java:109)
	at org.testng.TestRunner.privateRun(TestRunner.java:744)
	at org.testng.TestRunner.run(TestRunner.java:602)
	at org.testng.SuiteRunner.runTest(SuiteRunner.java:380)
	at org.testng.SuiteRunner.runSequentially(SuiteRunner.java:375)
	at org.testng.SuiteRunner.privateRun(SuiteRunner.java:340)
	at org.testng.SuiteRunner.run(SuiteRunner.java:289)
	at org.testng.SuiteRunnerWorker.runSuite(SuiteRunnerWorker.java:52)
	at org.testng.SuiteRunnerWorker.run(SuiteRunnerWorker.java:86)
	at org.testng.TestNG.runSuitesSequentially(TestNG.java:1301)
	at org.testng.TestNG.runSuitesLocally(TestNG.java:1226)
	at org.testng.TestNG.runSuites(TestNG.java:1144)
	at org.testng.TestNG.run(TestNG.java:1115)
	at org.apache.maven.surefire.testng.TestNGExecutor.run(TestNGExecutor.java:281)
	at org.apache.maven.surefire.testng.TestNGXmlTestSuite.execute(TestNGXmlTestSuite.java:75)
	at org.apache.maven.surefire.testng.TestNGProvider.invoke(TestNGProvider.java:121)
	at org.apache.maven.surefire.booter.ForkedBooter.invokeProviderInSameClassLoader(ForkedBooter.java:290)
	at org.apache.maven.surefire.booter.ForkedBooter.runSuitesInProcess(ForkedBooter.java:242)
	at org.apache.maven.surefire.booter.ForkedBooter.main(ForkedBooter.java:121)

authorizationRequestObjectWithMultivaluedClaimAlgRSA15EncA256CBCPLUSHS512(org.xdi.oxauth.ws.rs.MultivaluedClaims)  Time elapsed: 1.297 sec  <<< FAILURE!
java.lang.AssertionError: expected [true] but found [false]
	at org.testng.Assert.fail(Assert.java:93)
	at org.testng.Assert.failNotEquals(Assert.java:512)
	at org.testng.Assert.assertTrue(Assert.java:41)
	at org.testng.Assert.assertTrue(Assert.java:51)
	at org.xdi.oxauth.ws.rs.MultivaluedClaims.authorizationRequestObjectWithMultivaluedClaimAlgRSA15EncA256CBCPLUSHS512(MultivaluedClaims.java:2788)
	at sun.reflect.NativeMethodAccessorImpl.invoke0(Native Method)
	at sun.reflect.NativeMethodAccessorImpl.invoke(NativeMethodAccessorImpl.java:62)
	at sun.reflect.DelegatingMethodAccessorImpl.invoke(DelegatingMethodAccessorImpl.java:43)
	at java.lang.reflect.Method.invoke(Method.java:498)
	at org.testng.internal.MethodInvocationHelper.invokeMethod(MethodInvocationHelper.java:108)
	at org.testng.internal.Invoker.invokeMethod(Invoker.java:661)
	at org.testng.internal.Invoker.invokeTestMethod(Invoker.java:869)
	at org.testng.internal.Invoker.invokeTestMethods(Invoker.java:1193)
	at org.testng.internal.TestMethodWorker.invokeTestMethods(TestMethodWorker.java:126)
	at org.testng.internal.TestMethodWorker.run(TestMethodWorker.java:109)
	at org.testng.TestRunner.privateRun(TestRunner.java:744)
	at org.testng.TestRunner.run(TestRunner.java:602)
	at org.testng.SuiteRunner.runTest(SuiteRunner.java:380)
	at org.testng.SuiteRunner.runSequentially(SuiteRunner.java:375)
	at org.testng.SuiteRunner.privateRun(SuiteRunner.java:340)
	at org.testng.SuiteRunner.run(SuiteRunner.java:289)
	at org.testng.SuiteRunnerWorker.runSuite(SuiteRunnerWorker.java:52)
	at org.testng.SuiteRunnerWorker.run(SuiteRunnerWorker.java:86)
	at org.testng.TestNG.runSuitesSequentially(TestNG.java:1301)
	at org.testng.TestNG.runSuitesLocally(TestNG.java:1226)
	at org.testng.TestNG.runSuites(TestNG.java:1144)
	at org.testng.TestNG.run(TestNG.java:1115)
	at org.apache.maven.surefire.testng.TestNGExecutor.run(TestNGExecutor.java:281)
	at org.apache.maven.surefire.testng.TestNGXmlTestSuite.execute(TestNGXmlTestSuite.java:75)
	at org.apache.maven.surefire.testng.TestNGProvider.invoke(TestNGProvider.java:121)
	at org.apache.maven.surefire.booter.ForkedBooter.invokeProviderInSameClassLoader(ForkedBooter.java:290)
	at org.apache.maven.surefire.booter.ForkedBooter.runSuitesInProcess(ForkedBooter.java:242)
	at org.apache.maven.surefire.booter.ForkedBooter.main(ForkedBooter.java:121)

authorizationRequestObjectWithMultivaluedClaimAlgRSAOAEPEncA256GCM(org.xdi.oxauth.ws.rs.MultivaluedClaims)  Time elapsed: 1.292 sec  <<< FAILURE!
java.lang.AssertionError: expected [true] but found [false]
	at org.testng.Assert.fail(Assert.java:93)
	at org.testng.Assert.failNotEquals(Assert.java:512)
	at org.testng.Assert.assertTrue(Assert.java:41)
	at org.testng.Assert.assertTrue(Assert.java:51)
	at org.xdi.oxauth.ws.rs.MultivaluedClaims.authorizationRequestObjectWithMultivaluedClaimAlgRSAOAEPEncA256GCM(MultivaluedClaims.java:2898)
	at sun.reflect.NativeMethodAccessorImpl.invoke0(Native Method)
	at sun.reflect.NativeMethodAccessorImpl.invoke(NativeMethodAccessorImpl.java:62)
	at sun.reflect.DelegatingMethodAccessorImpl.invoke(DelegatingMethodAccessorImpl.java:43)
	at java.lang.reflect.Method.invoke(Method.java:498)
	at org.testng.internal.MethodInvocationHelper.invokeMethod(MethodInvocationHelper.java:108)
	at org.testng.internal.Invoker.invokeMethod(Invoker.java:661)
	at org.testng.internal.Invoker.invokeTestMethod(Invoker.java:869)
	at org.testng.internal.Invoker.invokeTestMethods(Invoker.java:1193)
	at org.testng.internal.TestMethodWorker.invokeTestMethods(TestMethodWorker.java:126)
	at org.testng.internal.TestMethodWorker.run(TestMethodWorker.java:109)
	at org.testng.TestRunner.privateRun(TestRunner.java:744)
	at org.testng.TestRunner.run(TestRunner.java:602)
	at org.testng.SuiteRunner.runTest(SuiteRunner.java:380)
	at org.testng.SuiteRunner.runSequentially(SuiteRunner.java:375)
	at org.testng.SuiteRunner.privateRun(SuiteRunner.java:340)
	at org.testng.SuiteRunner.run(SuiteRunner.java:289)
	at org.testng.SuiteRunnerWorker.runSuite(SuiteRunnerWorker.java:52)
	at org.testng.SuiteRunnerWorker.run(SuiteRunnerWorker.java:86)
	at org.testng.TestNG.runSuitesSequentially(TestNG.java:1301)
	at org.testng.TestNG.runSuitesLocally(TestNG.java:1226)
	at org.testng.TestNG.runSuites(TestNG.java:1144)
	at org.testng.TestNG.run(TestNG.java:1115)
	at org.apache.maven.surefire.testng.TestNGExecutor.run(TestNGExecutor.java:281)
	at org.apache.maven.surefire.testng.TestNGXmlTestSuite.execute(TestNGXmlTestSuite.java:75)
	at org.apache.maven.surefire.testng.TestNGProvider.invoke(TestNGProvider.java:121)
	at org.apache.maven.surefire.booter.ForkedBooter.invokeProviderInSameClassLoader(ForkedBooter.java:290)
	at org.apache.maven.surefire.booter.ForkedBooter.runSuitesInProcess(ForkedBooter.java:242)
	at org.apache.maven.surefire.booter.ForkedBooter.main(ForkedBooter.java:121)

authorizationRequestObjectWithMultivaluedClaimES256(org.xdi.oxauth.ws.rs.MultivaluedClaims)  Time elapsed: 1.314 sec  <<< FAILURE!
java.lang.AssertionError: expected [true] but found [false]
	at org.testng.Assert.fail(Assert.java:93)
	at org.testng.Assert.failNotEquals(Assert.java:512)
	at org.testng.Assert.assertTrue(Assert.java:41)
	at org.testng.Assert.assertTrue(Assert.java:51)
	at org.xdi.oxauth.ws.rs.MultivaluedClaims.authorizationRequestObjectWithMultivaluedClaimES256(MultivaluedClaims.java:2159)
	at sun.reflect.NativeMethodAccessorImpl.invoke0(Native Method)
	at sun.reflect.NativeMethodAccessorImpl.invoke(NativeMethodAccessorImpl.java:62)
	at sun.reflect.DelegatingMethodAccessorImpl.invoke(DelegatingMethodAccessorImpl.java:43)
	at java.lang.reflect.Method.invoke(Method.java:498)
	at org.testng.internal.MethodInvocationHelper.invokeMethod(MethodInvocationHelper.java:108)
	at org.testng.internal.Invoker.invokeMethod(Invoker.java:661)
	at org.testng.internal.Invoker.invokeTestMethod(Invoker.java:869)
	at org.testng.internal.Invoker.invokeTestMethods(Invoker.java:1193)
	at org.testng.internal.TestMethodWorker.invokeTestMethods(TestMethodWorker.java:126)
	at org.testng.internal.TestMethodWorker.run(TestMethodWorker.java:109)
	at org.testng.TestRunner.privateRun(TestRunner.java:744)
	at org.testng.TestRunner.run(TestRunner.java:602)
	at org.testng.SuiteRunner.runTest(SuiteRunner.java:380)
	at org.testng.SuiteRunner.runSequentially(SuiteRunner.java:375)
	at org.testng.SuiteRunner.privateRun(SuiteRunner.java:340)
	at org.testng.SuiteRunner.run(SuiteRunner.java:289)
	at org.testng.SuiteRunnerWorker.runSuite(SuiteRunnerWorker.java:52)
	at org.testng.SuiteRunnerWorker.run(SuiteRunnerWorker.java:86)
	at org.testng.TestNG.runSuitesSequentially(TestNG.java:1301)
	at org.testng.TestNG.runSuitesLocally(TestNG.java:1226)
	at org.testng.TestNG.runSuites(TestNG.java:1144)
	at org.testng.TestNG.run(TestNG.java:1115)
	at org.apache.maven.surefire.testng.TestNGExecutor.run(TestNGExecutor.java:281)
	at org.apache.maven.surefire.testng.TestNGXmlTestSuite.execute(TestNGXmlTestSuite.java:75)
	at org.apache.maven.surefire.testng.TestNGProvider.invoke(TestNGProvider.java:121)
	at org.apache.maven.surefire.booter.ForkedBooter.invokeProviderInSameClassLoader(ForkedBooter.java:290)
	at org.apache.maven.surefire.booter.ForkedBooter.runSuitesInProcess(ForkedBooter.java:242)
	at org.apache.maven.surefire.booter.ForkedBooter.main(ForkedBooter.java:121)

authorizationRequestObjectWithMultivaluedClaimES384(org.xdi.oxauth.ws.rs.MultivaluedClaims)  Time elapsed: 1.289 sec  <<< FAILURE!
java.lang.AssertionError: expected [true] but found [false]
	at org.testng.Assert.fail(Assert.java:93)
	at org.testng.Assert.failNotEquals(Assert.java:512)
	at org.testng.Assert.assertTrue(Assert.java:41)
	at org.testng.Assert.assertTrue(Assert.java:51)
	at org.xdi.oxauth.ws.rs.MultivaluedClaims.authorizationRequestObjectWithMultivaluedClaimES384(MultivaluedClaims.java:2262)
	at sun.reflect.NativeMethodAccessorImpl.invoke0(Native Method)
	at sun.reflect.NativeMethodAccessorImpl.invoke(NativeMethodAccessorImpl.java:62)
	at sun.reflect.DelegatingMethodAccessorImpl.invoke(DelegatingMethodAccessorImpl.java:43)
	at java.lang.reflect.Method.invoke(Method.java:498)
	at org.testng.internal.MethodInvocationHelper.invokeMethod(MethodInvocationHelper.java:108)
	at org.testng.internal.Invoker.invokeMethod(Invoker.java:661)
	at org.testng.internal.Invoker.invokeTestMethod(Invoker.java:869)
	at org.testng.internal.Invoker.invokeTestMethods(Invoker.java:1193)
	at org.testng.internal.TestMethodWorker.invokeTestMethods(TestMethodWorker.java:126)
	at org.testng.internal.TestMethodWorker.run(TestMethodWorker.java:109)
	at org.testng.TestRunner.privateRun(TestRunner.java:744)
	at org.testng.TestRunner.run(TestRunner.java:602)
	at org.testng.SuiteRunner.runTest(SuiteRunner.java:380)
	at org.testng.SuiteRunner.runSequentially(SuiteRunner.java:375)
	at org.testng.SuiteRunner.privateRun(SuiteRunner.java:340)
	at org.testng.SuiteRunner.run(SuiteRunner.java:289)
	at org.testng.SuiteRunnerWorker.runSuite(SuiteRunnerWorker.java:52)
	at org.testng.SuiteRunnerWorker.run(SuiteRunnerWorker.java:86)
	at org.testng.TestNG.runSuitesSequentially(TestNG.java:1301)
	at org.testng.TestNG.runSuitesLocally(TestNG.java:1226)
	at org.testng.TestNG.runSuites(TestNG.java:1144)
	at org.testng.TestNG.run(TestNG.java:1115)
	at org.apache.maven.surefire.testng.TestNGExecutor.run(TestNGExecutor.java:281)
	at org.apache.maven.surefire.testng.TestNGXmlTestSuite.execute(TestNGXmlTestSuite.java:75)
	at org.apache.maven.surefire.testng.TestNGProvider.invoke(TestNGProvider.java:121)
	at org.apache.maven.surefire.booter.ForkedBooter.invokeProviderInSameClassLoader(ForkedBooter.java:290)
	at org.apache.maven.surefire.booter.ForkedBooter.runSuitesInProcess(ForkedBooter.java:242)
	at org.apache.maven.surefire.booter.ForkedBooter.main(ForkedBooter.java:121)

authorizationRequestObjectWithMultivaluedClaimES512(org.xdi.oxauth.ws.rs.MultivaluedClaims)  Time elapsed: 1.295 sec  <<< FAILURE!
java.lang.AssertionError: expected [true] but found [false]
	at org.testng.Assert.fail(Assert.java:93)
	at org.testng.Assert.failNotEquals(Assert.java:512)
	at org.testng.Assert.assertTrue(Assert.java:41)
	at org.testng.Assert.assertTrue(Assert.java:51)
	at org.xdi.oxauth.ws.rs.MultivaluedClaims.authorizationRequestObjectWithMultivaluedClaimES512(MultivaluedClaims.java:2365)
	at sun.reflect.NativeMethodAccessorImpl.invoke0(Native Method)
	at sun.reflect.NativeMethodAccessorImpl.invoke(NativeMethodAccessorImpl.java:62)
	at sun.reflect.DelegatingMethodAccessorImpl.invoke(DelegatingMethodAccessorImpl.java:43)
	at java.lang.reflect.Method.invoke(Method.java:498)
	at org.testng.internal.MethodInvocationHelper.invokeMethod(MethodInvocationHelper.java:108)
	at org.testng.internal.Invoker.invokeMethod(Invoker.java:661)
	at org.testng.internal.Invoker.invokeTestMethod(Invoker.java:869)
	at org.testng.internal.Invoker.invokeTestMethods(Invoker.java:1193)
	at org.testng.internal.TestMethodWorker.invokeTestMethods(TestMethodWorker.java:126)
	at org.testng.internal.TestMethodWorker.run(TestMethodWorker.java:109)
	at org.testng.TestRunner.privateRun(TestRunner.java:744)
	at org.testng.TestRunner.run(TestRunner.java:602)
	at org.testng.SuiteRunner.runTest(SuiteRunner.java:380)
	at org.testng.SuiteRunner.runSequentially(SuiteRunner.java:375)
	at org.testng.SuiteRunner.privateRun(SuiteRunner.java:340)
	at org.testng.SuiteRunner.run(SuiteRunner.java:289)
	at org.testng.SuiteRunnerWorker.runSuite(SuiteRunnerWorker.java:52)
	at org.testng.SuiteRunnerWorker.run(SuiteRunnerWorker.java:86)
	at org.testng.TestNG.runSuitesSequentially(TestNG.java:1301)
	at org.testng.TestNG.runSuitesLocally(TestNG.java:1226)
	at org.testng.TestNG.runSuites(TestNG.java:1144)
	at org.testng.TestNG.run(TestNG.java:1115)
	at org.apache.maven.surefire.testng.TestNGExecutor.run(TestNGExecutor.java:281)
	at org.apache.maven.surefire.testng.TestNGXmlTestSuite.execute(TestNGXmlTestSuite.java:75)
	at org.apache.maven.surefire.testng.TestNGProvider.invoke(TestNGProvider.java:121)
	at org.apache.maven.surefire.booter.ForkedBooter.invokeProviderInSameClassLoader(ForkedBooter.java:290)
	at org.apache.maven.surefire.booter.ForkedBooter.runSuitesInProcess(ForkedBooter.java:242)
	at org.apache.maven.surefire.booter.ForkedBooter.main(ForkedBooter.java:121)

authorizationRequestObjectWithMultivaluedClaimHS256(org.xdi.oxauth.ws.rs.MultivaluedClaims)  Time elapsed: 1.061 sec  <<< FAILURE!
java.lang.AssertionError: expected [true] but found [false]
	at org.testng.Assert.fail(Assert.java:93)
	at org.testng.Assert.failNotEquals(Assert.java:512)
	at org.testng.Assert.assertTrue(Assert.java:41)
	at org.testng.Assert.assertTrue(Assert.java:51)
	at org.xdi.oxauth.ws.rs.MultivaluedClaims.authorizationRequestObjectWithMultivaluedClaimHS256(MultivaluedClaims.java:1557)
	at sun.reflect.NativeMethodAccessorImpl.invoke0(Native Method)
	at sun.reflect.NativeMethodAccessorImpl.invoke(NativeMethodAccessorImpl.java:62)
	at sun.reflect.DelegatingMethodAccessorImpl.invoke(DelegatingMethodAccessorImpl.java:43)
	at java.lang.reflect.Method.invoke(Method.java:498)
	at org.testng.internal.MethodInvocationHelper.invokeMethod(MethodInvocationHelper.java:108)
	at org.testng.internal.Invoker.invokeMethod(Invoker.java:661)
	at org.testng.internal.Invoker.invokeTestMethod(Invoker.java:869)
	at org.testng.internal.Invoker.invokeTestMethods(Invoker.java:1193)
	at org.testng.internal.TestMethodWorker.invokeTestMethods(TestMethodWorker.java:126)
	at org.testng.internal.TestMethodWorker.run(TestMethodWorker.java:109)
	at org.testng.TestRunner.privateRun(TestRunner.java:744)
	at org.testng.TestRunner.run(TestRunner.java:602)
	at org.testng.SuiteRunner.runTest(SuiteRunner.java:380)
	at org.testng.SuiteRunner.runSequentially(SuiteRunner.java:375)
	at org.testng.SuiteRunner.privateRun(SuiteRunner.java:340)
	at org.testng.SuiteRunner.run(SuiteRunner.java:289)
	at org.testng.SuiteRunnerWorker.runSuite(SuiteRunnerWorker.java:52)
	at org.testng.SuiteRunnerWorker.run(SuiteRunnerWorker.java:86)
	at org.testng.TestNG.runSuitesSequentially(TestNG.java:1301)
	at org.testng.TestNG.runSuitesLocally(TestNG.java:1226)
	at org.testng.TestNG.runSuites(TestNG.java:1144)
	at org.testng.TestNG.run(TestNG.java:1115)
	at org.apache.maven.surefire.testng.TestNGExecutor.run(TestNGExecutor.java:281)
	at org.apache.maven.surefire.testng.TestNGXmlTestSuite.execute(TestNGXmlTestSuite.java:75)
	at org.apache.maven.surefire.testng.TestNGProvider.invoke(TestNGProvider.java:121)
	at org.apache.maven.surefire.booter.ForkedBooter.invokeProviderInSameClassLoader(ForkedBooter.java:290)
	at org.apache.maven.surefire.booter.ForkedBooter.runSuitesInProcess(ForkedBooter.java:242)
	at org.apache.maven.surefire.booter.ForkedBooter.main(ForkedBooter.java:121)

authorizationRequestObjectWithMultivaluedClaimHS384(org.xdi.oxauth.ws.rs.MultivaluedClaims)  Time elapsed: 1.103 sec  <<< FAILURE!
java.lang.AssertionError: expected [true] but found [false]
	at org.testng.Assert.fail(Assert.java:93)
	at org.testng.Assert.failNotEquals(Assert.java:512)
	at org.testng.Assert.assertTrue(Assert.java:41)
	at org.testng.Assert.assertTrue(Assert.java:51)
	at org.xdi.oxauth.ws.rs.MultivaluedClaims.authorizationRequestObjectWithMultivaluedClaimHS384(MultivaluedClaims.java:1654)
	at sun.reflect.NativeMethodAccessorImpl.invoke0(Native Method)
	at sun.reflect.NativeMethodAccessorImpl.invoke(NativeMethodAccessorImpl.java:62)
	at sun.reflect.DelegatingMethodAccessorImpl.invoke(DelegatingMethodAccessorImpl.java:43)
	at java.lang.reflect.Method.invoke(Method.java:498)
	at org.testng.internal.MethodInvocationHelper.invokeMethod(MethodInvocationHelper.java:108)
	at org.testng.internal.Invoker.invokeMethod(Invoker.java:661)
	at org.testng.internal.Invoker.invokeTestMethod(Invoker.java:869)
	at org.testng.internal.Invoker.invokeTestMethods(Invoker.java:1193)
	at org.testng.internal.TestMethodWorker.invokeTestMethods(TestMethodWorker.java:126)
	at org.testng.internal.TestMethodWorker.run(TestMethodWorker.java:109)
	at org.testng.TestRunner.privateRun(TestRunner.java:744)
	at org.testng.TestRunner.run(TestRunner.java:602)
	at org.testng.SuiteRunner.runTest(SuiteRunner.java:380)
	at org.testng.SuiteRunner.runSequentially(SuiteRunner.java:375)
	at org.testng.SuiteRunner.privateRun(SuiteRunner.java:340)
	at org.testng.SuiteRunner.run(SuiteRunner.java:289)
	at org.testng.SuiteRunnerWorker.runSuite(SuiteRunnerWorker.java:52)
	at org.testng.SuiteRunnerWorker.run(SuiteRunnerWorker.java:86)
	at org.testng.TestNG.runSuitesSequentially(TestNG.java:1301)
	at org.testng.TestNG.runSuitesLocally(TestNG.java:1226)
	at org.testng.TestNG.runSuites(TestNG.java:1144)
	at org.testng.TestNG.run(TestNG.java:1115)
	at org.apache.maven.surefire.testng.TestNGExecutor.run(TestNGExecutor.java:281)
	at org.apache.maven.surefire.testng.TestNGXmlTestSuite.execute(TestNGXmlTestSuite.java:75)
	at org.apache.maven.surefire.testng.TestNGProvider.invoke(TestNGProvider.java:121)
	at org.apache.maven.surefire.booter.ForkedBooter.invokeProviderInSameClassLoader(ForkedBooter.java:290)
	at org.apache.maven.surefire.booter.ForkedBooter.runSuitesInProcess(ForkedBooter.java:242)
	at org.apache.maven.surefire.booter.ForkedBooter.main(ForkedBooter.java:121)

authorizationRequestObjectWithMultivaluedClaimHS512(org.xdi.oxauth.ws.rs.MultivaluedClaims)  Time elapsed: 1.238 sec  <<< FAILURE!
java.lang.AssertionError: expected [true] but found [false]
	at org.testng.Assert.fail(Assert.java:93)
	at org.testng.Assert.failNotEquals(Assert.java:512)
	at org.testng.Assert.assertTrue(Assert.java:41)
	at org.testng.Assert.assertTrue(Assert.java:51)
	at org.xdi.oxauth.ws.rs.MultivaluedClaims.authorizationRequestObjectWithMultivaluedClaimHS512(MultivaluedClaims.java:1751)
	at sun.reflect.NativeMethodAccessorImpl.invoke0(Native Method)
	at sun.reflect.NativeMethodAccessorImpl.invoke(NativeMethodAccessorImpl.java:62)
	at sun.reflect.DelegatingMethodAccessorImpl.invoke(DelegatingMethodAccessorImpl.java:43)
	at java.lang.reflect.Method.invoke(Method.java:498)
	at org.testng.internal.MethodInvocationHelper.invokeMethod(MethodInvocationHelper.java:108)
	at org.testng.internal.Invoker.invokeMethod(Invoker.java:661)
	at org.testng.internal.Invoker.invokeTestMethod(Invoker.java:869)
	at org.testng.internal.Invoker.invokeTestMethods(Invoker.java:1193)
	at org.testng.internal.TestMethodWorker.invokeTestMethods(TestMethodWorker.java:126)
	at org.testng.internal.TestMethodWorker.run(TestMethodWorker.java:109)
	at org.testng.TestRunner.privateRun(TestRunner.java:744)
	at org.testng.TestRunner.run(TestRunner.java:602)
	at org.testng.SuiteRunner.runTest(SuiteRunner.java:380)
	at org.testng.SuiteRunner.runSequentially(SuiteRunner.java:375)
	at org.testng.SuiteRunner.privateRun(SuiteRunner.java:340)
	at org.testng.SuiteRunner.run(SuiteRunner.java:289)
	at org.testng.SuiteRunnerWorker.runSuite(SuiteRunnerWorker.java:52)
	at org.testng.SuiteRunnerWorker.run(SuiteRunnerWorker.java:86)
	at org.testng.TestNG.runSuitesSequentially(TestNG.java:1301)
	at org.testng.TestNG.runSuitesLocally(TestNG.java:1226)
	at org.testng.TestNG.runSuites(TestNG.java:1144)
	at org.testng.TestNG.run(TestNG.java:1115)
	at org.apache.maven.surefire.testng.TestNGExecutor.run(TestNGExecutor.java:281)
	at org.apache.maven.surefire.testng.TestNGXmlTestSuite.execute(TestNGXmlTestSuite.java:75)
	at org.apache.maven.surefire.testng.TestNGProvider.invoke(TestNGProvider.java:121)
	at org.apache.maven.surefire.booter.ForkedBooter.invokeProviderInSameClassLoader(ForkedBooter.java:290)
	at org.apache.maven.surefire.booter.ForkedBooter.runSuitesInProcess(ForkedBooter.java:242)
	at org.apache.maven.surefire.booter.ForkedBooter.main(ForkedBooter.java:121)

authorizationRequestObjectWithMultivaluedClaimNone(org.xdi.oxauth.ws.rs.MultivaluedClaims)  Time elapsed: 1.853 sec  <<< FAILURE!
java.lang.AssertionError: expected [true] but found [false]
	at org.testng.Assert.fail(Assert.java:93)
	at org.testng.Assert.failNotEquals(Assert.java:512)
	at org.testng.Assert.assertTrue(Assert.java:41)
	at org.testng.Assert.assertTrue(Assert.java:51)
	at org.xdi.oxauth.ws.rs.MultivaluedClaims.authorizationRequestObjectWithMultivaluedClaimNone(MultivaluedClaims.java:1461)
	at sun.reflect.NativeMethodAccessorImpl.invoke0(Native Method)
	at sun.reflect.NativeMethodAccessorImpl.invoke(NativeMethodAccessorImpl.java:62)
	at sun.reflect.DelegatingMethodAccessorImpl.invoke(DelegatingMethodAccessorImpl.java:43)
	at java.lang.reflect.Method.invoke(Method.java:498)
	at org.testng.internal.MethodInvocationHelper.invokeMethod(MethodInvocationHelper.java:108)
	at org.testng.internal.Invoker.invokeMethod(Invoker.java:661)
	at org.testng.internal.Invoker.invokeTestMethod(Invoker.java:869)
	at org.testng.internal.Invoker.invokeTestMethods(Invoker.java:1193)
	at org.testng.internal.TestMethodWorker.invokeTestMethods(TestMethodWorker.java:126)
	at org.testng.internal.TestMethodWorker.run(TestMethodWorker.java:109)
	at org.testng.TestRunner.privateRun(TestRunner.java:744)
	at org.testng.TestRunner.run(TestRunner.java:602)
	at org.testng.SuiteRunner.runTest(SuiteRunner.java:380)
	at org.testng.SuiteRunner.runSequentially(SuiteRunner.java:375)
	at org.testng.SuiteRunner.privateRun(SuiteRunner.java:340)
	at org.testng.SuiteRunner.run(SuiteRunner.java:289)
	at org.testng.SuiteRunnerWorker.runSuite(SuiteRunnerWorker.java:52)
	at org.testng.SuiteRunnerWorker.run(SuiteRunnerWorker.java:86)
	at org.testng.TestNG.runSuitesSequentially(TestNG.java:1301)
	at org.testng.TestNG.runSuitesLocally(TestNG.java:1226)
	at org.testng.TestNG.runSuites(TestNG.java:1144)
	at org.testng.TestNG.run(TestNG.java:1115)
	at org.apache.maven.surefire.testng.TestNGExecutor.run(TestNGExecutor.java:281)
	at org.apache.maven.surefire.testng.TestNGXmlTestSuite.execute(TestNGXmlTestSuite.java:75)
	at org.apache.maven.surefire.testng.TestNGProvider.invoke(TestNGProvider.java:121)
	at org.apache.maven.surefire.booter.ForkedBooter.invokeProviderInSameClassLoader(ForkedBooter.java:290)
	at org.apache.maven.surefire.booter.ForkedBooter.runSuitesInProcess(ForkedBooter.java:242)
	at org.apache.maven.surefire.booter.ForkedBooter.main(ForkedBooter.java:121)

authorizationRequestObjectWithMultivaluedClaimRS256(org.xdi.oxauth.ws.rs.MultivaluedClaims)  Time elapsed: 1.658 sec  <<< FAILURE!
java.lang.AssertionError: expected [true] but found [false]
	at org.testng.Assert.fail(Assert.java:93)
	at org.testng.Assert.failNotEquals(Assert.java:512)
	at org.testng.Assert.assertTrue(Assert.java:41)
	at org.testng.Assert.assertTrue(Assert.java:51)
	at org.xdi.oxauth.ws.rs.MultivaluedClaims.authorizationRequestObjectWithMultivaluedClaimRS256(MultivaluedClaims.java:1850)
	at sun.reflect.NativeMethodAccessorImpl.invoke0(Native Method)
	at sun.reflect.NativeMethodAccessorImpl.invoke(NativeMethodAccessorImpl.java:62)
	at sun.reflect.DelegatingMethodAccessorImpl.invoke(DelegatingMethodAccessorImpl.java:43)
	at java.lang.reflect.Method.invoke(Method.java:498)
	at org.testng.internal.MethodInvocationHelper.invokeMethod(MethodInvocationHelper.java:108)
	at org.testng.internal.Invoker.invokeMethod(Invoker.java:661)
	at org.testng.internal.Invoker.invokeTestMethod(Invoker.java:869)
	at org.testng.internal.Invoker.invokeTestMethods(Invoker.java:1193)
	at org.testng.internal.TestMethodWorker.invokeTestMethods(TestMethodWorker.java:126)
	at org.testng.internal.TestMethodWorker.run(TestMethodWorker.java:109)
	at org.testng.TestRunner.privateRun(TestRunner.java:744)
	at org.testng.TestRunner.run(TestRunner.java:602)
	at org.testng.SuiteRunner.runTest(SuiteRunner.java:380)
	at org.testng.SuiteRunner.runSequentially(SuiteRunner.java:375)
	at org.testng.SuiteRunner.privateRun(SuiteRunner.java:340)
	at org.testng.SuiteRunner.run(SuiteRunner.java:289)
	at org.testng.SuiteRunnerWorker.runSuite(SuiteRunnerWorker.java:52)
	at org.testng.SuiteRunnerWorker.run(SuiteRunnerWorker.java:86)
	at org.testng.TestNG.runSuitesSequentially(TestNG.java:1301)
	at org.testng.TestNG.runSuitesLocally(TestNG.java:1226)
	at org.testng.TestNG.runSuites(TestNG.java:1144)
	at org.testng.TestNG.run(TestNG.java:1115)
	at org.apache.maven.surefire.testng.TestNGExecutor.run(TestNGExecutor.java:281)
	at org.apache.maven.surefire.testng.TestNGXmlTestSuite.execute(TestNGXmlTestSuite.java:75)
	at org.apache.maven.surefire.testng.TestNGProvider.invoke(TestNGProvider.java:121)
	at org.apache.maven.surefire.booter.ForkedBooter.invokeProviderInSameClassLoader(ForkedBooter.java:290)
	at org.apache.maven.surefire.booter.ForkedBooter.runSuitesInProcess(ForkedBooter.java:242)
	at org.apache.maven.surefire.booter.ForkedBooter.main(ForkedBooter.java:121)

authorizationRequestObjectWithMultivaluedClaimRS384(org.xdi.oxauth.ws.rs.MultivaluedClaims)  Time elapsed: 1.346 sec  <<< FAILURE!
java.lang.AssertionError: expected [true] but found [false]
	at org.testng.Assert.fail(Assert.java:93)
	at org.testng.Assert.failNotEquals(Assert.java:512)
	at org.testng.Assert.assertTrue(Assert.java:41)
	at org.testng.Assert.assertTrue(Assert.java:51)
	at org.xdi.oxauth.ws.rs.MultivaluedClaims.authorizationRequestObjectWithMultivaluedClaimRS384(MultivaluedClaims.java:1953)
	at sun.reflect.NativeMethodAccessorImpl.invoke0(Native Method)
	at sun.reflect.NativeMethodAccessorImpl.invoke(NativeMethodAccessorImpl.java:62)
	at sun.reflect.DelegatingMethodAccessorImpl.invoke(DelegatingMethodAccessorImpl.java:43)
	at java.lang.reflect.Method.invoke(Method.java:498)
	at org.testng.internal.MethodInvocationHelper.invokeMethod(MethodInvocationHelper.java:108)
	at org.testng.internal.Invoker.invokeMethod(Invoker.java:661)
	at org.testng.internal.Invoker.invokeTestMethod(Invoker.java:869)
	at org.testng.internal.Invoker.invokeTestMethods(Invoker.java:1193)
	at org.testng.internal.TestMethodWorker.invokeTestMethods(TestMethodWorker.java:126)
	at org.testng.internal.TestMethodWorker.run(TestMethodWorker.java:109)
	at org.testng.TestRunner.privateRun(TestRunner.java:744)
	at org.testng.TestRunner.run(TestRunner.java:602)
	at org.testng.SuiteRunner.runTest(SuiteRunner.java:380)
	at org.testng.SuiteRunner.runSequentially(SuiteRunner.java:375)
	at org.testng.SuiteRunner.privateRun(SuiteRunner.java:340)
	at org.testng.SuiteRunner.run(SuiteRunner.java:289)
	at org.testng.SuiteRunnerWorker.runSuite(SuiteRunnerWorker.java:52)
	at org.testng.SuiteRunnerWorker.run(SuiteRunnerWorker.java:86)
	at org.testng.TestNG.runSuitesSequentially(TestNG.java:1301)
	at org.testng.TestNG.runSuitesLocally(TestNG.java:1226)
	at org.testng.TestNG.runSuites(TestNG.java:1144)
	at org.testng.TestNG.run(TestNG.java:1115)
	at org.apache.maven.surefire.testng.TestNGExecutor.run(TestNGExecutor.java:281)
	at org.apache.maven.surefire.testng.TestNGXmlTestSuite.execute(TestNGXmlTestSuite.java:75)
	at org.apache.maven.surefire.testng.TestNGProvider.invoke(TestNGProvider.java:121)
	at org.apache.maven.surefire.booter.ForkedBooter.invokeProviderInSameClassLoader(ForkedBooter.java:290)
	at org.apache.maven.surefire.booter.ForkedBooter.runSuitesInProcess(ForkedBooter.java:242)
	at org.apache.maven.surefire.booter.ForkedBooter.main(ForkedBooter.java:121)

authorizationRequestObjectWithMultivaluedClaimRS512(org.xdi.oxauth.ws.rs.MultivaluedClaims)  Time elapsed: 1.287 sec  <<< FAILURE!
java.lang.AssertionError: expected [true] but found [false]
	at org.testng.Assert.fail(Assert.java:93)
	at org.testng.Assert.failNotEquals(Assert.java:512)
	at org.testng.Assert.assertTrue(Assert.java:41)
	at org.testng.Assert.assertTrue(Assert.java:51)
	at org.xdi.oxauth.ws.rs.MultivaluedClaims.authorizationRequestObjectWithMultivaluedClaimRS512(MultivaluedClaims.java:2056)
	at sun.reflect.NativeMethodAccessorImpl.invoke0(Native Method)
	at sun.reflect.NativeMethodAccessorImpl.invoke(NativeMethodAccessorImpl.java:62)
	at sun.reflect.DelegatingMethodAccessorImpl.invoke(DelegatingMethodAccessorImpl.java:43)
	at java.lang.reflect.Method.invoke(Method.java:498)
	at org.testng.internal.MethodInvocationHelper.invokeMethod(MethodInvocationHelper.java:108)
	at org.testng.internal.Invoker.invokeMethod(Invoker.java:661)
	at org.testng.internal.Invoker.invokeTestMethod(Invoker.java:869)
	at org.testng.internal.Invoker.invokeTestMethods(Invoker.java:1193)
	at org.testng.internal.TestMethodWorker.invokeTestMethods(TestMethodWorker.java:126)
	at org.testng.internal.TestMethodWorker.run(TestMethodWorker.java:109)
	at org.testng.TestRunner.privateRun(TestRunner.java:744)
	at org.testng.TestRunner.run(TestRunner.java:602)
	at org.testng.SuiteRunner.runTest(SuiteRunner.java:380)
	at org.testng.SuiteRunner.runSequentially(SuiteRunner.java:375)
	at org.testng.SuiteRunner.privateRun(SuiteRunner.java:340)
	at org.testng.SuiteRunner.run(SuiteRunner.java:289)
	at org.testng.SuiteRunnerWorker.runSuite(SuiteRunnerWorker.java:52)
	at org.testng.SuiteRunnerWorker.run(SuiteRunnerWorker.java:86)
	at org.testng.TestNG.runSuitesSequentially(TestNG.java:1301)
	at org.testng.TestNG.runSuitesLocally(TestNG.java:1226)
	at org.testng.TestNG.runSuites(TestNG.java:1144)
	at org.testng.TestNG.run(TestNG.java:1115)
	at org.apache.maven.surefire.testng.TestNGExecutor.run(TestNGExecutor.java:281)
	at org.apache.maven.surefire.testng.TestNGXmlTestSuite.execute(TestNGXmlTestSuite.java:75)
	at org.apache.maven.surefire.testng.TestNGProvider.invoke(TestNGProvider.java:121)
	at org.apache.maven.surefire.booter.ForkedBooter.invokeProviderInSameClassLoader(ForkedBooter.java:290)
	at org.apache.maven.surefire.booter.ForkedBooter.runSuitesInProcess(ForkedBooter.java:242)
	at org.apache.maven.surefire.booter.ForkedBooter.main(ForkedBooter.java:121)

authorizationRequestWithMultivaluedClaimAlgA128KWEncA128GCM(org.xdi.oxauth.ws.rs.MultivaluedClaims)  Time elapsed: 1.158 sec  <<< FAILURE!
org.xdi.oxauth.model.exception.InvalidJweException: org.bouncycastle.crypto.InvalidCipherTextException: checksum failed
	at org.xdi.oxauth.model.jwe.JweDecrypterImpl.decryptEncryptionKey(JweDecrypterImpl.java:126)
	at org.xdi.oxauth.model.jwe.AbstractJweDecrypter.decrypt(AbstractJweDecrypter.java:79)
	at org.xdi.oxauth.model.jwe.Jwe.parse(Jwe.java:91)
	at org.xdi.oxauth.ws.rs.MultivaluedClaims.authorizationRequestWithMultivaluedClaimAlgA128KWEncA128GCM(MultivaluedClaims.java:996)
	at sun.reflect.NativeMethodAccessorImpl.invoke0(Native Method)
	at sun.reflect.NativeMethodAccessorImpl.invoke(NativeMethodAccessorImpl.java:62)
	at sun.reflect.DelegatingMethodAccessorImpl.invoke(DelegatingMethodAccessorImpl.java:43)
	at java.lang.reflect.Method.invoke(Method.java:498)
	at org.testng.internal.MethodInvocationHelper.invokeMethod(MethodInvocationHelper.java:108)
	at org.testng.internal.Invoker.invokeMethod(Invoker.java:661)
	at org.testng.internal.Invoker.invokeTestMethod(Invoker.java:869)
	at org.testng.internal.Invoker.invokeTestMethods(Invoker.java:1193)
	at org.testng.internal.TestMethodWorker.invokeTestMethods(TestMethodWorker.java:126)
	at org.testng.internal.TestMethodWorker.run(TestMethodWorker.java:109)
	at org.testng.TestRunner.privateRun(TestRunner.java:744)
	at org.testng.TestRunner.run(TestRunner.java:602)
	at org.testng.SuiteRunner.runTest(SuiteRunner.java:380)
	at org.testng.SuiteRunner.runSequentially(SuiteRunner.java:375)
	at org.testng.SuiteRunner.privateRun(SuiteRunner.java:340)
	at org.testng.SuiteRunner.run(SuiteRunner.java:289)
	at org.testng.SuiteRunnerWorker.runSuite(SuiteRunnerWorker.java:52)
	at org.testng.SuiteRunnerWorker.run(SuiteRunnerWorker.java:86)
	at org.testng.TestNG.runSuitesSequentially(TestNG.java:1301)
	at org.testng.TestNG.runSuitesLocally(TestNG.java:1226)
	at org.testng.TestNG.runSuites(TestNG.java:1144)
	at org.testng.TestNG.run(TestNG.java:1115)
	at org.apache.maven.surefire.testng.TestNGExecutor.run(TestNGExecutor.java:281)
	at org.apache.maven.surefire.testng.TestNGXmlTestSuite.execute(TestNGXmlTestSuite.java:75)
	at org.apache.maven.surefire.testng.TestNGProvider.invoke(TestNGProvider.java:121)
	at org.apache.maven.surefire.booter.ForkedBooter.invokeProviderInSameClassLoader(ForkedBooter.java:290)
	at org.apache.maven.surefire.booter.ForkedBooter.runSuitesInProcess(ForkedBooter.java:242)
	at org.apache.maven.surefire.booter.ForkedBooter.main(ForkedBooter.java:121)
Caused by: org.bouncycastle.crypto.InvalidCipherTextException: checksum failed
	at org.bouncycastle.crypto.engines.RFC3394WrapEngine.unwrap(Unknown Source)
	at org.xdi.oxauth.model.jwe.JweDecrypterImpl.decryptEncryptionKey(JweDecrypterImpl.java:105)
	... 31 more

authorizationRequestWithMultivaluedClaimAlgA256KWEncA256GCM(org.xdi.oxauth.ws.rs.MultivaluedClaims)  Time elapsed: 1.099 sec  <<< FAILURE!
org.xdi.oxauth.model.exception.InvalidJweException: org.bouncycastle.crypto.InvalidCipherTextException: checksum failed
	at org.xdi.oxauth.model.jwe.JweDecrypterImpl.decryptEncryptionKey(JweDecrypterImpl.java:126)
	at org.xdi.oxauth.model.jwe.AbstractJweDecrypter.decrypt(AbstractJweDecrypter.java:79)
	at org.xdi.oxauth.model.jwe.Jwe.parse(Jwe.java:91)
	at org.xdi.oxauth.ws.rs.MultivaluedClaims.authorizationRequestWithMultivaluedClaimAlgA256KWEncA256GCM(MultivaluedClaims.java:1082)
	at sun.reflect.NativeMethodAccessorImpl.invoke0(Native Method)
	at sun.reflect.NativeMethodAccessorImpl.invoke(NativeMethodAccessorImpl.java:62)
	at sun.reflect.DelegatingMethodAccessorImpl.invoke(DelegatingMethodAccessorImpl.java:43)
	at java.lang.reflect.Method.invoke(Method.java:498)
	at org.testng.internal.MethodInvocationHelper.invokeMethod(MethodInvocationHelper.java:108)
	at org.testng.internal.Invoker.invokeMethod(Invoker.java:661)
	at org.testng.internal.Invoker.invokeTestMethod(Invoker.java:869)
	at org.testng.internal.Invoker.invokeTestMethods(Invoker.java:1193)
	at org.testng.internal.TestMethodWorker.invokeTestMethods(TestMethodWorker.java:126)
	at org.testng.internal.TestMethodWorker.run(TestMethodWorker.java:109)
	at org.testng.TestRunner.privateRun(TestRunner.java:744)
	at org.testng.TestRunner.run(TestRunner.java:602)
	at org.testng.SuiteRunner.runTest(SuiteRunner.java:380)
	at org.testng.SuiteRunner.runSequentially(SuiteRunner.java:375)
	at org.testng.SuiteRunner.privateRun(SuiteRunner.java:340)
	at org.testng.SuiteRunner.run(SuiteRunner.java:289)
	at org.testng.SuiteRunnerWorker.runSuite(SuiteRunnerWorker.java:52)
	at org.testng.SuiteRunnerWorker.run(SuiteRunnerWorker.java:86)
	at org.testng.TestNG.runSuitesSequentially(TestNG.java:1301)
	at org.testng.TestNG.runSuitesLocally(TestNG.java:1226)
	at org.testng.TestNG.runSuites(TestNG.java:1144)
	at org.testng.TestNG.run(TestNG.java:1115)
	at org.apache.maven.surefire.testng.TestNGExecutor.run(TestNGExecutor.java:281)
	at org.apache.maven.surefire.testng.TestNGXmlTestSuite.execute(TestNGXmlTestSuite.java:75)
	at org.apache.maven.surefire.testng.TestNGProvider.invoke(TestNGProvider.java:121)
	at org.apache.maven.surefire.booter.ForkedBooter.invokeProviderInSameClassLoader(ForkedBooter.java:290)
	at org.apache.maven.surefire.booter.ForkedBooter.runSuitesInProcess(ForkedBooter.java:242)
	at org.apache.maven.surefire.booter.ForkedBooter.main(ForkedBooter.java:121)
Caused by: org.bouncycastle.crypto.InvalidCipherTextException: checksum failed
	at org.bouncycastle.crypto.engines.RFC3394WrapEngine.unwrap(Unknown Source)
	at org.xdi.oxauth.model.jwe.JweDecrypterImpl.decryptEncryptionKey(JweDecrypterImpl.java:105)
	... 31 more

requestParameterMethod6(org.xdi.oxauth.ws.rs.OpenIDRequestObjectHttpTest)  Time elapsed: 1.305 sec  <<< FAILURE!
java.lang.AssertionError: expected object to not be null
	at org.testng.Assert.fail(Assert.java:93)
	at org.testng.Assert.assertNotNull(Assert.java:422)
	at org.testng.Assert.assertNotNull(Assert.java:407)
	at org.xdi.oxauth.ws.rs.OpenIDRequestObjectHttpTest.requestParameterMethod6(OpenIDRequestObjectHttpTest.java:440)
	at sun.reflect.NativeMethodAccessorImpl.invoke0(Native Method)
	at sun.reflect.NativeMethodAccessorImpl.invoke(NativeMethodAccessorImpl.java:62)
	at sun.reflect.DelegatingMethodAccessorImpl.invoke(DelegatingMethodAccessorImpl.java:43)
	at java.lang.reflect.Method.invoke(Method.java:498)
	at org.testng.internal.MethodInvocationHelper.invokeMethod(MethodInvocationHelper.java:108)
	at org.testng.internal.Invoker.invokeMethod(Invoker.java:661)
	at org.testng.internal.Invoker.invokeTestMethod(Invoker.java:869)
	at org.testng.internal.Invoker.invokeTestMethods(Invoker.java:1193)
	at org.testng.internal.TestMethodWorker.invokeTestMethods(TestMethodWorker.java:126)
	at org.testng.internal.TestMethodWorker.run(TestMethodWorker.java:109)
	at org.testng.TestRunner.privateRun(TestRunner.java:744)
	at org.testng.TestRunner.run(TestRunner.java:602)
	at org.testng.SuiteRunner.runTest(SuiteRunner.java:380)
	at org.testng.SuiteRunner.runSequentially(SuiteRunner.java:375)
	at org.testng.SuiteRunner.privateRun(SuiteRunner.java:340)
	at org.testng.SuiteRunner.run(SuiteRunner.java:289)
	at org.testng.SuiteRunnerWorker.runSuite(SuiteRunnerWorker.java:52)
	at org.testng.SuiteRunnerWorker.run(SuiteRunnerWorker.java:86)
	at org.testng.TestNG.runSuitesSequentially(TestNG.java:1301)
	at org.testng.TestNG.runSuitesLocally(TestNG.java:1226)
	at org.testng.TestNG.runSuites(TestNG.java:1144)
	at org.testng.TestNG.run(TestNG.java:1115)
	at org.apache.maven.surefire.testng.TestNGExecutor.run(TestNGExecutor.java:281)
	at org.apache.maven.surefire.testng.TestNGXmlTestSuite.execute(TestNGXmlTestSuite.java:75)
	at org.apache.maven.surefire.testng.TestNGProvider.invoke(TestNGProvider.java:121)
	at org.apache.maven.surefire.booter.ForkedBooter.invokeProviderInSameClassLoader(ForkedBooter.java:290)
	at org.apache.maven.surefire.booter.ForkedBooter.runSuitesInProcess(ForkedBooter.java:242)
	at org.apache.maven.surefire.booter.ForkedBooter.main(ForkedBooter.java:121)

requestParameterMethodAlgA128KWEncA128GCM(org.xdi.oxauth.ws.rs.OpenIDRequestObjectHttpTest)  Time elapsed: 0.236 sec  <<< FAILURE!
java.lang.AssertionError: The accessToken is null expected object to not be null
	at org.testng.Assert.fail(Assert.java:93)
	at org.testng.Assert.assertNotNull(Assert.java:422)
	at org.xdi.oxauth.ws.rs.OpenIDRequestObjectHttpTest.requestParameterMethodAlgA128KWEncA128GCM(OpenIDRequestObjectHttpTest.java:2508)
	at sun.reflect.NativeMethodAccessorImpl.invoke0(Native Method)
	at sun.reflect.NativeMethodAccessorImpl.invoke(NativeMethodAccessorImpl.java:62)
	at sun.reflect.DelegatingMethodAccessorImpl.invoke(DelegatingMethodAccessorImpl.java:43)
	at java.lang.reflect.Method.invoke(Method.java:498)
	at org.testng.internal.MethodInvocationHelper.invokeMethod(MethodInvocationHelper.java:108)
	at org.testng.internal.Invoker.invokeMethod(Invoker.java:661)
	at org.testng.internal.Invoker.invokeTestMethod(Invoker.java:869)
	at org.testng.internal.Invoker.invokeTestMethods(Invoker.java:1193)
	at org.testng.internal.TestMethodWorker.invokeTestMethods(TestMethodWorker.java:126)
	at org.testng.internal.TestMethodWorker.run(TestMethodWorker.java:109)
	at org.testng.TestRunner.privateRun(TestRunner.java:744)
	at org.testng.TestRunner.run(TestRunner.java:602)
	at org.testng.SuiteRunner.runTest(SuiteRunner.java:380)
	at org.testng.SuiteRunner.runSequentially(SuiteRunner.java:375)
	at org.testng.SuiteRunner.privateRun(SuiteRunner.java:340)
	at org.testng.SuiteRunner.run(SuiteRunner.java:289)
	at org.testng.SuiteRunnerWorker.runSuite(SuiteRunnerWorker.java:52)
	at org.testng.SuiteRunnerWorker.run(SuiteRunnerWorker.java:86)
	at org.testng.TestNG.runSuitesSequentially(TestNG.java:1301)
	at org.testng.TestNG.runSuitesLocally(TestNG.java:1226)
	at org.testng.TestNG.runSuites(TestNG.java:1144)
	at org.testng.TestNG.run(TestNG.java:1115)
	at org.apache.maven.surefire.testng.TestNGExecutor.run(TestNGExecutor.java:281)
	at org.apache.maven.surefire.testng.TestNGXmlTestSuite.execute(TestNGXmlTestSuite.java:75)
	at org.apache.maven.surefire.testng.TestNGProvider.invoke(TestNGProvider.java:121)
	at org.apache.maven.surefire.booter.ForkedBooter.invokeProviderInSameClassLoader(ForkedBooter.java:290)
	at org.apache.maven.surefire.booter.ForkedBooter.runSuitesInProcess(ForkedBooter.java:242)
	at org.apache.maven.surefire.booter.ForkedBooter.main(ForkedBooter.java:121)

requestParameterMethodAlgA256KWEncA256GCM(org.xdi.oxauth.ws.rs.OpenIDRequestObjectHttpTest)  Time elapsed: 0.239 sec  <<< FAILURE!
java.lang.AssertionError: The accessToken is null expected object to not be null
	at org.testng.Assert.fail(Assert.java:93)
	at org.testng.Assert.assertNotNull(Assert.java:422)
	at org.xdi.oxauth.ws.rs.OpenIDRequestObjectHttpTest.requestParameterMethodAlgA256KWEncA256GCM(OpenIDRequestObjectHttpTest.java:2596)
	at sun.reflect.NativeMethodAccessorImpl.invoke0(Native Method)
	at sun.reflect.NativeMethodAccessorImpl.invoke(NativeMethodAccessorImpl.java:62)
	at sun.reflect.DelegatingMethodAccessorImpl.invoke(DelegatingMethodAccessorImpl.java:43)
	at java.lang.reflect.Method.invoke(Method.java:498)
	at org.testng.internal.MethodInvocationHelper.invokeMethod(MethodInvocationHelper.java:108)
	at org.testng.internal.Invoker.invokeMethod(Invoker.java:661)
	at org.testng.internal.Invoker.invokeTestMethod(Invoker.java:869)
	at org.testng.internal.Invoker.invokeTestMethods(Invoker.java:1193)
	at org.testng.internal.TestMethodWorker.invokeTestMethods(TestMethodWorker.java:126)
	at org.testng.internal.TestMethodWorker.run(TestMethodWorker.java:109)
	at org.testng.TestRunner.privateRun(TestRunner.java:744)
	at org.testng.TestRunner.run(TestRunner.java:602)
	at org.testng.SuiteRunner.runTest(SuiteRunner.java:380)
	at org.testng.SuiteRunner.runSequentially(SuiteRunner.java:375)
	at org.testng.SuiteRunner.privateRun(SuiteRunner.java:340)
	at org.testng.SuiteRunner.run(SuiteRunner.java:289)
	at org.testng.SuiteRunnerWorker.runSuite(SuiteRunnerWorker.java:52)
	at org.testng.SuiteRunnerWorker.run(SuiteRunnerWorker.java:86)
	at org.testng.TestNG.runSuitesSequentially(TestNG.java:1301)
	at org.testng.TestNG.runSuitesLocally(TestNG.java:1226)
	at org.testng.TestNG.runSuites(TestNG.java:1144)
	at org.testng.TestNG.run(TestNG.java:1115)
	at org.apache.maven.surefire.testng.TestNGExecutor.run(TestNGExecutor.java:281)
	at org.apache.maven.surefire.testng.TestNGXmlTestSuite.execute(TestNGXmlTestSuite.java:75)
	at org.apache.maven.surefire.testng.TestNGProvider.invoke(TestNGProvider.java:121)
	at org.apache.maven.surefire.booter.ForkedBooter.invokeProviderInSameClassLoader(ForkedBooter.java:290)
	at org.apache.maven.surefire.booter.ForkedBooter.runSuitesInProcess(ForkedBooter.java:242)
	at org.apache.maven.surefire.booter.ForkedBooter.main(ForkedBooter.java:121)

requestIdTokenAlgA128KWEncA128GCM(org.xdi.oxauth.ws.rs.TokenEncryptionHttpTest)  Time elapsed: 0.19 sec  <<< FAILURE!
java.lang.AssertionError: org.bouncycastle.crypto.InvalidCipherTextException: checksum failed
	at org.testng.Assert.fail(Assert.java:82)
	at org.xdi.oxauth.ws.rs.TokenEncryptionHttpTest.requestIdTokenAlgA128KWEncA128GCM(TokenEncryptionHttpTest.java:338)
	at sun.reflect.NativeMethodAccessorImpl.invoke0(Native Method)
	at sun.reflect.NativeMethodAccessorImpl.invoke(NativeMethodAccessorImpl.java:62)
	at sun.reflect.DelegatingMethodAccessorImpl.invoke(DelegatingMethodAccessorImpl.java:43)
	at java.lang.reflect.Method.invoke(Method.java:498)
	at org.testng.internal.MethodInvocationHelper.invokeMethod(MethodInvocationHelper.java:108)
	at org.testng.internal.Invoker.invokeMethod(Invoker.java:661)
	at org.testng.internal.Invoker.invokeTestMethod(Invoker.java:869)
	at org.testng.internal.Invoker.invokeTestMethods(Invoker.java:1193)
	at org.testng.internal.TestMethodWorker.invokeTestMethods(TestMethodWorker.java:126)
	at org.testng.internal.TestMethodWorker.run(TestMethodWorker.java:109)
	at org.testng.TestRunner.privateRun(TestRunner.java:744)
	at org.testng.TestRunner.run(TestRunner.java:602)
	at org.testng.SuiteRunner.runTest(SuiteRunner.java:380)
	at org.testng.SuiteRunner.runSequentially(SuiteRunner.java:375)
	at org.testng.SuiteRunner.privateRun(SuiteRunner.java:340)
	at org.testng.SuiteRunner.run(SuiteRunner.java:289)
	at org.testng.SuiteRunnerWorker.runSuite(SuiteRunnerWorker.java:52)
	at org.testng.SuiteRunnerWorker.run(SuiteRunnerWorker.java:86)
	at org.testng.TestNG.runSuitesSequentially(TestNG.java:1301)
	at org.testng.TestNG.runSuitesLocally(TestNG.java:1226)
	at org.testng.TestNG.runSuites(TestNG.java:1144)
	at org.testng.TestNG.run(TestNG.java:1115)
	at org.apache.maven.surefire.testng.TestNGExecutor.run(TestNGExecutor.java:281)
	at org.apache.maven.surefire.testng.TestNGXmlTestSuite.execute(TestNGXmlTestSuite.java:75)
	at org.apache.maven.surefire.testng.TestNGProvider.invoke(TestNGProvider.java:121)
	at org.apache.maven.surefire.booter.ForkedBooter.invokeProviderInSameClassLoader(ForkedBooter.java:290)
	at org.apache.maven.surefire.booter.ForkedBooter.runSuitesInProcess(ForkedBooter.java:242)
	at org.apache.maven.surefire.booter.ForkedBooter.main(ForkedBooter.java:121)
Caused by: org.xdi.oxauth.model.exception.InvalidJweException: org.bouncycastle.crypto.InvalidCipherTextException: checksum failed
	at org.xdi.oxauth.model.jwe.JweDecrypterImpl.decryptEncryptionKey(JweDecrypterImpl.java:126)
	at org.xdi.oxauth.model.jwe.AbstractJweDecrypter.decrypt(AbstractJweDecrypter.java:79)
	at org.xdi.oxauth.model.jwe.Jwe.parse(Jwe.java:91)
	at org.xdi.oxauth.ws.rs.TokenEncryptionHttpTest.requestIdTokenAlgA128KWEncA128GCM(TokenEncryptionHttpTest.java:328)
	... 28 more
Caused by: org.bouncycastle.crypto.InvalidCipherTextException: checksum failed
	at org.bouncycastle.crypto.engines.RFC3394WrapEngine.unwrap(Unknown Source)
	at org.xdi.oxauth.model.jwe.JweDecrypterImpl.decryptEncryptionKey(JweDecrypterImpl.java:105)
	... 31 more

requestIdTokenAlgA256KWEncA256GCM(org.xdi.oxauth.ws.rs.TokenEncryptionHttpTest)  Time elapsed: 0.189 sec  <<< FAILURE!
java.lang.AssertionError: org.bouncycastle.crypto.InvalidCipherTextException: checksum failed
	at org.testng.Assert.fail(Assert.java:82)
	at org.xdi.oxauth.ws.rs.TokenEncryptionHttpTest.requestIdTokenAlgA256KWEncA256GCM(TokenEncryptionHttpTest.java:410)
	at sun.reflect.NativeMethodAccessorImpl.invoke0(Native Method)
	at sun.reflect.NativeMethodAccessorImpl.invoke(NativeMethodAccessorImpl.java:62)
	at sun.reflect.DelegatingMethodAccessorImpl.invoke(DelegatingMethodAccessorImpl.java:43)
	at java.lang.reflect.Method.invoke(Method.java:498)
	at org.testng.internal.MethodInvocationHelper.invokeMethod(MethodInvocationHelper.java:108)
	at org.testng.internal.Invoker.invokeMethod(Invoker.java:661)
	at org.testng.internal.Invoker.invokeTestMethod(Invoker.java:869)
	at org.testng.internal.Invoker.invokeTestMethods(Invoker.java:1193)
	at org.testng.internal.TestMethodWorker.invokeTestMethods(TestMethodWorker.java:126)
	at org.testng.internal.TestMethodWorker.run(TestMethodWorker.java:109)
	at org.testng.TestRunner.privateRun(TestRunner.java:744)
	at org.testng.TestRunner.run(TestRunner.java:602)
	at org.testng.SuiteRunner.runTest(SuiteRunner.java:380)
	at org.testng.SuiteRunner.runSequentially(SuiteRunner.java:375)
	at org.testng.SuiteRunner.privateRun(SuiteRunner.java:340)
	at org.testng.SuiteRunner.run(SuiteRunner.java:289)
	at org.testng.SuiteRunnerWorker.runSuite(SuiteRunnerWorker.java:52)
	at org.testng.SuiteRunnerWorker.run(SuiteRunnerWorker.java:86)
	at org.testng.TestNG.runSuitesSequentially(TestNG.java:1301)
	at org.testng.TestNG.runSuitesLocally(TestNG.java:1226)
	at org.testng.TestNG.runSuites(TestNG.java:1144)
	at org.testng.TestNG.run(TestNG.java:1115)
	at org.apache.maven.surefire.testng.TestNGExecutor.run(TestNGExecutor.java:281)
	at org.apache.maven.surefire.testng.TestNGXmlTestSuite.execute(TestNGXmlTestSuite.java:75)
	at org.apache.maven.surefire.testng.TestNGProvider.invoke(TestNGProvider.java:121)
	at org.apache.maven.surefire.booter.ForkedBooter.invokeProviderInSameClassLoader(ForkedBooter.java:290)
	at org.apache.maven.surefire.booter.ForkedBooter.runSuitesInProcess(ForkedBooter.java:242)
	at org.apache.maven.surefire.booter.ForkedBooter.main(ForkedBooter.java:121)
Caused by: org.xdi.oxauth.model.exception.InvalidJweException: org.bouncycastle.crypto.InvalidCipherTextException: checksum failed
	at org.xdi.oxauth.model.jwe.JweDecrypterImpl.decryptEncryptionKey(JweDecrypterImpl.java:126)
	at org.xdi.oxauth.model.jwe.AbstractJweDecrypter.decrypt(AbstractJweDecrypter.java:79)
	at org.xdi.oxauth.model.jwe.Jwe.parse(Jwe.java:91)
	at org.xdi.oxauth.ws.rs.TokenEncryptionHttpTest.requestIdTokenAlgA256KWEncA256GCM(TokenEncryptionHttpTest.java:400)
	... 28 more
Caused by: org.bouncycastle.crypto.InvalidCipherTextException: checksum failed
	at org.bouncycastle.crypto.engines.RFC3394WrapEngine.unwrap(Unknown Source)
	at org.xdi.oxauth.model.jwe.JweDecrypterImpl.decryptEncryptionKey(JweDecrypterImpl.java:105)
	... 31 more

requestUserInfoAdditionalClaims(org.xdi.oxauth.ws.rs.UserInfoRestWebServiceHttpTest)  Time elapsed: 1.198 sec  <<< FAILURE!
java.lang.AssertionError: Unexpected result: iname not found expected object to not be null
	at org.testng.Assert.fail(Assert.java:93)
	at org.testng.Assert.assertNotNull(Assert.java:422)
	at org.xdi.oxauth.ws.rs.UserInfoRestWebServiceHttpTest.requestUserInfoAdditionalClaims(UserInfoRestWebServiceHttpTest.java:464)
	at sun.reflect.NativeMethodAccessorImpl.invoke0(Native Method)
	at sun.reflect.NativeMethodAccessorImpl.invoke(NativeMethodAccessorImpl.java:62)
	at sun.reflect.DelegatingMethodAccessorImpl.invoke(DelegatingMethodAccessorImpl.java:43)
	at java.lang.reflect.Method.invoke(Method.java:498)
	at org.testng.internal.MethodInvocationHelper.invokeMethod(MethodInvocationHelper.java:108)
	at org.testng.internal.Invoker.invokeMethod(Invoker.java:661)
	at org.testng.internal.Invoker.invokeTestMethod(Invoker.java:869)
	at org.testng.internal.Invoker.invokeTestMethods(Invoker.java:1193)
	at org.testng.internal.TestMethodWorker.invokeTestMethods(TestMethodWorker.java:126)
	at org.testng.internal.TestMethodWorker.run(TestMethodWorker.java:109)
	at org.testng.TestRunner.privateRun(TestRunner.java:744)
	at org.testng.TestRunner.run(TestRunner.java:602)
	at org.testng.SuiteRunner.runTest(SuiteRunner.java:380)
	at org.testng.SuiteRunner.runSequentially(SuiteRunner.java:375)
	at org.testng.SuiteRunner.privateRun(SuiteRunner.java:340)
	at org.testng.SuiteRunner.run(SuiteRunner.java:289)
	at org.testng.SuiteRunnerWorker.runSuite(SuiteRunnerWorker.java:52)
	at org.testng.SuiteRunnerWorker.run(SuiteRunnerWorker.java:86)
	at org.testng.TestNG.runSuitesSequentially(TestNG.java:1301)
	at org.testng.TestNG.runSuitesLocally(TestNG.java:1226)
	at org.testng.TestNG.runSuites(TestNG.java:1144)
	at org.testng.TestNG.run(TestNG.java:1115)
	at org.apache.maven.surefire.testng.TestNGExecutor.run(TestNGExecutor.java:281)
	at org.apache.maven.surefire.testng.TestNGXmlTestSuite.execute(TestNGXmlTestSuite.java:75)
	at org.apache.maven.surefire.testng.TestNGProvider.invoke(TestNGProvider.java:121)
	at org.apache.maven.surefire.booter.ForkedBooter.invokeProviderInSameClassLoader(ForkedBooter.java:290)
	at org.apache.maven.surefire.booter.ForkedBooter.runSuitesInProcess(ForkedBooter.java:242)
	at org.apache.maven.surefire.booter.ForkedBooter.main(ForkedBooter.java:121)

requestUserInfoAlgA128KWEncA128GCM(org.xdi.oxauth.ws.rs.UserInfoRestWebServiceHttpTest)  Time elapsed: 1.126 sec  <<< FAILURE!
java.lang.AssertionError: expected object to not be null
	at org.testng.Assert.fail(Assert.java:93)
	at org.testng.Assert.assertNotNull(Assert.java:422)
	at org.testng.Assert.assertNotNull(Assert.java:407)
	at org.xdi.oxauth.ws.rs.UserInfoRestWebServiceHttpTest.requestUserInfoAlgA128KWEncA128GCM(UserInfoRestWebServiceHttpTest.java:1354)
	at sun.reflect.NativeMethodAccessorImpl.invoke0(Native Method)
	at sun.reflect.NativeMethodAccessorImpl.invoke(NativeMethodAccessorImpl.java:62)
	at sun.reflect.DelegatingMethodAccessorImpl.invoke(DelegatingMethodAccessorImpl.java:43)
	at java.lang.reflect.Method.invoke(Method.java:498)
	at org.testng.internal.MethodInvocationHelper.invokeMethod(MethodInvocationHelper.java:108)
	at org.testng.internal.Invoker.invokeMethod(Invoker.java:661)
	at org.testng.internal.Invoker.invokeTestMethod(Invoker.java:869)
	at org.testng.internal.Invoker.invokeTestMethods(Invoker.java:1193)
	at org.testng.internal.TestMethodWorker.invokeTestMethods(TestMethodWorker.java:126)
	at org.testng.internal.TestMethodWorker.run(TestMethodWorker.java:109)
	at org.testng.TestRunner.privateRun(TestRunner.java:744)
	at org.testng.TestRunner.run(TestRunner.java:602)
	at org.testng.SuiteRunner.runTest(SuiteRunner.java:380)
	at org.testng.SuiteRunner.runSequentially(SuiteRunner.java:375)
	at org.testng.SuiteRunner.privateRun(SuiteRunner.java:340)
	at org.testng.SuiteRunner.run(SuiteRunner.java:289)
	at org.testng.SuiteRunnerWorker.runSuite(SuiteRunnerWorker.java:52)
	at org.testng.SuiteRunnerWorker.run(SuiteRunnerWorker.java:86)
	at org.testng.TestNG.runSuitesSequentially(TestNG.java:1301)
	at org.testng.TestNG.runSuitesLocally(TestNG.java:1226)
	at org.testng.TestNG.runSuites(TestNG.java:1144)
	at org.testng.TestNG.run(TestNG.java:1115)
	at org.apache.maven.surefire.testng.TestNGExecutor.run(TestNGExecutor.java:281)
	at org.apache.maven.surefire.testng.TestNGXmlTestSuite.execute(TestNGXmlTestSuite.java:75)
	at org.apache.maven.surefire.testng.TestNGProvider.invoke(TestNGProvider.java:121)
	at org.apache.maven.surefire.booter.ForkedBooter.invokeProviderInSameClassLoader(ForkedBooter.java:290)
	at org.apache.maven.surefire.booter.ForkedBooter.runSuitesInProcess(ForkedBooter.java:242)
	at org.apache.maven.surefire.booter.ForkedBooter.main(ForkedBooter.java:121)

requestUserInfoAlgA256KWEncA256GCM(org.xdi.oxauth.ws.rs.UserInfoRestWebServiceHttpTest)  Time elapsed: 1.163 sec  <<< FAILURE!
java.lang.AssertionError: expected object to not be null
	at org.testng.Assert.fail(Assert.java:93)
	at org.testng.Assert.assertNotNull(Assert.java:422)
	at org.testng.Assert.assertNotNull(Assert.java:407)
	at org.xdi.oxauth.ws.rs.UserInfoRestWebServiceHttpTest.requestUserInfoAlgA256KWEncA256GCM(UserInfoRestWebServiceHttpTest.java:1412)
	at sun.reflect.NativeMethodAccessorImpl.invoke0(Native Method)
	at sun.reflect.NativeMethodAccessorImpl.invoke(NativeMethodAccessorImpl.java:62)
	at sun.reflect.DelegatingMethodAccessorImpl.invoke(DelegatingMethodAccessorImpl.java:43)
	at java.lang.reflect.Method.invoke(Method.java:498)
	at org.testng.internal.MethodInvocationHelper.invokeMethod(MethodInvocationHelper.java:108)
	at org.testng.internal.Invoker.invokeMethod(Invoker.java:661)
	at org.testng.internal.Invoker.invokeTestMethod(Invoker.java:869)
	at org.testng.internal.Invoker.invokeTestMethods(Invoker.java:1193)
	at org.testng.internal.TestMethodWorker.invokeTestMethods(TestMethodWorker.java:126)
	at org.testng.internal.TestMethodWorker.run(TestMethodWorker.java:109)
	at org.testng.TestRunner.privateRun(TestRunner.java:744)
	at org.testng.TestRunner.run(TestRunner.java:602)
	at org.testng.SuiteRunner.runTest(SuiteRunner.java:380)
	at org.testng.SuiteRunner.runSequentially(SuiteRunner.java:375)
	at org.testng.SuiteRunner.privateRun(SuiteRunner.java:340)
	at org.testng.SuiteRunner.run(SuiteRunner.java:289)
	at org.testng.SuiteRunnerWorker.runSuite(SuiteRunnerWorker.java:52)
	at org.testng.SuiteRunnerWorker.run(SuiteRunnerWorker.java:86)
	at org.testng.TestNG.runSuitesSequentially(TestNG.java:1301)
	at org.testng.TestNG.runSuitesLocally(TestNG.java:1226)
	at org.testng.TestNG.runSuites(TestNG.java:1144)
	at org.testng.TestNG.run(TestNG.java:1115)
	at org.apache.maven.surefire.testng.TestNGExecutor.run(TestNGExecutor.java:281)
	at org.apache.maven.surefire.testng.TestNGXmlTestSuite.execute(TestNGXmlTestSuite.java:75)
	at org.apache.maven.surefire.testng.TestNGProvider.invoke(TestNGProvider.java:121)
	at org.apache.maven.surefire.booter.ForkedBooter.invokeProviderInSameClassLoader(ForkedBooter.java:290)
	at org.apache.maven.surefire.booter.ForkedBooter.runSuitesInProcess(ForkedBooter.java:242)
	at org.apache.maven.surefire.booter.ForkedBooter.main(ForkedBooter.java:121)

canProvideEncryptedIdTokenResponseAlgA128KWEncA128GCM(org.xdi.oxauth.interop.CanProvideEncryptedIdTokenResponse)  Time elapsed: 1.15 sec  <<< FAILURE!
java.lang.AssertionError: org.bouncycastle.crypto.InvalidCipherTextException: checksum failed
	at org.testng.Assert.fail(Assert.java:82)
	at org.xdi.oxauth.interop.CanProvideEncryptedIdTokenResponse.canProvideEncryptedIdTokenResponseAlgA128KWEncA128GCM(CanProvideEncryptedIdTokenResponse.java:104)
	at sun.reflect.NativeMethodAccessorImpl.invoke0(Native Method)
	at sun.reflect.NativeMethodAccessorImpl.invoke(NativeMethodAccessorImpl.java:62)
	at sun.reflect.DelegatingMethodAccessorImpl.invoke(DelegatingMethodAccessorImpl.java:43)
	at java.lang.reflect.Method.invoke(Method.java:498)
	at org.testng.internal.MethodInvocationHelper.invokeMethod(MethodInvocationHelper.java:108)
	at org.testng.internal.Invoker.invokeMethod(Invoker.java:661)
	at org.testng.internal.Invoker.invokeTestMethod(Invoker.java:869)
	at org.testng.internal.Invoker.invokeTestMethods(Invoker.java:1193)
	at org.testng.internal.TestMethodWorker.invokeTestMethods(TestMethodWorker.java:126)
	at org.testng.internal.TestMethodWorker.run(TestMethodWorker.java:109)
	at org.testng.TestRunner.privateRun(TestRunner.java:744)
	at org.testng.TestRunner.run(TestRunner.java:602)
	at org.testng.SuiteRunner.runTest(SuiteRunner.java:380)
	at org.testng.SuiteRunner.runSequentially(SuiteRunner.java:375)
	at org.testng.SuiteRunner.privateRun(SuiteRunner.java:340)
	at org.testng.SuiteRunner.run(SuiteRunner.java:289)
	at org.testng.SuiteRunnerWorker.runSuite(SuiteRunnerWorker.java:52)
	at org.testng.SuiteRunnerWorker.run(SuiteRunnerWorker.java:86)
	at org.testng.TestNG.runSuitesSequentially(TestNG.java:1301)
	at org.testng.TestNG.runSuitesLocally(TestNG.java:1226)
	at org.testng.TestNG.runSuites(TestNG.java:1144)
	at org.testng.TestNG.run(TestNG.java:1115)
	at org.apache.maven.surefire.testng.TestNGExecutor.run(TestNGExecutor.java:281)
	at org.apache.maven.surefire.testng.TestNGXmlTestSuite.execute(TestNGXmlTestSuite.java:75)
	at org.apache.maven.surefire.testng.TestNGProvider.invoke(TestNGProvider.java:121)
	at org.apache.maven.surefire.booter.ForkedBooter.invokeProviderInSameClassLoader(ForkedBooter.java:290)
	at org.apache.maven.surefire.booter.ForkedBooter.runSuitesInProcess(ForkedBooter.java:242)
	at org.apache.maven.surefire.booter.ForkedBooter.main(ForkedBooter.java:121)
Caused by: org.xdi.oxauth.model.exception.InvalidJweException: org.bouncycastle.crypto.InvalidCipherTextException: checksum failed
	at org.xdi.oxauth.model.jwe.JweDecrypterImpl.decryptEncryptionKey(JweDecrypterImpl.java:126)
	at org.xdi.oxauth.model.jwe.AbstractJweDecrypter.decrypt(AbstractJweDecrypter.java:79)
	at org.xdi.oxauth.model.jwe.Jwe.parse(Jwe.java:91)
	at org.xdi.oxauth.interop.CanProvideEncryptedIdTokenResponse.canProvideEncryptedIdTokenResponseAlgA128KWEncA128GCM(CanProvideEncryptedIdTokenResponse.java:95)
	... 28 more
Caused by: org.bouncycastle.crypto.InvalidCipherTextException: checksum failed
	at org.bouncycastle.crypto.engines.RFC3394WrapEngine.unwrap(Unknown Source)
	at org.xdi.oxauth.model.jwe.JweDecrypterImpl.decryptEncryptionKey(JweDecrypterImpl.java:105)
	... 31 more

canProvideEncryptedIdTokenResponseAlgA256KWEncA256GCM(org.xdi.oxauth.interop.CanProvideEncryptedIdTokenResponse)  Time elapsed: 1.111 sec  <<< FAILURE!
java.lang.AssertionError: org.bouncycastle.crypto.InvalidCipherTextException: checksum failed
	at org.testng.Assert.fail(Assert.java:82)
	at org.xdi.oxauth.interop.CanProvideEncryptedIdTokenResponse.canProvideEncryptedIdTokenResponseAlgA256KWEncA256GCM(CanProvideEncryptedIdTokenResponse.java:173)
	at sun.reflect.NativeMethodAccessorImpl.invoke0(Native Method)
	at sun.reflect.NativeMethodAccessorImpl.invoke(NativeMethodAccessorImpl.java:62)
	at sun.reflect.DelegatingMethodAccessorImpl.invoke(DelegatingMethodAccessorImpl.java:43)
	at java.lang.reflect.Method.invoke(Method.java:498)
	at org.testng.internal.MethodInvocationHelper.invokeMethod(MethodInvocationHelper.java:108)
	at org.testng.internal.Invoker.invokeMethod(Invoker.java:661)
	at org.testng.internal.Invoker.invokeTestMethod(Invoker.java:869)
	at org.testng.internal.Invoker.invokeTestMethods(Invoker.java:1193)
	at org.testng.internal.TestMethodWorker.invokeTestMethods(TestMethodWorker.java:126)
	at org.testng.internal.TestMethodWorker.run(TestMethodWorker.java:109)
	at org.testng.TestRunner.privateRun(TestRunner.java:744)
	at org.testng.TestRunner.run(TestRunner.java:602)
	at org.testng.SuiteRunner.runTest(SuiteRunner.java:380)
	at org.testng.SuiteRunner.runSequentially(SuiteRunner.java:375)
	at org.testng.SuiteRunner.privateRun(SuiteRunner.java:340)
	at org.testng.SuiteRunner.run(SuiteRunner.java:289)
	at org.testng.SuiteRunnerWorker.runSuite(SuiteRunnerWorker.java:52)
	at org.testng.SuiteRunnerWorker.run(SuiteRunnerWorker.java:86)
	at org.testng.TestNG.runSuitesSequentially(TestNG.java:1301)
	at org.testng.TestNG.runSuitesLocally(TestNG.java:1226)
	at org.testng.TestNG.runSuites(TestNG.java:1144)
	at org.testng.TestNG.run(TestNG.java:1115)
	at org.apache.maven.surefire.testng.TestNGExecutor.run(TestNGExecutor.java:281)
	at org.apache.maven.surefire.testng.TestNGXmlTestSuite.execute(TestNGXmlTestSuite.java:75)
	at org.apache.maven.surefire.testng.TestNGProvider.invoke(TestNGProvider.java:121)
	at org.apache.maven.surefire.booter.ForkedBooter.invokeProviderInSameClassLoader(ForkedBooter.java:290)
	at org.apache.maven.surefire.booter.ForkedBooter.runSuitesInProcess(ForkedBooter.java:242)
	at org.apache.maven.surefire.booter.ForkedBooter.main(ForkedBooter.java:121)
Caused by: org.xdi.oxauth.model.exception.InvalidJweException: org.bouncycastle.crypto.InvalidCipherTextException: checksum failed
	at org.xdi.oxauth.model.jwe.JweDecrypterImpl.decryptEncryptionKey(JweDecrypterImpl.java:126)
	at org.xdi.oxauth.model.jwe.AbstractJweDecrypter.decrypt(AbstractJweDecrypter.java:79)
	at org.xdi.oxauth.model.jwe.Jwe.parse(Jwe.java:91)
	at org.xdi.oxauth.interop.CanProvideEncryptedIdTokenResponse.canProvideEncryptedIdTokenResponseAlgA256KWEncA256GCM(CanProvideEncryptedIdTokenResponse.java:164)
	... 28 more
Caused by: org.bouncycastle.crypto.InvalidCipherTextException: checksum failed
	at org.bouncycastle.crypto.engines.RFC3394WrapEngine.unwrap(Unknown Source)
	at org.xdi.oxauth.model.jwe.JweDecrypterImpl.decryptEncryptionKey(JweDecrypterImpl.java:105)
	... 31 more

canProvideEncryptedUserInfoResponseAlgA128KWEncA128GCM(org.xdi.oxauth.interop.CanProvideEncryptedUserInfoResponse)  Time elapsed: 1.366 sec  <<< FAILURE!
java.lang.AssertionError: expected object to not be null
	at org.testng.Assert.fail(Assert.java:93)
	at org.testng.Assert.assertNotNull(Assert.java:422)
	at org.testng.Assert.assertNotNull(Assert.java:407)
	at org.xdi.oxauth.interop.CanProvideEncryptedUserInfoResponse.canProvideEncryptedUserInfoResponseAlgA128KWEncA128GCM(CanProvideEncryptedUserInfoResponse.java:97)
	at sun.reflect.NativeMethodAccessorImpl.invoke0(Native Method)
	at sun.reflect.NativeMethodAccessorImpl.invoke(NativeMethodAccessorImpl.java:62)
	at sun.reflect.DelegatingMethodAccessorImpl.invoke(DelegatingMethodAccessorImpl.java:43)
	at java.lang.reflect.Method.invoke(Method.java:498)
	at org.testng.internal.MethodInvocationHelper.invokeMethod(MethodInvocationHelper.java:108)
	at org.testng.internal.Invoker.invokeMethod(Invoker.java:661)
	at org.testng.internal.Invoker.invokeTestMethod(Invoker.java:869)
	at org.testng.internal.Invoker.invokeTestMethods(Invoker.java:1193)
	at org.testng.internal.TestMethodWorker.invokeTestMethods(TestMethodWorker.java:126)
	at org.testng.internal.TestMethodWorker.run(TestMethodWorker.java:109)
	at org.testng.TestRunner.privateRun(TestRunner.java:744)
	at org.testng.TestRunner.run(TestRunner.java:602)
	at org.testng.SuiteRunner.runTest(SuiteRunner.java:380)
	at org.testng.SuiteRunner.runSequentially(SuiteRunner.java:375)
	at org.testng.SuiteRunner.privateRun(SuiteRunner.java:340)
	at org.testng.SuiteRunner.run(SuiteRunner.java:289)
	at org.testng.SuiteRunnerWorker.runSuite(SuiteRunnerWorker.java:52)
	at org.testng.SuiteRunnerWorker.run(SuiteRunnerWorker.java:86)
	at org.testng.TestNG.runSuitesSequentially(TestNG.java:1301)
	at org.testng.TestNG.runSuitesLocally(TestNG.java:1226)
	at org.testng.TestNG.runSuites(TestNG.java:1144)
	at org.testng.TestNG.run(TestNG.java:1115)
	at org.apache.maven.surefire.testng.TestNGExecutor.run(TestNGExecutor.java:281)
	at org.apache.maven.surefire.testng.TestNGXmlTestSuite.execute(TestNGXmlTestSuite.java:75)
	at org.apache.maven.surefire.testng.TestNGProvider.invoke(TestNGProvider.java:121)
	at org.apache.maven.surefire.booter.ForkedBooter.invokeProviderInSameClassLoader(ForkedBooter.java:290)
	at org.apache.maven.surefire.booter.ForkedBooter.runSuitesInProcess(ForkedBooter.java:242)
	at org.apache.maven.surefire.booter.ForkedBooter.main(ForkedBooter.java:121)

canProvideEncryptedUserInfoResponseAlgA256KWEncA256GCM(org.xdi.oxauth.interop.CanProvideEncryptedUserInfoResponse)  Time elapsed: 1.295 sec  <<< FAILURE!
java.lang.AssertionError: expected object to not be null
	at org.testng.Assert.fail(Assert.java:93)
	at org.testng.Assert.assertNotNull(Assert.java:422)
	at org.testng.Assert.assertNotNull(Assert.java:407)
	at org.xdi.oxauth.interop.CanProvideEncryptedUserInfoResponse.canProvideEncryptedUserInfoResponseAlgA256KWEncA256GCM(CanProvideEncryptedUserInfoResponse.java:171)
	at sun.reflect.NativeMethodAccessorImpl.invoke0(Native Method)
	at sun.reflect.NativeMethodAccessorImpl.invoke(NativeMethodAccessorImpl.java:62)
	at sun.reflect.DelegatingMethodAccessorImpl.invoke(DelegatingMethodAccessorImpl.java:43)
	at java.lang.reflect.Method.invoke(Method.java:498)
	at org.testng.internal.MethodInvocationHelper.invokeMethod(MethodInvocationHelper.java:108)
	at org.testng.internal.Invoker.invokeMethod(Invoker.java:661)
	at org.testng.internal.Invoker.invokeTestMethod(Invoker.java:869)
	at org.testng.internal.Invoker.invokeTestMethods(Invoker.java:1193)
	at org.testng.internal.TestMethodWorker.invokeTestMethods(TestMethodWorker.java:126)
	at org.testng.internal.TestMethodWorker.run(TestMethodWorker.java:109)
	at org.testng.TestRunner.privateRun(TestRunner.java:744)
	at org.testng.TestRunner.run(TestRunner.java:602)
	at org.testng.SuiteRunner.runTest(SuiteRunner.java:380)
	at org.testng.SuiteRunner.runSequentially(SuiteRunner.java:375)
	at org.testng.SuiteRunner.privateRun(SuiteRunner.java:340)
	at org.testng.SuiteRunner.run(SuiteRunner.java:289)
	at org.testng.SuiteRunnerWorker.runSuite(SuiteRunnerWorker.java:52)
	at org.testng.SuiteRunnerWorker.run(SuiteRunnerWorker.java:86)
	at org.testng.TestNG.runSuitesSequentially(TestNG.java:1301)
	at org.testng.TestNG.runSuitesLocally(TestNG.java:1226)
	at org.testng.TestNG.runSuites(TestNG.java:1144)
	at org.testng.TestNG.run(TestNG.java:1115)
	at org.apache.maven.surefire.testng.TestNGExecutor.run(TestNGExecutor.java:281)
	at org.apache.maven.surefire.testng.TestNGXmlTestSuite.execute(TestNGXmlTestSuite.java:75)
	at org.apache.maven.surefire.testng.TestNGProvider.invoke(TestNGProvider.java:121)
	at org.apache.maven.surefire.booter.ForkedBooter.invokeProviderInSameClassLoader(ForkedBooter.java:290)
	at org.apache.maven.surefire.booter.ForkedBooter.runSuitesInProcess(ForkedBooter.java:242)
	at org.apache.maven.surefire.booter.ForkedBooter.main(ForkedBooter.java:121)

canRequestAndUseEncryptedIdTokenResponse(org.xdi.oxauth.interop.CanRequestAndUseEncryptedIdTokenResponse)  Time elapsed: 1.121 sec  <<< FAILURE!
org.xdi.oxauth.model.exception.InvalidJweException: org.bouncycastle.crypto.InvalidCipherTextException: checksum failed
	at org.xdi.oxauth.model.jwe.JweDecrypterImpl.decryptEncryptionKey(JweDecrypterImpl.java:126)
	at org.xdi.oxauth.model.jwe.AbstractJweDecrypter.decrypt(AbstractJweDecrypter.java:79)
	at org.xdi.oxauth.model.jwe.Jwe.parse(Jwe.java:91)
	at org.xdi.oxauth.interop.CanRequestAndUseEncryptedIdTokenResponse.canRequestAndUseEncryptedIdTokenResponse(CanRequestAndUseEncryptedIdTokenResponse.java:93)
	at sun.reflect.NativeMethodAccessorImpl.invoke0(Native Method)
	at sun.reflect.NativeMethodAccessorImpl.invoke(NativeMethodAccessorImpl.java:62)
	at sun.reflect.DelegatingMethodAccessorImpl.invoke(DelegatingMethodAccessorImpl.java:43)
	at java.lang.reflect.Method.invoke(Method.java:498)
	at org.testng.internal.MethodInvocationHelper.invokeMethod(MethodInvocationHelper.java:108)
	at org.testng.internal.Invoker.invokeMethod(Invoker.java:661)
	at org.testng.internal.Invoker.invokeTestMethod(Invoker.java:869)
	at org.testng.internal.Invoker.invokeTestMethods(Invoker.java:1193)
	at org.testng.internal.TestMethodWorker.invokeTestMethods(TestMethodWorker.java:126)
	at org.testng.internal.TestMethodWorker.run(TestMethodWorker.java:109)
	at org.testng.TestRunner.privateRun(TestRunner.java:744)
	at org.testng.TestRunner.run(TestRunner.java:602)
	at org.testng.SuiteRunner.runTest(SuiteRunner.java:380)
	at org.testng.SuiteRunner.runSequentially(SuiteRunner.java:375)
	at org.testng.SuiteRunner.privateRun(SuiteRunner.java:340)
	at org.testng.SuiteRunner.run(SuiteRunner.java:289)
	at org.testng.SuiteRunnerWorker.runSuite(SuiteRunnerWorker.java:52)
	at org.testng.SuiteRunnerWorker.run(SuiteRunnerWorker.java:86)
	at org.testng.TestNG.runSuitesSequentially(TestNG.java:1301)
	at org.testng.TestNG.runSuitesLocally(TestNG.java:1226)
	at org.testng.TestNG.runSuites(TestNG.java:1144)
	at org.testng.TestNG.run(TestNG.java:1115)
	at org.apache.maven.surefire.testng.TestNGExecutor.run(TestNGExecutor.java:281)
	at org.apache.maven.surefire.testng.TestNGXmlTestSuite.execute(TestNGXmlTestSuite.java:75)
	at org.apache.maven.surefire.testng.TestNGProvider.invoke(TestNGProvider.java:121)
	at org.apache.maven.surefire.booter.ForkedBooter.invokeProviderInSameClassLoader(ForkedBooter.java:290)
	at org.apache.maven.surefire.booter.ForkedBooter.runSuitesInProcess(ForkedBooter.java:242)
	at org.apache.maven.surefire.booter.ForkedBooter.main(ForkedBooter.java:121)
Caused by: org.bouncycastle.crypto.InvalidCipherTextException: checksum failed
	at org.bouncycastle.crypto.engines.RFC3394WrapEngine.unwrap(Unknown Source)
	at org.xdi.oxauth.model.jwe.JweDecrypterImpl.decryptEncryptionKey(JweDecrypterImpl.java:105)
	... 31 more

providingIndividuallyRequestedEssentialAndVoluntaryClaims(org.xdi.oxauth.interop.ProvidingIndividuallyRequestedEssentialAndVoluntaryClaims)  Time elapsed: 1.157 sec  <<< FAILURE!
java.lang.AssertionError: expected object to not be null
	at org.testng.Assert.fail(Assert.java:93)
	at org.testng.Assert.assertNotNull(Assert.java:422)
	at org.testng.Assert.assertNotNull(Assert.java:407)
	at org.xdi.oxauth.interop.ProvidingIndividuallyRequestedEssentialAndVoluntaryClaims.providingIndividuallyRequestedEssentialAndVoluntaryClaims(ProvidingIndividuallyRequestedEssentialAndVoluntaryClaims.java:118)
	at sun.reflect.NativeMethodAccessorImpl.invoke0(Native Method)
	at sun.reflect.NativeMethodAccessorImpl.invoke(NativeMethodAccessorImpl.java:62)
	at sun.reflect.DelegatingMethodAccessorImpl.invoke(DelegatingMethodAccessorImpl.java:43)
	at java.lang.reflect.Method.invoke(Method.java:498)
	at org.testng.internal.MethodInvocationHelper.invokeMethod(MethodInvocationHelper.java:108)
	at org.testng.internal.Invoker.invokeMethod(Invoker.java:661)
	at org.testng.internal.Invoker.invokeTestMethod(Invoker.java:869)
	at org.testng.internal.Invoker.invokeTestMethods(Invoker.java:1193)
	at org.testng.internal.TestMethodWorker.invokeTestMethods(TestMethodWorker.java:126)
	at org.testng.internal.TestMethodWorker.run(TestMethodWorker.java:109)
	at org.testng.TestRunner.privateRun(TestRunner.java:744)
	at org.testng.TestRunner.run(TestRunner.java:602)
	at org.testng.SuiteRunner.runTest(SuiteRunner.java:380)
	at org.testng.SuiteRunner.runSequentially(SuiteRunner.java:375)
	at org.testng.SuiteRunner.privateRun(SuiteRunner.java:340)
	at org.testng.SuiteRunner.run(SuiteRunner.java:289)
	at org.testng.SuiteRunnerWorker.runSuite(SuiteRunnerWorker.java:52)
	at org.testng.SuiteRunnerWorker.run(SuiteRunnerWorker.java:86)
	at org.testng.TestNG.runSuitesSequentially(TestNG.java:1301)
	at org.testng.TestNG.runSuitesLocally(TestNG.java:1226)
	at org.testng.TestNG.runSuites(TestNG.java:1144)
	at org.testng.TestNG.run(TestNG.java:1115)
	at org.apache.maven.surefire.testng.TestNGExecutor.run(TestNGExecutor.java:281)
	at org.apache.maven.surefire.testng.TestNGXmlTestSuite.execute(TestNGXmlTestSuite.java:75)
	at org.apache.maven.surefire.testng.TestNGProvider.invoke(TestNGProvider.java:121)
	at org.apache.maven.surefire.booter.ForkedBooter.invokeProviderInSameClassLoader(ForkedBooter.java:290)
	at org.apache.maven.surefire.booter.ForkedBooter.runSuitesInProcess(ForkedBooter.java:242)
	at org.apache.maven.surefire.booter.ForkedBooter.main(ForkedBooter.java:121)

providingIndividuallyRequestedEssentialClaims(org.xdi.oxauth.interop.ProvidingIndividuallyRequestedEssentialClaims)  Time elapsed: 1.122 sec  <<< FAILURE!
java.lang.AssertionError: expected object to not be null
	at org.testng.Assert.fail(Assert.java:93)
	at org.testng.Assert.assertNotNull(Assert.java:422)
	at org.testng.Assert.assertNotNull(Assert.java:407)
	at org.xdi.oxauth.interop.ProvidingIndividuallyRequestedEssentialClaims.providingIndividuallyRequestedEssentialClaims(ProvidingIndividuallyRequestedEssentialClaims.java:114)
	at sun.reflect.NativeMethodAccessorImpl.invoke0(Native Method)
	at sun.reflect.NativeMethodAccessorImpl.invoke(NativeMethodAccessorImpl.java:62)
	at sun.reflect.DelegatingMethodAccessorImpl.invoke(DelegatingMethodAccessorImpl.java:43)
	at java.lang.reflect.Method.invoke(Method.java:498)
	at org.testng.internal.MethodInvocationHelper.invokeMethod(MethodInvocationHelper.java:108)
	at org.testng.internal.Invoker.invokeMethod(Invoker.java:661)
	at org.testng.internal.Invoker.invokeTestMethod(Invoker.java:869)
	at org.testng.internal.Invoker.invokeTestMethods(Invoker.java:1193)
	at org.testng.internal.TestMethodWorker.invokeTestMethods(TestMethodWorker.java:126)
	at org.testng.internal.TestMethodWorker.run(TestMethodWorker.java:109)
	at org.testng.TestRunner.privateRun(TestRunner.java:744)
	at org.testng.TestRunner.run(TestRunner.java:602)
	at org.testng.SuiteRunner.runTest(SuiteRunner.java:380)
	at org.testng.SuiteRunner.runSequentially(SuiteRunner.java:375)
	at org.testng.SuiteRunner.privateRun(SuiteRunner.java:340)
	at org.testng.SuiteRunner.run(SuiteRunner.java:289)
	at org.testng.SuiteRunnerWorker.runSuite(SuiteRunnerWorker.java:52)
	at org.testng.SuiteRunnerWorker.run(SuiteRunnerWorker.java:86)
	at org.testng.TestNG.runSuitesSequentially(TestNG.java:1301)
	at org.testng.TestNG.runSuitesLocally(TestNG.java:1226)
	at org.testng.TestNG.runSuites(TestNG.java:1144)
	at org.testng.TestNG.run(TestNG.java:1115)
	at org.apache.maven.surefire.testng.TestNGExecutor.run(TestNGExecutor.java:281)
	at org.apache.maven.surefire.testng.TestNGXmlTestSuite.execute(TestNGXmlTestSuite.java:75)
	at org.apache.maven.surefire.testng.TestNGProvider.invoke(TestNGProvider.java:121)
	at org.apache.maven.surefire.booter.ForkedBooter.invokeProviderInSameClassLoader(ForkedBooter.java:290)
	at org.apache.maven.surefire.booter.ForkedBooter.runSuitesInProcess(ForkedBooter.java:242)
	at org.apache.maven.surefire.booter.ForkedBooter.main(ForkedBooter.java:121)

providingIndividuallyRequestedVoluntaryClaims(org.xdi.oxauth.interop.ProvidingIndividuallyRequestedVoluntaryClaims)  Time elapsed: 1.136 sec  <<< FAILURE!
java.lang.AssertionError: expected object to not be null
	at org.testng.Assert.fail(Assert.java:93)
	at org.testng.Assert.assertNotNull(Assert.java:422)
	at org.testng.Assert.assertNotNull(Assert.java:407)
	at org.xdi.oxauth.interop.ProvidingIndividuallyRequestedVoluntaryClaims.providingIndividuallyRequestedVoluntaryClaims(ProvidingIndividuallyRequestedVoluntaryClaims.java:115)
	at sun.reflect.NativeMethodAccessorImpl.invoke0(Native Method)
	at sun.reflect.NativeMethodAccessorImpl.invoke(NativeMethodAccessorImpl.java:62)
	at sun.reflect.DelegatingMethodAccessorImpl.invoke(DelegatingMethodAccessorImpl.java:43)
	at java.lang.reflect.Method.invoke(Method.java:498)
	at org.testng.internal.MethodInvocationHelper.invokeMethod(MethodInvocationHelper.java:108)
	at org.testng.internal.Invoker.invokeMethod(Invoker.java:661)
	at org.testng.internal.Invoker.invokeTestMethod(Invoker.java:869)
	at org.testng.internal.Invoker.invokeTestMethods(Invoker.java:1193)
	at org.testng.internal.TestMethodWorker.invokeTestMethods(TestMethodWorker.java:126)
	at org.testng.internal.TestMethodWorker.run(TestMethodWorker.java:109)
	at org.testng.TestRunner.privateRun(TestRunner.java:744)
	at org.testng.TestRunner.run(TestRunner.java:602)
	at org.testng.SuiteRunner.runTest(SuiteRunner.java:380)
	at org.testng.SuiteRunner.runSequentially(SuiteRunner.java:375)
	at org.testng.SuiteRunner.privateRun(SuiteRunner.java:340)
	at org.testng.SuiteRunner.run(SuiteRunner.java:289)
	at org.testng.SuiteRunnerWorker.runSuite(SuiteRunnerWorker.java:52)
	at org.testng.SuiteRunnerWorker.run(SuiteRunnerWorker.java:86)
	at org.testng.TestNG.runSuitesSequentially(TestNG.java:1301)
	at org.testng.TestNG.runSuitesLocally(TestNG.java:1226)
	at org.testng.TestNG.runSuites(TestNG.java:1144)
	at org.testng.TestNG.run(TestNG.java:1115)
	at org.apache.maven.surefire.testng.TestNGExecutor.run(TestNGExecutor.java:281)
	at org.apache.maven.surefire.testng.TestNGXmlTestSuite.execute(TestNGXmlTestSuite.java:75)
	at org.apache.maven.surefire.testng.TestNGProvider.invoke(TestNGProvider.java:121)
	at org.apache.maven.surefire.booter.ForkedBooter.invokeProviderInSameClassLoader(ForkedBooter.java:290)
	at org.apache.maven.surefire.booter.ForkedBooter.runSuitesInProcess(ForkedBooter.java:242)
	at org.apache.maven.surefire.booter.ForkedBooter.main(ForkedBooter.java:121)

supportAuthenticationToTokenEndpointWithAsymmetricallySignedJWTsES512(org.xdi.oxauth.interop.SupportAuthenticationToTokenEndpointWithAsymmetricallySignedJWTs)  Time elapsed: 1.443 sec  <<< FAILURE!
java.lang.NullPointerException
	at org.xdi.oxauth.interop.SupportAuthenticationToTokenEndpointWithAsymmetricallySignedJWTs.supportAuthenticationToTokenEndpointWithAsymmetricallySignedJWTsES512(SupportAuthenticationToTokenEndpointWithAsymmetricallySignedJWTs.java:466)
	at sun.reflect.NativeMethodAccessorImpl.invoke0(Native Method)
	at sun.reflect.NativeMethodAccessorImpl.invoke(NativeMethodAccessorImpl.java:62)
	at sun.reflect.DelegatingMethodAccessorImpl.invoke(DelegatingMethodAccessorImpl.java:43)
	at java.lang.reflect.Method.invoke(Method.java:498)
	at org.testng.internal.MethodInvocationHelper.invokeMethod(MethodInvocationHelper.java:108)
	at org.testng.internal.Invoker.invokeMethod(Invoker.java:661)
	at org.testng.internal.Invoker.invokeTestMethod(Invoker.java:869)
	at org.testng.internal.Invoker.invokeTestMethods(Invoker.java:1193)
	at org.testng.internal.TestMethodWorker.invokeTestMethods(TestMethodWorker.java:126)
	at org.testng.internal.TestMethodWorker.run(TestMethodWorker.java:109)
	at org.testng.TestRunner.privateRun(TestRunner.java:744)
	at org.testng.TestRunner.run(TestRunner.java:602)
	at org.testng.SuiteRunner.runTest(SuiteRunner.java:380)
	at org.testng.SuiteRunner.runSequentially(SuiteRunner.java:375)
	at org.testng.SuiteRunner.privateRun(SuiteRunner.java:340)
	at org.testng.SuiteRunner.run(SuiteRunner.java:289)
	at org.testng.SuiteRunnerWorker.runSuite(SuiteRunnerWorker.java:52)
	at org.testng.SuiteRunnerWorker.run(SuiteRunnerWorker.java:86)
	at org.testng.TestNG.runSuitesSequentially(TestNG.java:1301)
	at org.testng.TestNG.runSuitesLocally(TestNG.java:1226)
	at org.testng.TestNG.runSuites(TestNG.java:1144)
	at org.testng.TestNG.run(TestNG.java:1115)
	at org.apache.maven.surefire.testng.TestNGExecutor.run(TestNGExecutor.java:281)
	at org.apache.maven.surefire.testng.TestNGXmlTestSuite.execute(TestNGXmlTestSuite.java:75)
	at org.apache.maven.surefire.testng.TestNGProvider.invoke(TestNGProvider.java:121)
	at org.apache.maven.surefire.booter.ForkedBooter.invokeProviderInSameClassLoader(ForkedBooter.java:290)
	at org.apache.maven.surefire.booter.ForkedBooter.runSuitesInProcess(ForkedBooter.java:242)
	at org.apache.maven.surefire.booter.ForkedBooter.main(ForkedBooter.java:121)

supportClaimsRequestSpecifyingSubValueSucceed(org.xdi.oxauth.interop.SupportClaimsRequestSpecifyingSubValue)  Time elapsed: 1.523 sec  <<< FAILURE!
java.lang.AssertionError: expected object to not be null
	at org.testng.Assert.fail(Assert.java:93)
	at org.testng.Assert.assertNotNull(Assert.java:422)
	at org.testng.Assert.assertNotNull(Assert.java:407)
	at org.xdi.oxauth.interop.SupportClaimsRequestSpecifyingSubValue.supportClaimsRequestSpecifyingSubValueSucceed(SupportClaimsRequestSpecifyingSubValue.java:153)
	at sun.reflect.NativeMethodAccessorImpl.invoke0(Native Method)
	at sun.reflect.NativeMethodAccessorImpl.invoke(NativeMethodAccessorImpl.java:62)
	at sun.reflect.DelegatingMethodAccessorImpl.invoke(DelegatingMethodAccessorImpl.java:43)
	at java.lang.reflect.Method.invoke(Method.java:498)
	at org.testng.internal.MethodInvocationHelper.invokeMethod(MethodInvocationHelper.java:108)
	at org.testng.internal.Invoker.invokeMethod(Invoker.java:661)
	at org.testng.internal.Invoker.invokeTestMethod(Invoker.java:869)
	at org.testng.internal.Invoker.invokeTestMethods(Invoker.java:1193)
	at org.testng.internal.TestMethodWorker.invokeTestMethods(TestMethodWorker.java:126)
	at org.testng.internal.TestMethodWorker.run(TestMethodWorker.java:109)
	at org.testng.TestRunner.privateRun(TestRunner.java:744)
	at org.testng.TestRunner.run(TestRunner.java:602)
	at org.testng.SuiteRunner.runTest(SuiteRunner.java:380)
	at org.testng.SuiteRunner.runSequentially(SuiteRunner.java:375)
	at org.testng.SuiteRunner.privateRun(SuiteRunner.java:340)
	at org.testng.SuiteRunner.run(SuiteRunner.java:289)
	at org.testng.SuiteRunnerWorker.runSuite(SuiteRunnerWorker.java:52)
	at org.testng.SuiteRunnerWorker.run(SuiteRunnerWorker.java:86)
	at org.testng.TestNG.runSuitesSequentially(TestNG.java:1301)
	at org.testng.TestNG.runSuitesLocally(TestNG.java:1226)
	at org.testng.TestNG.runSuites(TestNG.java:1144)
	at org.testng.TestNG.run(TestNG.java:1115)
	at org.apache.maven.surefire.testng.TestNGExecutor.run(TestNGExecutor.java:281)
	at org.apache.maven.surefire.testng.TestNGXmlTestSuite.execute(TestNGXmlTestSuite.java:75)
	at org.apache.maven.surefire.testng.TestNGProvider.invoke(TestNGProvider.java:121)
	at org.apache.maven.surefire.booter.ForkedBooter.invokeProviderInSameClassLoader(ForkedBooter.java:290)
	at org.apache.maven.surefire.booter.ForkedBooter.runSuitesInProcess(ForkedBooter.java:242)
	at org.apache.maven.surefire.booter.ForkedBooter.main(ForkedBooter.java:121)

supportsCombiningClaimsRequestedWithScopeAndRequestObject(org.xdi.oxauth.interop.SupportsCombiningClaimsRequestedWithScopeAndRequestObject)  Time elapsed: 1.334 sec  <<< FAILURE!
java.lang.AssertionError: expected object to not be null
	at org.testng.Assert.fail(Assert.java:93)
	at org.testng.Assert.assertNotNull(Assert.java:422)
	at org.testng.Assert.assertNotNull(Assert.java:407)
	at org.xdi.oxauth.interop.SupportsCombiningClaimsRequestedWithScopeAndRequestObject.supportsCombiningClaimsRequestedWithScopeAndRequestObject(SupportsCombiningClaimsRequestedWithScopeAndRequestObject.java:130)
	at sun.reflect.NativeMethodAccessorImpl.invoke0(Native Method)
	at sun.reflect.NativeMethodAccessorImpl.invoke(NativeMethodAccessorImpl.java:62)
	at sun.reflect.DelegatingMethodAccessorImpl.invoke(DelegatingMethodAccessorImpl.java:43)
	at java.lang.reflect.Method.invoke(Method.java:498)
	at org.testng.internal.MethodInvocationHelper.invokeMethod(MethodInvocationHelper.java:108)
	at org.testng.internal.Invoker.invokeMethod(Invoker.java:661)
	at org.testng.internal.Invoker.invokeTestMethod(Invoker.java:869)
	at org.testng.internal.Invoker.invokeTestMethods(Invoker.java:1193)
	at org.testng.internal.TestMethodWorker.invokeTestMethods(TestMethodWorker.java:126)
	at org.testng.internal.TestMethodWorker.run(TestMethodWorker.java:109)
	at org.testng.TestRunner.privateRun(TestRunner.java:744)
	at org.testng.TestRunner.run(TestRunner.java:602)
	at org.testng.SuiteRunner.runTest(SuiteRunner.java:380)
	at org.testng.SuiteRunner.runSequentially(SuiteRunner.java:375)
	at org.testng.SuiteRunner.privateRun(SuiteRunner.java:340)
	at org.testng.SuiteRunner.run(SuiteRunner.java:289)
	at org.testng.SuiteRunnerWorker.runSuite(SuiteRunnerWorker.java:52)
	at org.testng.SuiteRunnerWorker.run(SuiteRunnerWorker.java:86)
	at org.testng.TestNG.runSuitesSequentially(TestNG.java:1301)
	at org.testng.TestNG.runSuitesLocally(TestNG.java:1226)
	at org.testng.TestNG.runSuites(TestNG.java:1144)
	at org.testng.TestNG.run(TestNG.java:1115)
	at org.apache.maven.surefire.testng.TestNGExecutor.run(TestNGExecutor.java:281)
	at org.apache.maven.surefire.testng.TestNGXmlTestSuite.execute(TestNGXmlTestSuite.java:75)
	at org.apache.maven.surefire.testng.TestNGProvider.invoke(TestNGProvider.java:121)
	at org.apache.maven.surefire.booter.ForkedBooter.invokeProviderInSameClassLoader(ForkedBooter.java:290)
	at org.apache.maven.surefire.booter.ForkedBooter.runSuitesInProcess(ForkedBooter.java:242)
	at org.apache.maven.surefire.booter.ForkedBooter.main(ForkedBooter.java:121)

supportsReturningClaimsInIdToken(org.xdi.oxauth.interop.SupportsReturningClaimsInIdToken)  Time elapsed: 1.291 sec  <<< FAILURE!
java.lang.AssertionError: expected object to not be null
	at org.testng.Assert.fail(Assert.java:93)
	at org.testng.Assert.assertNotNull(Assert.java:422)
	at org.testng.Assert.assertNotNull(Assert.java:407)
	at org.xdi.oxauth.interop.SupportsReturningClaimsInIdToken.supportsReturningClaimsInIdToken(SupportsReturningClaimsInIdToken.java:114)
	at sun.reflect.NativeMethodAccessorImpl.invoke0(Native Method)
	at sun.reflect.NativeMethodAccessorImpl.invoke(NativeMethodAccessorImpl.java:62)
	at sun.reflect.DelegatingMethodAccessorImpl.invoke(DelegatingMethodAccessorImpl.java:43)
	at java.lang.reflect.Method.invoke(Method.java:498)
	at org.testng.internal.MethodInvocationHelper.invokeMethod(MethodInvocationHelper.java:108)
	at org.testng.internal.Invoker.invokeMethod(Invoker.java:661)
	at org.testng.internal.Invoker.invokeTestMethod(Invoker.java:869)
	at org.testng.internal.Invoker.invokeTestMethods(Invoker.java:1193)
	at org.testng.internal.TestMethodWorker.invokeTestMethods(TestMethodWorker.java:126)
	at org.testng.internal.TestMethodWorker.run(TestMethodWorker.java:109)
	at org.testng.TestRunner.privateRun(TestRunner.java:744)
	at org.testng.TestRunner.run(TestRunner.java:602)
	at org.testng.SuiteRunner.runTest(SuiteRunner.java:380)
	at org.testng.SuiteRunner.runSequentially(SuiteRunner.java:375)
	at org.testng.SuiteRunner.privateRun(SuiteRunner.java:340)
	at org.testng.SuiteRunner.run(SuiteRunner.java:289)
	at org.testng.SuiteRunnerWorker.runSuite(SuiteRunnerWorker.java:52)
	at org.testng.SuiteRunnerWorker.run(SuiteRunnerWorker.java:86)
	at org.testng.TestNG.runSuitesSequentially(TestNG.java:1301)
	at org.testng.TestNG.runSuitesLocally(TestNG.java:1226)
	at org.testng.TestNG.runSuites(TestNG.java:1144)
	at org.testng.TestNG.run(TestNG.java:1115)
	at org.apache.maven.surefire.testng.TestNGExecutor.run(TestNGExecutor.java:281)
	at org.apache.maven.surefire.testng.TestNGXmlTestSuite.execute(TestNGXmlTestSuite.java:75)
	at org.apache.maven.surefire.testng.TestNGProvider.invoke(TestNGProvider.java:121)
	at org.apache.maven.surefire.booter.ForkedBooter.invokeProviderInSameClassLoader(ForkedBooter.java:290)
	at org.apache.maven.surefire.booter.ForkedBooter.runSuitesInProcess(ForkedBooter.java:242)
	at org.apache.maven.surefire.booter.ForkedBooter.main(ForkedBooter.java:121)

supportsReturningDifferentClaimsInIdTokenAndUserInfoEndpoint(org.xdi.oxauth.interop.SupportsReturningDifferentClaimsInIdTokenAndUserInfoEndpoint)  Time elapsed: 1.065 sec  <<< FAILURE!
java.lang.AssertionError: expected object to not be null
	at org.testng.Assert.fail(Assert.java:93)
	at org.testng.Assert.assertNotNull(Assert.java:422)
	at org.testng.Assert.assertNotNull(Assert.java:407)
	at org.xdi.oxauth.interop.SupportsReturningDifferentClaimsInIdTokenAndUserInfoEndpoint.supportsReturningDifferentClaimsInIdTokenAndUserInfoEndpoint(SupportsReturningDifferentClaimsInIdTokenAndUserInfoEndpoint.java:116)
	at sun.reflect.NativeMethodAccessorImpl.invoke0(Native Method)
	at sun.reflect.NativeMethodAccessorImpl.invoke(NativeMethodAccessorImpl.java:62)
	at sun.reflect.DelegatingMethodAccessorImpl.invoke(DelegatingMethodAccessorImpl.java:43)
	at java.lang.reflect.Method.invoke(Method.java:498)
	at org.testng.internal.MethodInvocationHelper.invokeMethod(MethodInvocationHelper.java:108)
	at org.testng.internal.Invoker.invokeMethod(Invoker.java:661)
	at org.testng.internal.Invoker.invokeTestMethod(Invoker.java:869)
	at org.testng.internal.Invoker.invokeTestMethods(Invoker.java:1193)
	at org.testng.internal.TestMethodWorker.invokeTestMethods(TestMethodWorker.java:126)
	at org.testng.internal.TestMethodWorker.run(TestMethodWorker.java:109)
	at org.testng.TestRunner.privateRun(TestRunner.java:744)
	at org.testng.TestRunner.run(TestRunner.java:602)
	at org.testng.SuiteRunner.runTest(SuiteRunner.java:380)
	at org.testng.SuiteRunner.runSequentially(SuiteRunner.java:375)
	at org.testng.SuiteRunner.privateRun(SuiteRunner.java:340)
	at org.testng.SuiteRunner.run(SuiteRunner.java:289)
	at org.testng.SuiteRunnerWorker.runSuite(SuiteRunnerWorker.java:52)
	at org.testng.SuiteRunnerWorker.run(SuiteRunnerWorker.java:86)
	at org.testng.TestNG.runSuitesSequentially(TestNG.java:1301)
	at org.testng.TestNG.runSuitesLocally(TestNG.java:1226)
	at org.testng.TestNG.runSuites(TestNG.java:1144)
	at org.testng.TestNG.run(TestNG.java:1115)
	at org.apache.maven.surefire.testng.TestNGExecutor.run(TestNGExecutor.java:281)
	at org.apache.maven.surefire.testng.TestNGXmlTestSuite.execute(TestNGXmlTestSuite.java:75)
	at org.apache.maven.surefire.testng.TestNGProvider.invoke(TestNGProvider.java:121)
	at org.apache.maven.surefire.booter.ForkedBooter.invokeProviderInSameClassLoader(ForkedBooter.java:290)
	at org.apache.maven.surefire.booter.ForkedBooter.runSuitesInProcess(ForkedBooter.java:242)
	at org.apache.maven.surefire.booter.ForkedBooter.main(ForkedBooter.java:121)


Results :

Failed tests: 
  CanProvideEncryptedIdTokenResponse.canProvideEncryptedIdTokenResponseAlgA128KWEncA128GCM:104 org.bouncycastle.crypto.InvalidCipherTextException: checksum failed
  CanProvideEncryptedIdTokenResponse.canProvideEncryptedIdTokenResponseAlgA256KWEncA256GCM:173 org.bouncycastle.crypto.InvalidCipherTextException: checksum failed
  CanProvideEncryptedUserInfoResponse.canProvideEncryptedUserInfoResponseAlgA128KWEncA128GCM:97 expected object to not be null
  CanProvideEncryptedUserInfoResponse.canProvideEncryptedUserInfoResponseAlgA256KWEncA256GCM:171 expected object to not be null
  CanRequestAndUseEncryptedIdTokenResponse.canRequestAndUseEncryptedIdTokenResponse:93 » InvalidJwe
  ProvidingIndividuallyRequestedEssentialAndVoluntaryClaims.providingIndividuallyRequestedEssentialAndVoluntaryClaims:118 expected object to not be null
  ProvidingIndividuallyRequestedEssentialClaims.providingIndividuallyRequestedEssentialClaims:114 expected object to not be null
  ProvidingIndividuallyRequestedVoluntaryClaims.providingIndividuallyRequestedVoluntaryClaims:115 expected object to not be null
  SupportAuthenticationToTokenEndpointWithAsymmetricallySignedJWTs.supportAuthenticationToTokenEndpointWithAsymmetricallySignedJWTsES512:466 NullPointer
  SupportClaimsRequestSpecifyingSubValue.supportClaimsRequestSpecifyingSubValueSucceed:153 expected object to not be null
  SupportsCombiningClaimsRequestedWithScopeAndRequestObject.supportsCombiningClaimsRequestedWithScopeAndRequestObject:130 expected object to not be null
  SupportsReturningClaimsInIdToken.supportsReturningClaimsInIdToken:114 expected object to not be null
  SupportsReturningDifferentClaimsInIdTokenAndUserInfoEndpoint.supportsReturningDifferentClaimsInIdTokenAndUserInfoEndpoint:116 expected object to not be null
  MultivaluedClaims.authorizationRequestObjectWithMultivaluedClaimAlgA128KWEncA128GCM:2446->BaseTest.authenticateResourceOwnerAndGrantAccess:253->BaseTest.authenticateResourceOwnerAndGrantAccess:262->BaseTest.authenticateResourceOwnerAndGrantAccess:272->BaseTest.authenticateResourceOwnerAndGrantAccess:283->BaseTest.processAuthentication:341 » NoSuchElement
  MultivaluedClaims.authorizationRequestObjectWithMultivaluedClaimAlgA256KWEncA256GCM:2544->BaseTest.authenticateResourceOwnerAndGrantAccess:253->BaseTest.authenticateResourceOwnerAndGrantAccess:262->BaseTest.authenticateResourceOwnerAndGrantAccess:272->BaseTest.authenticateResourceOwnerAndGrantAccess:283->BaseTest.processAuthentication:341 » NoSuchElement
  MultivaluedClaims.authorizationRequestObjectWithMultivaluedClaimAlgRSA15EncA128CBCPLUSHS256:2678 expected [true] but found [false]
  MultivaluedClaims.authorizationRequestObjectWithMultivaluedClaimAlgRSA15EncA256CBCPLUSHS512:2788 expected [true] but found [false]
  MultivaluedClaims.authorizationRequestObjectWithMultivaluedClaimAlgRSAOAEPEncA256GCM:2898 expected [true] but found [false]
  MultivaluedClaims.authorizationRequestObjectWithMultivaluedClaimES256:2159 expected [true] but found [false]
  MultivaluedClaims.authorizationRequestObjectWithMultivaluedClaimES384:2262 expected [true] but found [false]
  MultivaluedClaims.authorizationRequestObjectWithMultivaluedClaimES512:2365 expected [true] but found [false]
  MultivaluedClaims.authorizationRequestObjectWithMultivaluedClaimHS256:1557 expected [true] but found [false]
  MultivaluedClaims.authorizationRequestObjectWithMultivaluedClaimHS384:1654 expected [true] but found [false]
  MultivaluedClaims.authorizationRequestObjectWithMultivaluedClaimHS512:1751 expected [true] but found [false]
  MultivaluedClaims.authorizationRequestObjectWithMultivaluedClaimNone:1461 expected [true] but found [false]
  MultivaluedClaims.authorizationRequestObjectWithMultivaluedClaimRS256:1850 expected [true] but found [false]
  MultivaluedClaims.authorizationRequestObjectWithMultivaluedClaimRS384:1953 expected [true] but found [false]
  MultivaluedClaims.authorizationRequestObjectWithMultivaluedClaimRS512:2056 expected [true] but found [false]
  MultivaluedClaims.authorizationRequestWithMultivaluedClaimAlgA128KWEncA128GCM:996 » InvalidJwe
  MultivaluedClaims.authorizationRequestWithMultivaluedClaimAlgA256KWEncA256GCM:1082 » InvalidJwe
  OpenIDRequestObjectHttpTest.requestParameterMethod6:440 expected object to not be null
  OpenIDRequestObjectHttpTest.requestParameterMethodAlgA128KWEncA128GCM:2508 The accessToken is null expected object to not be null
  OpenIDRequestObjectHttpTest.requestParameterMethodAlgA256KWEncA256GCM:2596 The accessToken is null expected object to not be null
  TokenEncryptionHttpTest.requestIdTokenAlgA128KWEncA128GCM:338 org.bouncycastle.crypto.InvalidCipherTextException: checksum failed
  TokenEncryptionHttpTest.requestIdTokenAlgA256KWEncA256GCM:410 org.bouncycastle.crypto.InvalidCipherTextException: checksum failed
  UserInfoRestWebServiceHttpTest.requestUserInfoAdditionalClaims:464 Unexpected result: iname not found expected object to not be null
  UserInfoRestWebServiceHttpTest.requestUserInfoAlgA128KWEncA128GCM:1354 expected object to not be null
  UserInfoRestWebServiceHttpTest.requestUserInfoAlgA256KWEncA256GCM:1412 expected object to not be null

Tests run: 660, Failures: 38, Errors: 0, Skipped: 0

[INFO] ------------------------------------------------------------------------
[INFO] Reactor Summary:
[INFO] 
[INFO] oxAuth ............................................. SUCCESS [  4.018 s]
[INFO] oxAuth Model ....................................... SUCCESS [ 33.681 s]
[INFO] oxAuth Client ...................................... FAILURE [12:00 min]
[INFO] oxauth-static ...................................... SKIPPED
[INFO] oxAuth RP .......................................... SKIPPED
[INFO] oxAuth RP Demo ..................................... SKIPPED
[INFO] oxAuth Server ...................................... SKIPPED
[INFO] ------------------------------------------------------------------------
[INFO] BUILD FAILURE
[INFO] ------------------------------------------------------------------------
[INFO] Total time: 12:39 min
[INFO] Finished at: 2018-07-05T14:57:56-04:00
[INFO] Final Memory: 70M/395M
[INFO] ------------------------------------------------------------------------
[ERROR] Failed to execute goal org.apache.maven.plugins:maven-surefire-plugin:2.19.1:test (default-test) on project oxauth-client: There are test failures.
[ERROR] 
[ERROR] Please refer to /home/tomcat/.jenkins/jobs/oxAuth/workspace/Client/target/surefire-reports for the individual test results.
[ERROR] -> [Help 1]
[ERROR] 
[ERROR] To see the full stack trace of the errors, re-run Maven with the -e switch.
[ERROR] Re-run Maven using the -X switch to enable full debug logging.
[ERROR] 
[ERROR] For more information about the errors and possible solutions, please read the following articles:
[ERROR] [Help 1] http://cwiki.apache.org/confluence/display/MAVEN/MojoFailureException
[ERROR] 
[ERROR] After correcting the problems, you can resume the build with the command
[ERROR]   mvn <goals> -rf :oxauth-client
Build step 'Invoke top-level Maven targets' marked build as failure
[FINDBUGS] Skipping publisher since build result is FAILURE
Publishing Javadoc
TestNG Reports Processing: START
Looking for TestNG results report in workspace using pattern: **/testng-results.xml
Saving reports...
Processing '/home/tomcat/.jenkins/jobs/oxAuth/builds/3306/testng/testng-results-1.xml'
Processing '/home/tomcat/.jenkins/jobs/oxAuth/builds/3306/testng/testng-results.xml'
5.697152% of tests failed, which exceeded threshold of 0%. Marking build as UNSTABLE
TestNG Reports Processing: FINISH
Sending e-mails to: support@gluu.org yuriy@gluu.org
Finished: FAILURE