FailedConsole Output

Skipping 5,037 KB.. Full Log
       "A128GCM",
        "A256GCM"
    ],
    "request_object_signing_alg_values_supported": [
        "none",
        "HS256",
        "HS384",
        "HS512",
        "RS256",
        "RS384",
        "RS512",
        "ES256",
        "ES384",
        "ES512"
    ],
    "request_object_encryption_alg_values_supported": [
        "RSA1_5",
        "RSA-OAEP",
        "A128KW",
        "A256KW"
    ],
    "request_object_encryption_enc_values_supported": [
        "A128CBC+HS256",
        "A256CBC+HS512",
        "A128GCM",
        "A256GCM"
    ],
    "token_endpoint_auth_methods_supported": [
        "client_secret_basic",
        "client_secret_post",
        "client_secret_jwt",
        "private_key_jwt"
    ],
    "token_endpoint_auth_signing_alg_values_supported": [
        "HS256",
        "HS384",
        "HS512",
        "RS256",
        "RS384",
        "RS512",
        "ES256",
        "ES384",
        "ES512"
    ],
    "display_values_supported": [
        "page",
        "popup"
    ],
    "claim_types_supported": ["normal"],
    "claims_supported": [
        "birthdate",
        "country",
        "name",
        "email",
        "email_verified",
        "given_name",
        "gender",
        "inum",
        "family_name",
        "updated_at",
        "locale",
        "member_of",
        "middle_name",
        "nickname",
        "oxAuthAppType",
        "oxAuthIdTokenSignedResponseAlg",
        "oxAuthRedirectURI",
        "oxAuthScope",
        "phone_number_verified",
        "picture",
        "preferred_username",
        "profile",
        "zoneinfo",
        "user_name",
        "website"
    ],
    "service_documentation": "http://gluu.org/docs",
    "claims_locales_supported": ["en"],
    "ui_locales_supported": [
        "en",
        "es"
    ],
    "scope_to_claims_mapping": [
        {"permission": []},
        {"uma_protection": []},
        {"clientinfo": [
            "name",
            "inum",
            "oxAuthAppType",
            "oxAuthIdTokenSignedResponseAlg",
            "oxAuthRedirectURI",
            "oxAuthScope"
        ]},
        {"email": [
            "email_verified",
            "email"
        ]},
        {"user_name": ["user_name"]},
        {"sub": []},
        {"org_name": []},
        {"address": [
            "formatted",
            "postal_code",
            "street_address",
            "locality",
            "country",
            "region"
        ]},
        {"openid": []},
        {"test_scope1": []},
        {"work_phone": []},
        {"phone": [
            "phone_number_verified",
            "phone_number"
        ]},
        {"profile": [
            "name",
            "family_name",
            "given_name",
            "middle_name",
            "nickname",
            "preferred_username",
            "profile",
            "picture",
            "website",
            "gender",
            "birthdate",
            "zoneinfo",
            "locale",
            "updated_at"
        ]},
        {"mobile_phone": ["phone_mobile_number"]},
        {"test": ["member_of"]}
    ],
    "claims_parameter_supported": true,
    "request_parameter_supported": true,
    "request_uri_parameter_supported": true,
    "require_request_uri_registration": false,
    "op_policy_uri": "http://ox.gluu.org/doku.php?id=oxauth:policy",
    "op_tos_uri": "http://ox.gluu.org/doku.php?id=oxauth:tos",
    "frontchannel_logout_supported": true,
    "frontchannel_logout_session_supported": true
}


#######################################################
TEST: OC5:FeatureTest-Uses Symmetric ID Token Signatures HS256
#######################################################
-------------------------------------------------------
REQUEST:
-------------------------------------------------------
POST /oxauth/restv1/register HTTP/1.1
Content-Type: application/json
Accept: application/json
Host: ce-dev4.gluu.org

{
    "redirect_uris": [
        "https://ce-dev4.gluu.org/oxauth-rp/home.htm",
        "https://client.example.com/cb",
        "https://client.example.com/cb1",
        "https://client.example.com/cb2"
    ],
    "response_types": ["id_token"],
    "application_type": "web",
    "client_name": "oxAuth test app",
    "sector_identifier_uri": "https://ce-dev4.gluu.org/oxauth/sectoridentifier/@!38D4.410C.1D43.8932!0001!37F2.B744!0012!D426.70FD",
    "id_token_signed_response_alg": "HS256"
}

-------------------------------------------------------
RESPONSE:
-------------------------------------------------------
HTTP/1.1 200
Cache-Control: no-store
Connection: Keep-Alive
Content-Length: 1340
Content-Type: application/json
Date: Thu, 05 Jul 2018 18:37:51 GMT
Keep-Alive: timeout=5, max=100
Pragma: no-cache
Server: Jetty(9.4.9.v20180320)
Strict-Transport-Security: max-age=31536000; includeSubDomains
X-Content-Type-Options: nosniff
X-Xss-Protection: 1; mode=block

{
    "client_id": "@!38D4.410C.1D43.8932!0001!37F2.B744!0008!6B4A.850E.32EB.7B7C",
    "client_secret": "74930b8b-aa2e-4cb2-ba38-dc2cfe19738a",
    "registration_access_token": "97f4bab3-bc80-400b-b744-14e4f9bd0942",
    "registration_client_uri": "https://ce-dev4.gluu.org/oxauth/restv1/register?client_id=@!38D4.410C.1D43.8932!0001!37F2.B744!0008!6B4A.850E.32EB.7B7C",
    "client_id_issued_at": 1530815871,
    "client_secret_expires_at": 1530902271,
    "redirect_uris": [
        "https://client.example.com/cb2",
        "https://client.example.com/cb1",
        "https://client.example.com/cb",
        "https://ce-dev4.gluu.org/oxauth-rp/home.htm"
    ],
    "response_types": [
        "id_token",
        "token"
    ],
    "grant_types": ["implicit"],
    "application_type": "web",
    "client_name": "oxAuth test app",
    "sector_identifier_uri": "https://ce-dev4.gluu.org/oxauth/sectoridentifier/@!38D4.410C.1D43.8932!0001!37F2.B744!0012!D426.70FD",
    "subject_type": "pairwise",
    "id_token_signed_response_alg": "HS256",
    "token_endpoint_auth_method": "client_secret_basic",
    "require_auth_time": false,
    "frontchannel_logout_session_required": false,
    "scope": "permission uma_protection clientinfo email user_name sub org_name address openid test_scope1 work_phone phone profile test",
    "claims": ""
}

authenticateResourceOwnerAndGrantAccess: Cleaning cookies
authenticateResourceOwnerAndGrantAccess: authorizationRequestUrl:https://ce-dev4.gluu.org/oxauth/restv1/authorize?response_type=id_token&client_id=%40%2138D4.410C.1D43.8932%210001%2137F2.B744%210008%216B4A.850E.32EB.7B7C&scope=openid+profile+address+email&redirect_uri=https%3A%2F%2Fce-dev4.gluu.org%2Foxauth-rp%2Fhome.htm&state=2bad1018-e0c5-465e-9c98-d351a0d49fc2&nonce=a26e24e9-9c88-48fd-ab2c-237895ce8a89
14:38:12.510 [main] ERROR com.gargoylesoftware.htmlunit.javascript.StrictErrorReporter - runtimeError: message=[An invalid or illegal selector was specified (selector: '*,:x' error: Invalid selector: :x).] sourceName=[https://ce-dev4.gluu.org/oxauth/js/jquery-1.12.4.min.js] line=[2] lineSource=[null] lineOffset=[0]
authenticateResourceOwnerAndGrantAccess: sessionState:a6338c0f-d59a-497c-9340-83ba11e27c68
-------------------------------------------------------
REQUEST:
-------------------------------------------------------
https://ce-dev4.gluu.org/oxauth/restv1/authorize?response_type=id_token&client_id=%40%2138D4.410C.1D43.8932%210001%2137F2.B744%210008%216B4A.850E.32EB.7B7C&scope=openid+profile+address+email&redirect_uri=https%3A%2F%2Fce-dev4.gluu.org%2Foxauth-rp%2Fhome.htm&state=2bad1018-e0c5-465e-9c98-d351a0d49fc2&nonce=a26e24e9-9c88-48fd-ab2c-237895ce8a89

-------------------------------------------------------
RESPONSE:
-------------------------------------------------------
HTTP/1.1 302 Found
Location: https://ce-dev4.gluu.org/oxauth-rp/home.htm#scope=address+openid+profile+email&id_token=eyJ0eXAiOiJKV1QiLCJhbGciOiJIUzI1NiJ9.eyJpc3MiOiJodHRwczovL2NlLWRldjQuZ2x1dS5vcmciLCJhdWQiOiJAITM4RDQuNDEwQy4xRDQzLjg5MzIhMDAwMSEzN0YyLkI3NDQhMDAwOCE2QjRBLjg1MEUuMzJFQi43QjdDIiwiZXhwIjoxNTMwODE5NDcyLCJpYXQiOjE1MzA4MTU4NzIsIm5vbmNlIjoiYTI2ZTI0ZTktOWM4OC00OGZkLWFiMmMtMjM3ODk1Y2U4YTg5IiwiYXV0aF90aW1lIjoxNTMwODE1ODcyLCJveE9wZW5JRENvbm5lY3RWZXJzaW9uIjoib3BlbmlkY29ubmVjdC0xLjAiLCJzdWIiOiJRZmNfM1V5Y1NlelM0VHljcHNpUTBaZHgtazdlTGVqdjg0WGxQbWFyR0xNIn0.zBbYnGXzI_J_8YzIkEbkqu7BfAG1SAtbtZZaFngy5WQ&session_id=84d4351b-f11a-432b-b46d-0ed532b47bc4&state=2bad1018-e0c5-465e-9c98-d351a0d49fc2&session_state=a6338c0f-d59a-497c-9340-83ba11e27c68

#######################################################
TEST: OC5:FeatureTest-Uses Symmetric ID Token Signatures HS384
#######################################################
-------------------------------------------------------
REQUEST:
-------------------------------------------------------
POST /oxauth/restv1/register HTTP/1.1
Content-Type: application/json
Accept: application/json
Host: ce-dev4.gluu.org

{
    "redirect_uris": [
        "https://ce-dev4.gluu.org/oxauth-rp/home.htm",
        "https://client.example.com/cb",
        "https://client.example.com/cb1",
        "https://client.example.com/cb2"
    ],
    "response_types": ["id_token"],
    "application_type": "web",
    "client_name": "oxAuth test app",
    "sector_identifier_uri": "https://ce-dev4.gluu.org/oxauth/sectoridentifier/@!38D4.410C.1D43.8932!0001!37F2.B744!0012!D426.70FD",
    "id_token_signed_response_alg": "HS384"
}

-------------------------------------------------------
RESPONSE:
-------------------------------------------------------
HTTP/1.1 200
Cache-Control: no-store
Connection: Keep-Alive
Content-Length: 1340
Content-Type: application/json
Date: Thu, 05 Jul 2018 18:37:52 GMT
Keep-Alive: timeout=5, max=100
Pragma: no-cache
Server: Jetty(9.4.9.v20180320)
Strict-Transport-Security: max-age=31536000; includeSubDomains
X-Content-Type-Options: nosniff
X-Xss-Protection: 1; mode=block

{
    "client_id": "@!38D4.410C.1D43.8932!0001!37F2.B744!0008!0AF4.A8A2.7719.A475",
    "client_secret": "77dc453e-d063-4711-bb43-4cd00f75d8b6",
    "registration_access_token": "92125724-2543-45e3-a2a0-ed50e94c0b93",
    "registration_client_uri": "https://ce-dev4.gluu.org/oxauth/restv1/register?client_id=@!38D4.410C.1D43.8932!0001!37F2.B744!0008!0AF4.A8A2.7719.A475",
    "client_id_issued_at": 1530815872,
    "client_secret_expires_at": 1530902272,
    "redirect_uris": [
        "https://client.example.com/cb2",
        "https://client.example.com/cb1",
        "https://client.example.com/cb",
        "https://ce-dev4.gluu.org/oxauth-rp/home.htm"
    ],
    "response_types": [
        "id_token",
        "token"
    ],
    "grant_types": ["implicit"],
    "application_type": "web",
    "client_name": "oxAuth test app",
    "sector_identifier_uri": "https://ce-dev4.gluu.org/oxauth/sectoridentifier/@!38D4.410C.1D43.8932!0001!37F2.B744!0012!D426.70FD",
    "subject_type": "pairwise",
    "id_token_signed_response_alg": "HS384",
    "token_endpoint_auth_method": "client_secret_basic",
    "require_auth_time": false,
    "frontchannel_logout_session_required": false,
    "scope": "permission uma_protection clientinfo email user_name sub org_name address openid test_scope1 work_phone phone profile test",
    "claims": ""
}

authenticateResourceOwnerAndGrantAccess: Cleaning cookies
authenticateResourceOwnerAndGrantAccess: authorizationRequestUrl:https://ce-dev4.gluu.org/oxauth/restv1/authorize?response_type=id_token&client_id=%40%2138D4.410C.1D43.8932%210001%2137F2.B744%210008%210AF4.A8A2.7719.A475&scope=openid+profile+address+email&redirect_uri=https%3A%2F%2Fce-dev4.gluu.org%2Foxauth-rp%2Fhome.htm&state=f7a85bc7-183d-49f5-b2ff-379b1a0f45ad&nonce=7a6ef8b5-bbf5-41d8-9e2d-858f6e12ee66
14:38:13.716 [main] ERROR com.gargoylesoftware.htmlunit.javascript.StrictErrorReporter - runtimeError: message=[An invalid or illegal selector was specified (selector: '*,:x' error: Invalid selector: :x).] sourceName=[https://ce-dev4.gluu.org/oxauth/js/jquery-1.12.4.min.js] line=[2] lineSource=[null] lineOffset=[0]
authenticateResourceOwnerAndGrantAccess: sessionState:3094c2ae-17dc-4c80-9f58-4cd1fcf25249
-------------------------------------------------------
REQUEST:
-------------------------------------------------------
https://ce-dev4.gluu.org/oxauth/restv1/authorize?response_type=id_token&client_id=%40%2138D4.410C.1D43.8932%210001%2137F2.B744%210008%210AF4.A8A2.7719.A475&scope=openid+profile+address+email&redirect_uri=https%3A%2F%2Fce-dev4.gluu.org%2Foxauth-rp%2Fhome.htm&state=f7a85bc7-183d-49f5-b2ff-379b1a0f45ad&nonce=7a6ef8b5-bbf5-41d8-9e2d-858f6e12ee66

-------------------------------------------------------
RESPONSE:
-------------------------------------------------------
HTTP/1.1 302 Found
Location: https://ce-dev4.gluu.org/oxauth-rp/home.htm#scope=address+openid+profile+email&id_token=eyJ0eXAiOiJKV1QiLCJhbGciOiJIUzM4NCJ9.eyJpc3MiOiJodHRwczovL2NlLWRldjQuZ2x1dS5vcmciLCJhdWQiOiJAITM4RDQuNDEwQy4xRDQzLjg5MzIhMDAwMSEzN0YyLkI3NDQhMDAwOCEwQUY0LkE4QTIuNzcxOS5BNDc1IiwiZXhwIjoxNTMwODE5NDczLCJpYXQiOjE1MzA4MTU4NzMsIm5vbmNlIjoiN2E2ZWY4YjUtYmJmNS00MWQ4LTllMmQtODU4ZjZlMTJlZTY2IiwiYXV0aF90aW1lIjoxNTMwODE1ODczLCJveE9wZW5JRENvbm5lY3RWZXJzaW9uIjoib3BlbmlkY29ubmVjdC0xLjAiLCJzdWIiOiJUOVl2QlhlMTJrM3Qtb2VIQ25JWTlYbHBaQnhsektsR2JkZmgxa2dsVlJNIn0.W1KCui6eb1P5vZIiORtvkCjkVgjg18iFVxNuVvy8snTO--8oW3FpdEsoNSm-p4b4&session_id=d17e6413-6dd0-492e-be08-7d2fd8310694&state=f7a85bc7-183d-49f5-b2ff-379b1a0f45ad&session_state=3094c2ae-17dc-4c80-9f58-4cd1fcf25249

#######################################################
TEST: OC5:FeatureTest-Uses Symmetric ID Token Signatures HS512
#######################################################
-------------------------------------------------------
REQUEST:
-------------------------------------------------------
POST /oxauth/restv1/register HTTP/1.1
Content-Type: application/json
Accept: application/json
Host: ce-dev4.gluu.org

{
    "redirect_uris": [
        "https://ce-dev4.gluu.org/oxauth-rp/home.htm",
        "https://client.example.com/cb",
        "https://client.example.com/cb1",
        "https://client.example.com/cb2"
    ],
    "response_types": ["id_token"],
    "application_type": "web",
    "client_name": "oxAuth test app",
    "sector_identifier_uri": "https://ce-dev4.gluu.org/oxauth/sectoridentifier/@!38D4.410C.1D43.8932!0001!37F2.B744!0012!D426.70FD",
    "id_token_signed_response_alg": "HS512"
}

-------------------------------------------------------
RESPONSE:
-------------------------------------------------------
HTTP/1.1 200
Cache-Control: no-store
Connection: Keep-Alive
Content-Length: 1340
Content-Type: application/json
Date: Thu, 05 Jul 2018 18:37:53 GMT
Keep-Alive: timeout=5, max=100
Pragma: no-cache
Server: Jetty(9.4.9.v20180320)
Strict-Transport-Security: max-age=31536000; includeSubDomains
X-Content-Type-Options: nosniff
X-Xss-Protection: 1; mode=block

{
    "client_id": "@!38D4.410C.1D43.8932!0001!37F2.B744!0008!B49B.9175.7562.489C",
    "client_secret": "6ca90ec4-4efc-4829-8536-dcebcd9cec3b",
    "registration_access_token": "29cb2ddf-4784-4625-8af4-04af7b9634b0",
    "registration_client_uri": "https://ce-dev4.gluu.org/oxauth/restv1/register?client_id=@!38D4.410C.1D43.8932!0001!37F2.B744!0008!B49B.9175.7562.489C",
    "client_id_issued_at": 1530815873,
    "client_secret_expires_at": 1530902273,
    "redirect_uris": [
        "https://client.example.com/cb2",
        "https://client.example.com/cb1",
        "https://client.example.com/cb",
        "https://ce-dev4.gluu.org/oxauth-rp/home.htm"
    ],
    "response_types": [
        "id_token",
        "token"
    ],
    "grant_types": ["implicit"],
    "application_type": "web",
    "client_name": "oxAuth test app",
    "sector_identifier_uri": "https://ce-dev4.gluu.org/oxauth/sectoridentifier/@!38D4.410C.1D43.8932!0001!37F2.B744!0012!D426.70FD",
    "subject_type": "pairwise",
    "id_token_signed_response_alg": "HS512",
    "token_endpoint_auth_method": "client_secret_basic",
    "require_auth_time": false,
    "frontchannel_logout_session_required": false,
    "scope": "permission uma_protection clientinfo email user_name sub org_name address openid test_scope1 work_phone phone profile test",
    "claims": ""
}

authenticateResourceOwnerAndGrantAccess: Cleaning cookies
authenticateResourceOwnerAndGrantAccess: authorizationRequestUrl:https://ce-dev4.gluu.org/oxauth/restv1/authorize?response_type=id_token&client_id=%40%2138D4.410C.1D43.8932%210001%2137F2.B744%210008%21B49B.9175.7562.489C&scope=openid+profile+address+email&redirect_uri=https%3A%2F%2Fce-dev4.gluu.org%2Foxauth-rp%2Fhome.htm&state=c132fabd-3660-4561-b148-cba5bc7405c8&nonce=32a0e7d4-e6a1-4fb4-8be7-680477b96be8
14:38:14.873 [main] ERROR com.gargoylesoftware.htmlunit.javascript.StrictErrorReporter - runtimeError: message=[An invalid or illegal selector was specified (selector: '*,:x' error: Invalid selector: :x).] sourceName=[https://ce-dev4.gluu.org/oxauth/js/jquery-1.12.4.min.js] line=[2] lineSource=[null] lineOffset=[0]
authenticateResourceOwnerAndGrantAccess: sessionState:32609471-0a76-43ff-8be1-28512aab6b33
-------------------------------------------------------
REQUEST:
-------------------------------------------------------
https://ce-dev4.gluu.org/oxauth/restv1/authorize?response_type=id_token&client_id=%40%2138D4.410C.1D43.8932%210001%2137F2.B744%210008%21B49B.9175.7562.489C&scope=openid+profile+address+email&redirect_uri=https%3A%2F%2Fce-dev4.gluu.org%2Foxauth-rp%2Fhome.htm&state=c132fabd-3660-4561-b148-cba5bc7405c8&nonce=32a0e7d4-e6a1-4fb4-8be7-680477b96be8

-------------------------------------------------------
RESPONSE:
-------------------------------------------------------
HTTP/1.1 302 Found
Location: https://ce-dev4.gluu.org/oxauth-rp/home.htm#scope=address+openid+profile+email&id_token=eyJ0eXAiOiJKV1QiLCJhbGciOiJIUzUxMiJ9.eyJpc3MiOiJodHRwczovL2NlLWRldjQuZ2x1dS5vcmciLCJhdWQiOiJAITM4RDQuNDEwQy4xRDQzLjg5MzIhMDAwMSEzN0YyLkI3NDQhMDAwOCFCNDlCLjkxNzUuNzU2Mi40ODlDIiwiZXhwIjoxNTMwODE5NDc0LCJpYXQiOjE1MzA4MTU4NzQsIm5vbmNlIjoiMzJhMGU3ZDQtZTZhMS00ZmI0LThiZTctNjgwNDc3Yjk2YmU4IiwiYXV0aF90aW1lIjoxNTMwODE1ODc0LCJveE9wZW5JRENvbm5lY3RWZXJzaW9uIjoib3BlbmlkY29ubmVjdC0xLjAiLCJzdWIiOiIyNHhJN2hQMUR5WjJXckdmNmxFWHNRWjBQd0dLYXRVcm1CM1JfTG13UnJjIn0.rrB5UhPRQ4UvWhVM8AwyzZVq4AD8bwreGnU8joJ4WVi-1WQYT6QTS3XLJ_neT9SgxVZ8rNUXgbzTyZ_MDj5rYg&session_id=8eb10de2-d4a3-4382-a830-b6f47fa7b56b&state=c132fabd-3660-4561-b148-cba5bc7405c8&session_state=32609471-0a76-43ff-8be1-28512aab6b33

#######################################################
TEST: OpenID Connect Discovery
#######################################################
-------------------------------------------------------
REQUEST:
-------------------------------------------------------
GET /.well-known/webfinger?resource=acct%3Atest_user%40ce-dev4.gluu.org&rel=http%3A%2F%2Fopenid.net%2Fspecs%2Fconnect%2F1.0%2Fissuer HTTP/1.1
Host: ce-dev4.gluu.org

-------------------------------------------------------
RESPONSE:
-------------------------------------------------------
HTTP/1.1 200
Connection: Keep-Alive
Content-Length: 181
Content-Type: application/jrd+json;charset=iso-8859-1
Date: Thu, 05 Jul 2018 18:37:54 GMT
Keep-Alive: timeout=5, max=100
Server: Jetty(9.4.9.v20180320)
Strict-Transport-Security: max-age=31536000; includeSubDomains
X-Content-Type-Options: nosniff
X-Xss-Protection: 1; mode=block

{
    "subject": "acct:test_user@ce-dev4.gluu.org",
    "links": [{
        "rel": "http://openid.net/specs/connect/1.0/issuer",
        "href": "https://ce-dev4.gluu.org"
    }]
}


OpenID Connect Configuration
-------------------------------------------------------
REQUEST:
-------------------------------------------------------
GET /.well-known/openid-configuration HTTP/1.1
Host: ce-dev4.gluu.org

-------------------------------------------------------
RESPONSE:
-------------------------------------------------------
HTTP/1.1 200
Connection: Keep-Alive
Content-Length: 6342
Content-Type: application/json
Date: Thu, 05 Jul 2018 18:37:54 GMT
Keep-Alive: timeout=5, max=100
Server: Jetty(9.4.9.v20180320)
Strict-Transport-Security: max-age=31536000; includeSubDomains
X-Content-Type-Options: nosniff
X-Xss-Protection: 1; mode=block

{
    "issuer": "https://ce-dev4.gluu.org",
    "authorization_endpoint": "https://ce-dev4.gluu.org/oxauth/restv1/authorize",
    "token_endpoint": "https://ce-dev4.gluu.org/oxauth/restv1/token",
    "userinfo_endpoint": "https://ce-dev4.gluu.org/oxauth/restv1/userinfo",
    "clientinfo_endpoint": "https://ce-dev4.gluu.org/oxauth/restv1/clientinfo",
    "check_session_iframe": "https://ce-dev4.gluu.org/oxauth/opiframe",
    "end_session_endpoint": "https://ce-dev4.gluu.org/oxauth/restv1/end_session",
    "jwks_uri": "https://ce-dev4.gluu.org/oxauth/restv1/jwks",
    "registration_endpoint": "https://ce-dev4.gluu.org/oxauth/restv1/register",
    "id_generation_endpoint": "https://ce-dev4.gluu.org/oxauth/restv1/id",
    "introspection_endpoint": "https://ce-dev4.gluu.org/oxauth/restv1/introspection",
    "scopes_supported": [
        "permission",
        "clientinfo",
        "email",
        "user_name",
        "sub",
        "org_name",
        "address",
        "openid",
        "test_scope1",
        "work_phone",
        "phone",
        "profile",
        "mobile_phone",
        "test"
    ],
    "response_types_supported": [
        "code",
        "code id_token",
        "code id_token token",
        "id_token",
        "id_token token",
        "token",
        "code token"
    ],
    "grant_types_supported": [
        "urn:ietf:params:oauth:grant-type:uma-ticket",
        "client_credentials",
        "refresh_token",
        "implicit",
        "password",
        "authorization_code"
    ],
    "acr_values_supported": [
        "super_gluu",
        "u2f",
        "otp",
        "basic",
        "auth_ldap_server"
    ],
    "auth_level_mapping": {
        "-1": ["auth_ldap_server"],
        "50": ["otp"],
        "100": ["basic"],
        "10": ["u2f"],
        "15": ["super_gluu"]
    },
    "subject_types_supported": [
        "public",
        "pairwise"
    ],
    "userinfo_signing_alg_values_supported": [
        "HS256",
        "HS384",
        "HS512",
        "RS256",
        "RS384",
        "RS512",
        "ES256",
        "ES384",
        "ES512"
    ],
    "userinfo_encryption_alg_values_supported": [
        "RSA1_5",
        "RSA-OAEP",
        "A128KW",
        "A256KW"
    ],
    "userinfo_encryption_enc_values_supported": [
        "RSA1_5",
        "RSA-OAEP",
        "A128KW",
        "A256KW"
    ],
    "id_token_signing_alg_values_supported": [
        "none",
        "HS256",
        "HS384",
        "HS512",
        "RS256",
        "RS384",
        "RS512",
        "ES256",
        "ES384",
        "ES512"
    ],
    "id_token_encryption_alg_values_supported": [
        "RSA1_5",
        "RSA-OAEP",
        "A128KW",
        "A256KW"
    ],
    "id_token_encryption_enc_values_supported": [
        "A128CBC+HS256",
        "A256CBC+HS512",
        "A128GCM",
        "A256GCM"
    ],
    "request_object_signing_alg_values_supported": [
        "none",
        "HS256",
        "HS384",
        "HS512",
        "RS256",
        "RS384",
        "RS512",
        "ES256",
        "ES384",
        "ES512"
    ],
    "request_object_encryption_alg_values_supported": [
        "RSA1_5",
        "RSA-OAEP",
        "A128KW",
        "A256KW"
    ],
    "request_object_encryption_enc_values_supported": [
        "A128CBC+HS256",
        "A256CBC+HS512",
        "A128GCM",
        "A256GCM"
    ],
    "token_endpoint_auth_methods_supported": [
        "client_secret_basic",
        "client_secret_post",
        "client_secret_jwt",
        "private_key_jwt"
    ],
    "token_endpoint_auth_signing_alg_values_supported": [
        "HS256",
        "HS384",
        "HS512",
        "RS256",
        "RS384",
        "RS512",
        "ES256",
        "ES384",
        "ES512"
    ],
    "display_values_supported": [
        "page",
        "popup"
    ],
    "claim_types_supported": ["normal"],
    "claims_supported": [
        "birthdate",
        "country",
        "name",
        "email",
        "email_verified",
        "given_name",
        "gender",
        "inum",
        "family_name",
        "updated_at",
        "locale",
        "member_of",
        "middle_name",
        "nickname",
        "oxAuthAppType",
        "oxAuthIdTokenSignedResponseAlg",
        "oxAuthRedirectURI",
        "oxAuthScope",
        "phone_number_verified",
        "picture",
        "preferred_username",
        "profile",
        "zoneinfo",
        "user_name",
        "website"
    ],
    "service_documentation": "http://gluu.org/docs",
    "claims_locales_supported": ["en"],
    "ui_locales_supported": [
        "en",
        "es"
    ],
    "scope_to_claims_mapping": [
        {"permission": []},
        {"uma_protection": []},
        {"clientinfo": [
            "name",
            "inum",
            "oxAuthAppType",
            "oxAuthIdTokenSignedResponseAlg",
            "oxAuthRedirectURI",
            "oxAuthScope"
        ]},
        {"email": [
            "email_verified",
            "email"
        ]},
        {"user_name": ["user_name"]},
        {"sub": []},
        {"org_name": []},
        {"address": [
            "formatted",
            "postal_code",
            "street_address",
            "locality",
            "country",
            "region"
        ]},
        {"openid": []},
        {"test_scope1": []},
        {"work_phone": []},
        {"phone": [
            "phone_number_verified",
            "phone_number"
        ]},
        {"profile": [
            "name",
            "family_name",
            "given_name",
            "middle_name",
            "nickname",
            "preferred_username",
            "profile",
            "picture",
            "website",
            "gender",
            "birthdate",
            "zoneinfo",
            "locale",
            "updated_at"
        ]},
        {"mobile_phone": ["phone_mobile_number"]},
        {"test": ["member_of"]}
    ],
    "claims_parameter_supported": true,
    "request_parameter_supported": true,
    "request_uri_parameter_supported": true,
    "require_request_uri_registration": false,
    "op_policy_uri": "http://ox.gluu.org/doku.php?id=oxauth:policy",
    "op_tos_uri": "http://ox.gluu.org/doku.php?id=oxauth:tos",
    "frontchannel_logout_supported": true,
    "frontchannel_logout_session_supported": true
}


#######################################################
TEST: OC5:FeatureTest-Verifies Correct at hash when Implicit Flow Used
#######################################################
-------------------------------------------------------
REQUEST:
-------------------------------------------------------
POST /oxauth/restv1/register HTTP/1.1
Content-Type: application/json
Accept: application/json
Host: ce-dev4.gluu.org

{
    "redirect_uris": [
        "https://ce-dev4.gluu.org/oxauth-rp/home.htm",
        "https://client.example.com/cb",
        "https://client.example.com/cb1",
        "https://client.example.com/cb2"
    ],
    "response_types": [
        "token",
        "id_token"
    ],
    "application_type": "web",
    "client_name": "oxAuth test app",
    "sector_identifier_uri": "https://ce-dev4.gluu.org/oxauth/sectoridentifier/@!38D4.410C.1D43.8932!0001!37F2.B744!0012!D426.70FD"
}

-------------------------------------------------------
RESPONSE:
-------------------------------------------------------
HTTP/1.1 200
Cache-Control: no-store
Connection: Keep-Alive
Content-Length: 1340
Content-Type: application/json
Date: Thu, 05 Jul 2018 18:37:54 GMT
Keep-Alive: timeout=5, max=100
Pragma: no-cache
Server: Jetty(9.4.9.v20180320)
Strict-Transport-Security: max-age=31536000; includeSubDomains
X-Content-Type-Options: nosniff
X-Xss-Protection: 1; mode=block

{
    "client_id": "@!38D4.410C.1D43.8932!0001!37F2.B744!0008!F0AF.0EC3.D2FD.347A",
    "client_secret": "fa0db0f9-4f4f-4e64-869f-87f8e3506be7",
    "registration_access_token": "c1f1414b-bfe4-4b2d-9b82-3cc1ec415eb7",
    "registration_client_uri": "https://ce-dev4.gluu.org/oxauth/restv1/register?client_id=@!38D4.410C.1D43.8932!0001!37F2.B744!0008!F0AF.0EC3.D2FD.347A",
    "client_id_issued_at": 1530815874,
    "client_secret_expires_at": 1530902274,
    "redirect_uris": [
        "https://client.example.com/cb2",
        "https://client.example.com/cb1",
        "https://client.example.com/cb",
        "https://ce-dev4.gluu.org/oxauth-rp/home.htm"
    ],
    "response_types": [
        "id_token",
        "token"
    ],
    "grant_types": ["implicit"],
    "application_type": "web",
    "client_name": "oxAuth test app",
    "sector_identifier_uri": "https://ce-dev4.gluu.org/oxauth/sectoridentifier/@!38D4.410C.1D43.8932!0001!37F2.B744!0012!D426.70FD",
    "subject_type": "pairwise",
    "id_token_signed_response_alg": "RS256",
    "token_endpoint_auth_method": "client_secret_basic",
    "require_auth_time": false,
    "frontchannel_logout_session_required": false,
    "scope": "permission uma_protection clientinfo email user_name sub org_name address openid test_scope1 work_phone phone profile test",
    "claims": ""
}

authenticateResourceOwnerAndGrantAccess: Cleaning cookies
authenticateResourceOwnerAndGrantAccess: authorizationRequestUrl:https://ce-dev4.gluu.org/oxauth/restv1/authorize?response_type=token+id_token&client_id=%40%2138D4.410C.1D43.8932%210001%2137F2.B744%210008%21F0AF.0EC3.D2FD.347A&scope=openid+profile+address+email&redirect_uri=https%3A%2F%2Fce-dev4.gluu.org%2Foxauth-rp%2Fhome.htm&state=c252d948-403e-435c-863e-05ac90dc7796&nonce=6d5a6c8c-adde-45d1-8f4d-bfe00fa5678d
14:38:16.121 [main] ERROR com.gargoylesoftware.htmlunit.javascript.StrictErrorReporter - runtimeError: message=[An invalid or illegal selector was specified (selector: '*,:x' error: Invalid selector: :x).] sourceName=[https://ce-dev4.gluu.org/oxauth/js/jquery-1.12.4.min.js] line=[2] lineSource=[null] lineOffset=[0]
authenticateResourceOwnerAndGrantAccess: sessionState:c5389452-bbc5-42fd-bfdf-ced6996cd920
-------------------------------------------------------
REQUEST:
-------------------------------------------------------
https://ce-dev4.gluu.org/oxauth/restv1/authorize?response_type=token+id_token&client_id=%40%2138D4.410C.1D43.8932%210001%2137F2.B744%210008%21F0AF.0EC3.D2FD.347A&scope=openid+profile+address+email&redirect_uri=https%3A%2F%2Fce-dev4.gluu.org%2Foxauth-rp%2Fhome.htm&state=c252d948-403e-435c-863e-05ac90dc7796&nonce=6d5a6c8c-adde-45d1-8f4d-bfe00fa5678d

-------------------------------------------------------
RESPONSE:
-------------------------------------------------------
HTTP/1.1 302 Found
Location: https://ce-dev4.gluu.org/oxauth-rp/home.htm#access_token=ed50f8e0-0fa5-4d0c-9c0d-251c8568fb44&scope=address+openid+profile+email&id_token=eyJraWQiOiI4NzE2OGJjMS1lNTU4LTQxNjktOGRkMS05ZmJkNDUxZGU1ZDciLCJ0eXAiOiJKV1QiLCJhbGciOiJSUzI1NiJ9.eyJpc3MiOiJodHRwczovL2NlLWRldjQuZ2x1dS5vcmciLCJhdWQiOiJAITM4RDQuNDEwQy4xRDQzLjg5MzIhMDAwMSEzN0YyLkI3NDQhMDAwOCFGMEFGLjBFQzMuRDJGRC4zNDdBIiwiZXhwIjoxNTMwODE5NDc1LCJpYXQiOjE1MzA4MTU4NzUsIm5vbmNlIjoiNmQ1YTZjOGMtYWRkZS00NWQxLThmNGQtYmZlMDBmYTU2NzhkIiwiYXV0aF90aW1lIjoxNTMwODE1ODc1LCJhdF9oYXNoIjoiYV93SXktbGhPSXEyMUFmMkRWLVUtZyIsIm94T3BlbklEQ29ubmVjdFZlcnNpb24iOiJvcGVuaWRjb25uZWN0LTEuMCIsInN1YiI6IlVmTWdMV0lOYXFMM2lhZTQyZlAtQV9BQXBrbTBnb1FWTjg4WGQ1a1Q2QTQifQ.X0dzQHekfF9r0ICJoczwQZkkQM2yyNf2zaS4sY2k3JcvSsB9fLeIInzHOy2bkaW5rQLX8MLKCQ7MlRpxQcTFOofC1wUOV9GHp1cX9X4lRVZ6OBeqCEh_9vGtyqtW_lK8tOl6GsmRUY2EjUJ2PgRWEeG73twkdeP4A8b3uoQmKMWPbN-Esgj5KDV0h4sem16wGsxyLCKwUSyusePFnJUOZ6vD_rQWIic5tIVbOXHYFjkvDv_ukMmhaLjl_JMtNWryzX1VgVeEa_fOTWWn32r51JlU4FzQ9FgGqYJAjXMQBXPUFD_W6_exc_R2tjIwHmjtvjMNRqDxO-DMIYTqANUHSw&session_id=d5357b32-3907-4d8b-81a2-3c82b0c1d8bf&state=c252d948-403e-435c-863e-05ac90dc7796&token_type=bearer&session_state=c5389452-bbc5-42fd-bfdf-ced6996cd920&expires_in=299

#######################################################
TEST: OpenID Connect Discovery
#######################################################
-------------------------------------------------------
REQUEST:
-------------------------------------------------------
GET /.well-known/webfinger?resource=acct%3Atest_user%40ce-dev4.gluu.org&rel=http%3A%2F%2Fopenid.net%2Fspecs%2Fconnect%2F1.0%2Fissuer HTTP/1.1
Host: ce-dev4.gluu.org

-------------------------------------------------------
RESPONSE:
-------------------------------------------------------
HTTP/1.1 200
Connection: Keep-Alive
Content-Length: 181
Content-Type: application/jrd+json;charset=iso-8859-1
Date: Thu, 05 Jul 2018 18:37:55 GMT
Keep-Alive: timeout=5, max=100
Server: Jetty(9.4.9.v20180320)
Strict-Transport-Security: max-age=31536000; includeSubDomains
X-Content-Type-Options: nosniff
X-Xss-Protection: 1; mode=block

{
    "subject": "acct:test_user@ce-dev4.gluu.org",
    "links": [{
        "rel": "http://openid.net/specs/connect/1.0/issuer",
        "href": "https://ce-dev4.gluu.org"
    }]
}


OpenID Connect Configuration
-------------------------------------------------------
REQUEST:
-------------------------------------------------------
GET /.well-known/openid-configuration HTTP/1.1
Host: ce-dev4.gluu.org

-------------------------------------------------------
RESPONSE:
-------------------------------------------------------
HTTP/1.1 200
Connection: Keep-Alive
Content-Length: 6342
Content-Type: application/json
Date: Thu, 05 Jul 2018 18:37:55 GMT
Keep-Alive: timeout=5, max=100
Server: Jetty(9.4.9.v20180320)
Strict-Transport-Security: max-age=31536000; includeSubDomains
X-Content-Type-Options: nosniff
X-Xss-Protection: 1; mode=block

{
    "issuer": "https://ce-dev4.gluu.org",
    "authorization_endpoint": "https://ce-dev4.gluu.org/oxauth/restv1/authorize",
    "token_endpoint": "https://ce-dev4.gluu.org/oxauth/restv1/token",
    "userinfo_endpoint": "https://ce-dev4.gluu.org/oxauth/restv1/userinfo",
    "clientinfo_endpoint": "https://ce-dev4.gluu.org/oxauth/restv1/clientinfo",
    "check_session_iframe": "https://ce-dev4.gluu.org/oxauth/opiframe",
    "end_session_endpoint": "https://ce-dev4.gluu.org/oxauth/restv1/end_session",
    "jwks_uri": "https://ce-dev4.gluu.org/oxauth/restv1/jwks",
    "registration_endpoint": "https://ce-dev4.gluu.org/oxauth/restv1/register",
    "id_generation_endpoint": "https://ce-dev4.gluu.org/oxauth/restv1/id",
    "introspection_endpoint": "https://ce-dev4.gluu.org/oxauth/restv1/introspection",
    "scopes_supported": [
        "permission",
        "clientinfo",
        "email",
        "user_name",
        "sub",
        "org_name",
        "address",
        "openid",
        "test_scope1",
        "work_phone",
        "phone",
        "profile",
        "mobile_phone",
        "test"
    ],
    "response_types_supported": [
        "code",
        "code id_token",
        "code id_token token",
        "id_token",
        "id_token token",
        "token",
        "code token"
    ],
    "grant_types_supported": [
        "urn:ietf:params:oauth:grant-type:uma-ticket",
        "client_credentials",
        "refresh_token",
        "implicit",
        "password",
        "authorization_code"
    ],
    "acr_values_supported": [
        "super_gluu",
        "u2f",
        "otp",
        "basic",
        "auth_ldap_server"
    ],
    "auth_level_mapping": {
        "-1": ["auth_ldap_server"],
        "50": ["otp"],
        "100": ["basic"],
        "10": ["u2f"],
        "15": ["super_gluu"]
    },
    "subject_types_supported": [
        "public",
        "pairwise"
    ],
    "userinfo_signing_alg_values_supported": [
        "HS256",
        "HS384",
        "HS512",
        "RS256",
        "RS384",
        "RS512",
        "ES256",
        "ES384",
        "ES512"
    ],
    "userinfo_encryption_alg_values_supported": [
        "RSA1_5",
        "RSA-OAEP",
        "A128KW",
        "A256KW"
    ],
    "userinfo_encryption_enc_values_supported": [
        "RSA1_5",
        "RSA-OAEP",
        "A128KW",
        "A256KW"
    ],
    "id_token_signing_alg_values_supported": [
        "none",
        "HS256",
        "HS384",
        "HS512",
        "RS256",
        "RS384",
        "RS512",
        "ES256",
        "ES384",
        "ES512"
    ],
    "id_token_encryption_alg_values_supported": [
        "RSA1_5",
        "RSA-OAEP",
        "A128KW",
        "A256KW"
    ],
    "id_token_encryption_enc_values_supported": [
        "A128CBC+HS256",
        "A256CBC+HS512",
        "A128GCM",
        "A256GCM"
    ],
    "request_object_signing_alg_values_supported": [
        "none",
        "HS256",
        "HS384",
        "HS512",
        "RS256",
        "RS384",
        "RS512",
        "ES256",
        "ES384",
        "ES512"
    ],
    "request_object_encryption_alg_values_supported": [
        "RSA1_5",
        "RSA-OAEP",
        "A128KW",
        "A256KW"
    ],
    "request_object_encryption_enc_values_supported": [
        "A128CBC+HS256",
        "A256CBC+HS512",
        "A128GCM",
        "A256GCM"
    ],
    "token_endpoint_auth_methods_supported": [
        "client_secret_basic",
        "client_secret_post",
        "client_secret_jwt",
        "private_key_jwt"
    ],
    "token_endpoint_auth_signing_alg_values_supported": [
        "HS256",
        "HS384",
        "HS512",
        "RS256",
        "RS384",
        "RS512",
        "ES256",
        "ES384",
        "ES512"
    ],
    "display_values_supported": [
        "page",
        "popup"
    ],
    "claim_types_supported": ["normal"],
    "claims_supported": [
        "birthdate",
        "country",
        "name",
        "email",
        "email_verified",
        "given_name",
        "gender",
        "inum",
        "family_name",
        "updated_at",
        "locale",
        "member_of",
        "middle_name",
        "nickname",
        "oxAuthAppType",
        "oxAuthIdTokenSignedResponseAlg",
        "oxAuthRedirectURI",
        "oxAuthScope",
        "phone_number_verified",
        "picture",
        "preferred_username",
        "profile",
        "zoneinfo",
        "user_name",
        "website"
    ],
    "service_documentation": "http://gluu.org/docs",
    "claims_locales_supported": ["en"],
    "ui_locales_supported": [
        "en",
        "es"
    ],
    "scope_to_claims_mapping": [
        {"permission": []},
        {"uma_protection": []},
        {"clientinfo": [
            "name",
            "inum",
            "oxAuthAppType",
            "oxAuthIdTokenSignedResponseAlg",
            "oxAuthRedirectURI",
            "oxAuthScope"
        ]},
        {"email": [
            "email_verified",
            "email"
        ]},
        {"user_name": ["user_name"]},
        {"sub": []},
        {"org_name": []},
        {"address": [
            "formatted",
            "postal_code",
            "street_address",
            "locality",
            "country",
            "region"
        ]},
        {"openid": []},
        {"test_scope1": []},
        {"work_phone": []},
        {"phone": [
            "phone_number_verified",
            "phone_number"
        ]},
        {"profile": [
            "name",
            "family_name",
            "given_name",
            "middle_name",
            "nickname",
            "preferred_username",
            "profile",
            "picture",
            "website",
            "gender",
            "birthdate",
            "zoneinfo",
            "locale",
            "updated_at"
        ]},
        {"mobile_phone": ["phone_mobile_number"]},
        {"test": ["member_of"]}
    ],
    "claims_parameter_supported": true,
    "request_parameter_supported": true,
    "request_uri_parameter_supported": true,
    "require_request_uri_registration": false,
    "op_policy_uri": "http://ox.gluu.org/doku.php?id=oxauth:policy",
    "op_tos_uri": "http://ox.gluu.org/doku.php?id=oxauth:tos",
    "frontchannel_logout_supported": true,
    "frontchannel_logout_session_supported": true
}


#######################################################
TEST: OC5:FeatureTest-Verifies Correct c hash when Code Flow Used
#######################################################
-------------------------------------------------------
REQUEST:
-------------------------------------------------------
POST /oxauth/restv1/register HTTP/1.1
Content-Type: application/json
Accept: application/json
Host: ce-dev4.gluu.org

{
    "redirect_uris": [
        "https://ce-dev4.gluu.org/oxauth-rp/home.htm",
        "https://client.example.com/cb",
        "https://client.example.com/cb1",
        "https://client.example.com/cb2"
    ],
    "response_types": [
        "code",
        "id_token"
    ],
    "application_type": "web",
    "client_name": "oxAuth test app",
    "sector_identifier_uri": "https://ce-dev4.gluu.org/oxauth/sectoridentifier/@!38D4.410C.1D43.8932!0001!37F2.B744!0012!D426.70FD"
}

-------------------------------------------------------
RESPONSE:
-------------------------------------------------------
HTTP/1.1 200
Cache-Control: no-store
Connection: Keep-Alive
Content-Length: 1425
Content-Type: application/json
Date: Thu, 05 Jul 2018 18:37:56 GMT
Keep-Alive: timeout=5, max=100
Pragma: no-cache
Server: Jetty(9.4.9.v20180320)
Strict-Transport-Security: max-age=31536000; includeSubDomains
X-Content-Type-Options: nosniff
X-Xss-Protection: 1; mode=block

{
    "client_id": "@!38D4.410C.1D43.8932!0001!37F2.B744!0008!7ACE.A96E.644A.2645",
    "client_secret": "f2372fae-5d85-4345-a89a-8dd32887bcd9",
    "registration_access_token": "f1f3c5b5-efa4-450c-a908-3289fa2cffb0",
    "registration_client_uri": "https://ce-dev4.gluu.org/oxauth/restv1/register?client_id=@!38D4.410C.1D43.8932!0001!37F2.B744!0008!7ACE.A96E.644A.2645",
    "client_id_issued_at": 1530815876,
    "client_secret_expires_at": 1530902276,
    "redirect_uris": [
        "https://client.example.com/cb2",
        "https://client.example.com/cb1",
        "https://client.example.com/cb",
        "https://ce-dev4.gluu.org/oxauth-rp/home.htm"
    ],
    "response_types": [
        "code",
        "id_token",
        "token"
    ],
    "grant_types": [
        "refresh_token",
        "implicit",
        "authorization_code"
    ],
    "application_type": "web",
    "client_name": "oxAuth test app",
    "sector_identifier_uri": "https://ce-dev4.gluu.org/oxauth/sectoridentifier/@!38D4.410C.1D43.8932!0001!37F2.B744!0012!D426.70FD",
    "subject_type": "pairwise",
    "id_token_signed_response_alg": "RS256",
    "token_endpoint_auth_method": "client_secret_basic",
    "require_auth_time": false,
    "frontchannel_logout_session_required": false,
    "scope": "permission uma_protection clientinfo email user_name sub org_name address openid test_scope1 work_phone phone profile test",
    "claims": ""
}

authenticateResourceOwnerAndGrantAccess: Cleaning cookies
authenticateResourceOwnerAndGrantAccess: authorizationRequestUrl:https://ce-dev4.gluu.org/oxauth/restv1/authorize?response_type=code+id_token&client_id=%40%2138D4.410C.1D43.8932%210001%2137F2.B744%210008%217ACE.A96E.644A.2645&scope=openid+profile+address+email&redirect_uri=https%3A%2F%2Fce-dev4.gluu.org%2Foxauth-rp%2Fhome.htm&state=902456b2-4a2d-4a0f-b968-ca11b6ae94b5&nonce=8bb9d4f7-fc10-421f-a3b6-2d364bff6ea1
14:38:17.481 [main] ERROR com.gargoylesoftware.htmlunit.javascript.StrictErrorReporter - runtimeError: message=[An invalid or illegal selector was specified (selector: '*,:x' error: Invalid selector: :x).] sourceName=[https://ce-dev4.gluu.org/oxauth/js/jquery-1.12.4.min.js] line=[2] lineSource=[null] lineOffset=[0]
authenticateResourceOwnerAndGrantAccess: sessionState:2b032a31-6e62-45c1-a373-06e659044081
-------------------------------------------------------
REQUEST:
-------------------------------------------------------
https://ce-dev4.gluu.org/oxauth/restv1/authorize?response_type=code+id_token&client_id=%40%2138D4.410C.1D43.8932%210001%2137F2.B744%210008%217ACE.A96E.644A.2645&scope=openid+profile+address+email&redirect_uri=https%3A%2F%2Fce-dev4.gluu.org%2Foxauth-rp%2Fhome.htm&state=902456b2-4a2d-4a0f-b968-ca11b6ae94b5&nonce=8bb9d4f7-fc10-421f-a3b6-2d364bff6ea1

-------------------------------------------------------
RESPONSE:
-------------------------------------------------------
HTTP/1.1 302 Found
Location: https://ce-dev4.gluu.org/oxauth-rp/home.htm#code=f444695d-324b-4853-8a5b-6aa681aaac77&scope=address+openid+profile+email&id_token=eyJraWQiOiI4NzE2OGJjMS1lNTU4LTQxNjktOGRkMS05ZmJkNDUxZGU1ZDciLCJ0eXAiOiJKV1QiLCJhbGciOiJSUzI1NiJ9.eyJpc3MiOiJodHRwczovL2NlLWRldjQuZ2x1dS5vcmciLCJhdWQiOiJAITM4RDQuNDEwQy4xRDQzLjg5MzIhMDAwMSEzN0YyLkI3NDQhMDAwOCE3QUNFLkE5NkUuNjQ0QS4yNjQ1IiwiZXhwIjoxNTMwODE5NDc3LCJpYXQiOjE1MzA4MTU4NzcsIm5vbmNlIjoiOGJiOWQ0ZjctZmMxMC00MjFmLWEzYjYtMmQzNjRiZmY2ZWExIiwiYXV0aF90aW1lIjoxNTMwODE1ODc3LCJjX2hhc2giOiJsMlNCMWx2bkhnOGVyV2dxeE9FS1RRIiwib3hPcGVuSURDb25uZWN0VmVyc2lvbiI6Im9wZW5pZGNvbm5lY3QtMS4wIiwic3ViIjoiNXcxR3M5Zkw0T3Q3c0w2aDdZdXJ0WlpmOU5LVEkyYzF0eldZenhYcWZzVSJ9.hGPisH2c5F9dGH9GIrAIM0Pd9-PxLNHzkR-32dbf8QWiDq4kaSGJ_oyE7f0zF8WZ1Ljpz58Q1aixi0Ss63-5REkDscW2kb2FB805rftwggMXD8jPozCu162rhLzXJVp3ftXq75EOqcmJfwjGF2RJ5U-e-HgMQso3TmK9FqvuRUSjMpyWxIEH_hZ8V0P9zeXuhYrruNaPVfCvR9teOo9NqtHQ8MNjOWJ4x-sMoOVgiaRbey7Yv77IHGCLYAk4R2wcPxC8ADsxs1QkrtSwKGUs7fFsKhxNIdkKyfjlk7eAtUk5WGOvZu9mlMSrIIzht-F0ZVhLVx75iGwj6J65WHpKFQ&session_id=cacdf41f-c9ca-42f3-841c-53e5796028da&state=902456b2-4a2d-4a0f-b968-ca11b6ae94b5&session_state=2b032a31-6e62-45c1-a373-06e659044081

Tests run: 660, Failures: 37, Errors: 0, Skipped: 0, Time elapsed: 723.128 sec <<< FAILURE! - in TestSuite
authorizationRequestObjectWithMultivaluedClaimAlgA128KWEncA128GCM(org.xdi.oxauth.ws.rs.MultivaluedClaims)  Time elapsed: 0.406 sec  <<< FAILURE!
org.openqa.selenium.NoSuchElementException: 
Unable to locate element with name: loginForm:username
For documentation on this error, please visit: http://seleniumhq.org/exceptions/no_such_element.html
Build info: version: '2.53.1', revision: 'a36b8b1cd5757287168e54b817830adce9b0158d', time: '2016-06-30 19:26:09'
System info: host: 'ox.gluu.org', ip: '162.243.99.240', os.name: 'Linux', os.arch: 'amd64', os.version: '3.10.0-229.20.1.el7.x86_64', java.version: '1.8.0_121'
Driver info: driver.version: HtmlUnitDriver
	at org.openqa.selenium.htmlunit.HtmlUnitDriver.findElementByName(HtmlUnitDriver.java:1091)
	at org.openqa.selenium.By$ByName.findElement(By.java:303)
	at org.openqa.selenium.htmlunit.HtmlUnitDriver$5.call(HtmlUnitDriver.java:1707)
	at org.openqa.selenium.htmlunit.HtmlUnitDriver$5.call(HtmlUnitDriver.java:1703)
	at org.openqa.selenium.htmlunit.HtmlUnitDriver.implicitlyWaitFor(HtmlUnitDriver.java:1357)
	at org.openqa.selenium.htmlunit.HtmlUnitDriver.findElement(HtmlUnitDriver.java:1703)
	at org.openqa.selenium.htmlunit.HtmlUnitDriver.findElement(HtmlUnitDriver.java:595)
	at org.xdi.oxauth.BaseTest.processAuthentication(BaseTest.java:341)
	at org.xdi.oxauth.BaseTest.authenticateResourceOwnerAndGrantAccess(BaseTest.java:283)
	at org.xdi.oxauth.BaseTest.authenticateResourceOwnerAndGrantAccess(BaseTest.java:272)
	at org.xdi.oxauth.BaseTest.authenticateResourceOwnerAndGrantAccess(BaseTest.java:262)
	at org.xdi.oxauth.BaseTest.authenticateResourceOwnerAndGrantAccess(BaseTest.java:253)
	at org.xdi.oxauth.ws.rs.MultivaluedClaims.authorizationRequestObjectWithMultivaluedClaimAlgA128KWEncA128GCM(MultivaluedClaims.java:2446)
	at sun.reflect.NativeMethodAccessorImpl.invoke0(Native Method)
	at sun.reflect.NativeMethodAccessorImpl.invoke(NativeMethodAccessorImpl.java:62)
	at sun.reflect.DelegatingMethodAccessorImpl.invoke(DelegatingMethodAccessorImpl.java:43)
	at java.lang.reflect.Method.invoke(Method.java:498)
	at org.testng.internal.MethodInvocationHelper.invokeMethod(MethodInvocationHelper.java:108)
	at org.testng.internal.Invoker.invokeMethod(Invoker.java:661)
	at org.testng.internal.Invoker.invokeTestMethod(Invoker.java:869)
	at org.testng.internal.Invoker.invokeTestMethods(Invoker.java:1193)
	at org.testng.internal.TestMethodWorker.invokeTestMethods(TestMethodWorker.java:126)
	at org.testng.internal.TestMethodWorker.run(TestMethodWorker.java:109)
	at org.testng.TestRunner.privateRun(TestRunner.java:744)
	at org.testng.TestRunner.run(TestRunner.java:602)
	at org.testng.SuiteRunner.runTest(SuiteRunner.java:380)
	at org.testng.SuiteRunner.runSequentially(SuiteRunner.java:375)
	at org.testng.SuiteRunner.privateRun(SuiteRunner.java:340)
	at org.testng.SuiteRunner.run(SuiteRunner.java:289)
	at org.testng.SuiteRunnerWorker.runSuite(SuiteRunnerWorker.java:52)
	at org.testng.SuiteRunnerWorker.run(SuiteRunnerWorker.java:86)
	at org.testng.TestNG.runSuitesSequentially(TestNG.java:1301)
	at org.testng.TestNG.runSuitesLocally(TestNG.java:1226)
	at org.testng.TestNG.runSuites(TestNG.java:1144)
	at org.testng.TestNG.run(TestNG.java:1115)
	at org.apache.maven.surefire.testng.TestNGExecutor.run(TestNGExecutor.java:281)
	at org.apache.maven.surefire.testng.TestNGXmlTestSuite.execute(TestNGXmlTestSuite.java:75)
	at org.apache.maven.surefire.testng.TestNGProvider.invoke(TestNGProvider.java:121)
	at org.apache.maven.surefire.booter.ForkedBooter.invokeProviderInSameClassLoader(ForkedBooter.java:290)
	at org.apache.maven.surefire.booter.ForkedBooter.runSuitesInProcess(ForkedBooter.java:242)
	at org.apache.maven.surefire.booter.ForkedBooter.main(ForkedBooter.java:121)

authorizationRequestObjectWithMultivaluedClaimAlgA256KWEncA256GCM(org.xdi.oxauth.ws.rs.MultivaluedClaims)  Time elapsed: 0.385 sec  <<< FAILURE!
org.openqa.selenium.NoSuchElementException: 
Unable to locate element with name: loginForm:username
For documentation on this error, please visit: http://seleniumhq.org/exceptions/no_such_element.html
Build info: version: '2.53.1', revision: 'a36b8b1cd5757287168e54b817830adce9b0158d', time: '2016-06-30 19:26:09'
System info: host: 'ox.gluu.org', ip: '162.243.99.240', os.name: 'Linux', os.arch: 'amd64', os.version: '3.10.0-229.20.1.el7.x86_64', java.version: '1.8.0_121'
Driver info: driver.version: HtmlUnitDriver
	at org.openqa.selenium.htmlunit.HtmlUnitDriver.findElementByName(HtmlUnitDriver.java:1091)
	at org.openqa.selenium.By$ByName.findElement(By.java:303)
	at org.openqa.selenium.htmlunit.HtmlUnitDriver$5.call(HtmlUnitDriver.java:1707)
	at org.openqa.selenium.htmlunit.HtmlUnitDriver$5.call(HtmlUnitDriver.java:1703)
	at org.openqa.selenium.htmlunit.HtmlUnitDriver.implicitlyWaitFor(HtmlUnitDriver.java:1357)
	at org.openqa.selenium.htmlunit.HtmlUnitDriver.findElement(HtmlUnitDriver.java:1703)
	at org.openqa.selenium.htmlunit.HtmlUnitDriver.findElement(HtmlUnitDriver.java:595)
	at org.xdi.oxauth.BaseTest.processAuthentication(BaseTest.java:341)
	at org.xdi.oxauth.BaseTest.authenticateResourceOwnerAndGrantAccess(BaseTest.java:283)
	at org.xdi.oxauth.BaseTest.authenticateResourceOwnerAndGrantAccess(BaseTest.java:272)
	at org.xdi.oxauth.BaseTest.authenticateResourceOwnerAndGrantAccess(BaseTest.java:262)
	at org.xdi.oxauth.BaseTest.authenticateResourceOwnerAndGrantAccess(BaseTest.java:253)
	at org.xdi.oxauth.ws.rs.MultivaluedClaims.authorizationRequestObjectWithMultivaluedClaimAlgA256KWEncA256GCM(MultivaluedClaims.java:2544)
	at sun.reflect.NativeMethodAccessorImpl.invoke0(Native Method)
	at sun.reflect.NativeMethodAccessorImpl.invoke(NativeMethodAccessorImpl.java:62)
	at sun.reflect.DelegatingMethodAccessorImpl.invoke(DelegatingMethodAccessorImpl.java:43)
	at java.lang.reflect.Method.invoke(Method.java:498)
	at org.testng.internal.MethodInvocationHelper.invokeMethod(MethodInvocationHelper.java:108)
	at org.testng.internal.Invoker.invokeMethod(Invoker.java:661)
	at org.testng.internal.Invoker.invokeTestMethod(Invoker.java:869)
	at org.testng.internal.Invoker.invokeTestMethods(Invoker.java:1193)
	at org.testng.internal.TestMethodWorker.invokeTestMethods(TestMethodWorker.java:126)
	at org.testng.internal.TestMethodWorker.run(TestMethodWorker.java:109)
	at org.testng.TestRunner.privateRun(TestRunner.java:744)
	at org.testng.TestRunner.run(TestRunner.java:602)
	at org.testng.SuiteRunner.runTest(SuiteRunner.java:380)
	at org.testng.SuiteRunner.runSequentially(SuiteRunner.java:375)
	at org.testng.SuiteRunner.privateRun(SuiteRunner.java:340)
	at org.testng.SuiteRunner.run(SuiteRunner.java:289)
	at org.testng.SuiteRunnerWorker.runSuite(SuiteRunnerWorker.java:52)
	at org.testng.SuiteRunnerWorker.run(SuiteRunnerWorker.java:86)
	at org.testng.TestNG.runSuitesSequentially(TestNG.java:1301)
	at org.testng.TestNG.runSuitesLocally(TestNG.java:1226)
	at org.testng.TestNG.runSuites(TestNG.java:1144)
	at org.testng.TestNG.run(TestNG.java:1115)
	at org.apache.maven.surefire.testng.TestNGExecutor.run(TestNGExecutor.java:281)
	at org.apache.maven.surefire.testng.TestNGXmlTestSuite.execute(TestNGXmlTestSuite.java:75)
	at org.apache.maven.surefire.testng.TestNGProvider.invoke(TestNGProvider.java:121)
	at org.apache.maven.surefire.booter.ForkedBooter.invokeProviderInSameClassLoader(ForkedBooter.java:290)
	at org.apache.maven.surefire.booter.ForkedBooter.runSuitesInProcess(ForkedBooter.java:242)
	at org.apache.maven.surefire.booter.ForkedBooter.main(ForkedBooter.java:121)

authorizationRequestObjectWithMultivaluedClaimAlgRSA15EncA128CBCPLUSHS256(org.xdi.oxauth.ws.rs.MultivaluedClaims)  Time elapsed: 1.324 sec  <<< FAILURE!
java.lang.AssertionError: expected [true] but found [false]
	at org.testng.Assert.fail(Assert.java:93)
	at org.testng.Assert.failNotEquals(Assert.java:512)
	at org.testng.Assert.assertTrue(Assert.java:41)
	at org.testng.Assert.assertTrue(Assert.java:51)
	at org.xdi.oxauth.ws.rs.MultivaluedClaims.authorizationRequestObjectWithMultivaluedClaimAlgRSA15EncA128CBCPLUSHS256(MultivaluedClaims.java:2678)
	at sun.reflect.NativeMethodAccessorImpl.invoke0(Native Method)
	at sun.reflect.NativeMethodAccessorImpl.invoke(NativeMethodAccessorImpl.java:62)
	at sun.reflect.DelegatingMethodAccessorImpl.invoke(DelegatingMethodAccessorImpl.java:43)
	at java.lang.reflect.Method.invoke(Method.java:498)
	at org.testng.internal.MethodInvocationHelper.invokeMethod(MethodInvocationHelper.java:108)
	at org.testng.internal.Invoker.invokeMethod(Invoker.java:661)
	at org.testng.internal.Invoker.invokeTestMethod(Invoker.java:869)
	at org.testng.internal.Invoker.invokeTestMethods(Invoker.java:1193)
	at org.testng.internal.TestMethodWorker.invokeTestMethods(TestMethodWorker.java:126)
	at org.testng.internal.TestMethodWorker.run(TestMethodWorker.java:109)
	at org.testng.TestRunner.privateRun(TestRunner.java:744)
	at org.testng.TestRunner.run(TestRunner.java:602)
	at org.testng.SuiteRunner.runTest(SuiteRunner.java:380)
	at org.testng.SuiteRunner.runSequentially(SuiteRunner.java:375)
	at org.testng.SuiteRunner.privateRun(SuiteRunner.java:340)
	at org.testng.SuiteRunner.run(SuiteRunner.java:289)
	at org.testng.SuiteRunnerWorker.runSuite(SuiteRunnerWorker.java:52)
	at org.testng.SuiteRunnerWorker.run(SuiteRunnerWorker.java:86)
	at org.testng.TestNG.runSuitesSequentially(TestNG.java:1301)
	at org.testng.TestNG.runSuitesLocally(TestNG.java:1226)
	at org.testng.TestNG.runSuites(TestNG.java:1144)
	at org.testng.TestNG.run(TestNG.java:1115)
	at org.apache.maven.surefire.testng.TestNGExecutor.run(TestNGExecutor.java:281)
	at org.apache.maven.surefire.testng.TestNGXmlTestSuite.execute(TestNGXmlTestSuite.java:75)
	at org.apache.maven.surefire.testng.TestNGProvider.invoke(TestNGProvider.java:121)
	at org.apache.maven.surefire.booter.ForkedBooter.invokeProviderInSameClassLoader(ForkedBooter.java:290)
	at org.apache.maven.surefire.booter.ForkedBooter.runSuitesInProcess(ForkedBooter.java:242)
	at org.apache.maven.surefire.booter.ForkedBooter.main(ForkedBooter.java:121)

authorizationRequestObjectWithMultivaluedClaimAlgRSA15EncA256CBCPLUSHS512(org.xdi.oxauth.ws.rs.MultivaluedClaims)  Time elapsed: 2.266 sec  <<< FAILURE!
java.lang.AssertionError: expected [true] but found [false]
	at org.testng.Assert.fail(Assert.java:93)
	at org.testng.Assert.failNotEquals(Assert.java:512)
	at org.testng.Assert.assertTrue(Assert.java:41)
	at org.testng.Assert.assertTrue(Assert.java:51)
	at org.xdi.oxauth.ws.rs.MultivaluedClaims.authorizationRequestObjectWithMultivaluedClaimAlgRSA15EncA256CBCPLUSHS512(MultivaluedClaims.java:2788)
	at sun.reflect.NativeMethodAccessorImpl.invoke0(Native Method)
	at sun.reflect.NativeMethodAccessorImpl.invoke(NativeMethodAccessorImpl.java:62)
	at sun.reflect.DelegatingMethodAccessorImpl.invoke(DelegatingMethodAccessorImpl.java:43)
	at java.lang.reflect.Method.invoke(Method.java:498)
	at org.testng.internal.MethodInvocationHelper.invokeMethod(MethodInvocationHelper.java:108)
	at org.testng.internal.Invoker.invokeMethod(Invoker.java:661)
	at org.testng.internal.Invoker.invokeTestMethod(Invoker.java:869)
	at org.testng.internal.Invoker.invokeTestMethods(Invoker.java:1193)
	at org.testng.internal.TestMethodWorker.invokeTestMethods(TestMethodWorker.java:126)
	at org.testng.internal.TestMethodWorker.run(TestMethodWorker.java:109)
	at org.testng.TestRunner.privateRun(TestRunner.java:744)
	at org.testng.TestRunner.run(TestRunner.java:602)
	at org.testng.SuiteRunner.runTest(SuiteRunner.java:380)
	at org.testng.SuiteRunner.runSequentially(SuiteRunner.java:375)
	at org.testng.SuiteRunner.privateRun(SuiteRunner.java:340)
	at org.testng.SuiteRunner.run(SuiteRunner.java:289)
	at org.testng.SuiteRunnerWorker.runSuite(SuiteRunnerWorker.java:52)
	at org.testng.SuiteRunnerWorker.run(SuiteRunnerWorker.java:86)
	at org.testng.TestNG.runSuitesSequentially(TestNG.java:1301)
	at org.testng.TestNG.runSuitesLocally(TestNG.java:1226)
	at org.testng.TestNG.runSuites(TestNG.java:1144)
	at org.testng.TestNG.run(TestNG.java:1115)
	at org.apache.maven.surefire.testng.TestNGExecutor.run(TestNGExecutor.java:281)
	at org.apache.maven.surefire.testng.TestNGXmlTestSuite.execute(TestNGXmlTestSuite.java:75)
	at org.apache.maven.surefire.testng.TestNGProvider.invoke(TestNGProvider.java:121)
	at org.apache.maven.surefire.booter.ForkedBooter.invokeProviderInSameClassLoader(ForkedBooter.java:290)
	at org.apache.maven.surefire.booter.ForkedBooter.runSuitesInProcess(ForkedBooter.java:242)
	at org.apache.maven.surefire.booter.ForkedBooter.main(ForkedBooter.java:121)

authorizationRequestObjectWithMultivaluedClaimAlgRSAOAEPEncA256GCM(org.xdi.oxauth.ws.rs.MultivaluedClaims)  Time elapsed: 2.331 sec  <<< FAILURE!
java.lang.AssertionError: expected [true] but found [false]
	at org.testng.Assert.fail(Assert.java:93)
	at org.testng.Assert.failNotEquals(Assert.java:512)
	at org.testng.Assert.assertTrue(Assert.java:41)
	at org.testng.Assert.assertTrue(Assert.java:51)
	at org.xdi.oxauth.ws.rs.MultivaluedClaims.authorizationRequestObjectWithMultivaluedClaimAlgRSAOAEPEncA256GCM(MultivaluedClaims.java:2898)
	at sun.reflect.NativeMethodAccessorImpl.invoke0(Native Method)
	at sun.reflect.NativeMethodAccessorImpl.invoke(NativeMethodAccessorImpl.java:62)
	at sun.reflect.DelegatingMethodAccessorImpl.invoke(DelegatingMethodAccessorImpl.java:43)
	at java.lang.reflect.Method.invoke(Method.java:498)
	at org.testng.internal.MethodInvocationHelper.invokeMethod(MethodInvocationHelper.java:108)
	at org.testng.internal.Invoker.invokeMethod(Invoker.java:661)
	at org.testng.internal.Invoker.invokeTestMethod(Invoker.java:869)
	at org.testng.internal.Invoker.invokeTestMethods(Invoker.java:1193)
	at org.testng.internal.TestMethodWorker.invokeTestMethods(TestMethodWorker.java:126)
	at org.testng.internal.TestMethodWorker.run(TestMethodWorker.java:109)
	at org.testng.TestRunner.privateRun(TestRunner.java:744)
	at org.testng.TestRunner.run(TestRunner.java:602)
	at org.testng.SuiteRunner.runTest(SuiteRunner.java:380)
	at org.testng.SuiteRunner.runSequentially(SuiteRunner.java:375)
	at org.testng.SuiteRunner.privateRun(SuiteRunner.java:340)
	at org.testng.SuiteRunner.run(SuiteRunner.java:289)
	at org.testng.SuiteRunnerWorker.runSuite(SuiteRunnerWorker.java:52)
	at org.testng.SuiteRunnerWorker.run(SuiteRunnerWorker.java:86)
	at org.testng.TestNG.runSuitesSequentially(TestNG.java:1301)
	at org.testng.TestNG.runSuitesLocally(TestNG.java:1226)
	at org.testng.TestNG.runSuites(TestNG.java:1144)
	at org.testng.TestNG.run(TestNG.java:1115)
	at org.apache.maven.surefire.testng.TestNGExecutor.run(TestNGExecutor.java:281)
	at org.apache.maven.surefire.testng.TestNGXmlTestSuite.execute(TestNGXmlTestSuite.java:75)
	at org.apache.maven.surefire.testng.TestNGProvider.invoke(TestNGProvider.java:121)
	at org.apache.maven.surefire.booter.ForkedBooter.invokeProviderInSameClassLoader(ForkedBooter.java:290)
	at org.apache.maven.surefire.booter.ForkedBooter.runSuitesInProcess(ForkedBooter.java:242)
	at org.apache.maven.surefire.booter.ForkedBooter.main(ForkedBooter.java:121)

authorizationRequestObjectWithMultivaluedClaimES256(org.xdi.oxauth.ws.rs.MultivaluedClaims)  Time elapsed: 1.925 sec  <<< FAILURE!
java.lang.AssertionError: expected [true] but found [false]
	at org.testng.Assert.fail(Assert.java:93)
	at org.testng.Assert.failNotEquals(Assert.java:512)
	at org.testng.Assert.assertTrue(Assert.java:41)
	at org.testng.Assert.assertTrue(Assert.java:51)
	at org.xdi.oxauth.ws.rs.MultivaluedClaims.authorizationRequestObjectWithMultivaluedClaimES256(MultivaluedClaims.java:2159)
	at sun.reflect.NativeMethodAccessorImpl.invoke0(Native Method)
	at sun.reflect.NativeMethodAccessorImpl.invoke(NativeMethodAccessorImpl.java:62)
	at sun.reflect.DelegatingMethodAccessorImpl.invoke(DelegatingMethodAccessorImpl.java:43)
	at java.lang.reflect.Method.invoke(Method.java:498)
	at org.testng.internal.MethodInvocationHelper.invokeMethod(MethodInvocationHelper.java:108)
	at org.testng.internal.Invoker.invokeMethod(Invoker.java:661)
	at org.testng.internal.Invoker.invokeTestMethod(Invoker.java:869)
	at org.testng.internal.Invoker.invokeTestMethods(Invoker.java:1193)
	at org.testng.internal.TestMethodWorker.invokeTestMethods(TestMethodWorker.java:126)
	at org.testng.internal.TestMethodWorker.run(TestMethodWorker.java:109)
	at org.testng.TestRunner.privateRun(TestRunner.java:744)
	at org.testng.TestRunner.run(TestRunner.java:602)
	at org.testng.SuiteRunner.runTest(SuiteRunner.java:380)
	at org.testng.SuiteRunner.runSequentially(SuiteRunner.java:375)
	at org.testng.SuiteRunner.privateRun(SuiteRunner.java:340)
	at org.testng.SuiteRunner.run(SuiteRunner.java:289)
	at org.testng.SuiteRunnerWorker.runSuite(SuiteRunnerWorker.java:52)
	at org.testng.SuiteRunnerWorker.run(SuiteRunnerWorker.java:86)
	at org.testng.TestNG.runSuitesSequentially(TestNG.java:1301)
	at org.testng.TestNG.runSuitesLocally(TestNG.java:1226)
	at org.testng.TestNG.runSuites(TestNG.java:1144)
	at org.testng.TestNG.run(TestNG.java:1115)
	at org.apache.maven.surefire.testng.TestNGExecutor.run(TestNGExecutor.java:281)
	at org.apache.maven.surefire.testng.TestNGXmlTestSuite.execute(TestNGXmlTestSuite.java:75)
	at org.apache.maven.surefire.testng.TestNGProvider.invoke(TestNGProvider.java:121)
	at org.apache.maven.surefire.booter.ForkedBooter.invokeProviderInSameClassLoader(ForkedBooter.java:290)
	at org.apache.maven.surefire.booter.ForkedBooter.runSuitesInProcess(ForkedBooter.java:242)
	at org.apache.maven.surefire.booter.ForkedBooter.main(ForkedBooter.java:121)

authorizationRequestObjectWithMultivaluedClaimES384(org.xdi.oxauth.ws.rs.MultivaluedClaims)  Time elapsed: 1.613 sec  <<< FAILURE!
java.lang.AssertionError: expected [true] but found [false]
	at org.testng.Assert.fail(Assert.java:93)
	at org.testng.Assert.failNotEquals(Assert.java:512)
	at org.testng.Assert.assertTrue(Assert.java:41)
	at org.testng.Assert.assertTrue(Assert.java:51)
	at org.xdi.oxauth.ws.rs.MultivaluedClaims.authorizationRequestObjectWithMultivaluedClaimES384(MultivaluedClaims.java:2262)
	at sun.reflect.NativeMethodAccessorImpl.invoke0(Native Method)
	at sun.reflect.NativeMethodAccessorImpl.invoke(NativeMethodAccessorImpl.java:62)
	at sun.reflect.DelegatingMethodAccessorImpl.invoke(DelegatingMethodAccessorImpl.java:43)
	at java.lang.reflect.Method.invoke(Method.java:498)
	at org.testng.internal.MethodInvocationHelper.invokeMethod(MethodInvocationHelper.java:108)
	at org.testng.internal.Invoker.invokeMethod(Invoker.java:661)
	at org.testng.internal.Invoker.invokeTestMethod(Invoker.java:869)
	at org.testng.internal.Invoker.invokeTestMethods(Invoker.java:1193)
	at org.testng.internal.TestMethodWorker.invokeTestMethods(TestMethodWorker.java:126)
	at org.testng.internal.TestMethodWorker.run(TestMethodWorker.java:109)
	at org.testng.TestRunner.privateRun(TestRunner.java:744)
	at org.testng.TestRunner.run(TestRunner.java:602)
	at org.testng.SuiteRunner.runTest(SuiteRunner.java:380)
	at org.testng.SuiteRunner.runSequentially(SuiteRunner.java:375)
	at org.testng.SuiteRunner.privateRun(SuiteRunner.java:340)
	at org.testng.SuiteRunner.run(SuiteRunner.java:289)
	at org.testng.SuiteRunnerWorker.runSuite(SuiteRunnerWorker.java:52)
	at org.testng.SuiteRunnerWorker.run(SuiteRunnerWorker.java:86)
	at org.testng.TestNG.runSuitesSequentially(TestNG.java:1301)
	at org.testng.TestNG.runSuitesLocally(TestNG.java:1226)
	at org.testng.TestNG.runSuites(TestNG.java:1144)
	at org.testng.TestNG.run(TestNG.java:1115)
	at org.apache.maven.surefire.testng.TestNGExecutor.run(TestNGExecutor.java:281)
	at org.apache.maven.surefire.testng.TestNGXmlTestSuite.execute(TestNGXmlTestSuite.java:75)
	at org.apache.maven.surefire.testng.TestNGProvider.invoke(TestNGProvider.java:121)
	at org.apache.maven.surefire.booter.ForkedBooter.invokeProviderInSameClassLoader(ForkedBooter.java:290)
	at org.apache.maven.surefire.booter.ForkedBooter.runSuitesInProcess(ForkedBooter.java:242)
	at org.apache.maven.surefire.booter.ForkedBooter.main(ForkedBooter.java:121)

authorizationRequestObjectWithMultivaluedClaimES512(org.xdi.oxauth.ws.rs.MultivaluedClaims)  Time elapsed: 1.454 sec  <<< FAILURE!
java.lang.AssertionError: expected [true] but found [false]
	at org.testng.Assert.fail(Assert.java:93)
	at org.testng.Assert.failNotEquals(Assert.java:512)
	at org.testng.Assert.assertTrue(Assert.java:41)
	at org.testng.Assert.assertTrue(Assert.java:51)
	at org.xdi.oxauth.ws.rs.MultivaluedClaims.authorizationRequestObjectWithMultivaluedClaimES512(MultivaluedClaims.java:2365)
	at sun.reflect.NativeMethodAccessorImpl.invoke0(Native Method)
	at sun.reflect.NativeMethodAccessorImpl.invoke(NativeMethodAccessorImpl.java:62)
	at sun.reflect.DelegatingMethodAccessorImpl.invoke(DelegatingMethodAccessorImpl.java:43)
	at java.lang.reflect.Method.invoke(Method.java:498)
	at org.testng.internal.MethodInvocationHelper.invokeMethod(MethodInvocationHelper.java:108)
	at org.testng.internal.Invoker.invokeMethod(Invoker.java:661)
	at org.testng.internal.Invoker.invokeTestMethod(Invoker.java:869)
	at org.testng.internal.Invoker.invokeTestMethods(Invoker.java:1193)
	at org.testng.internal.TestMethodWorker.invokeTestMethods(TestMethodWorker.java:126)
	at org.testng.internal.TestMethodWorker.run(TestMethodWorker.java:109)
	at org.testng.TestRunner.privateRun(TestRunner.java:744)
	at org.testng.TestRunner.run(TestRunner.java:602)
	at org.testng.SuiteRunner.runTest(SuiteRunner.java:380)
	at org.testng.SuiteRunner.runSequentially(SuiteRunner.java:375)
	at org.testng.SuiteRunner.privateRun(SuiteRunner.java:340)
	at org.testng.SuiteRunner.run(SuiteRunner.java:289)
	at org.testng.SuiteRunnerWorker.runSuite(SuiteRunnerWorker.java:52)
	at org.testng.SuiteRunnerWorker.run(SuiteRunnerWorker.java:86)
	at org.testng.TestNG.runSuitesSequentially(TestNG.java:1301)
	at org.testng.TestNG.runSuitesLocally(TestNG.java:1226)
	at org.testng.TestNG.runSuites(TestNG.java:1144)
	at org.testng.TestNG.run(TestNG.java:1115)
	at org.apache.maven.surefire.testng.TestNGExecutor.run(TestNGExecutor.java:281)
	at org.apache.maven.surefire.testng.TestNGXmlTestSuite.execute(TestNGXmlTestSuite.java:75)
	at org.apache.maven.surefire.testng.TestNGProvider.invoke(TestNGProvider.java:121)
	at org.apache.maven.surefire.booter.ForkedBooter.invokeProviderInSameClassLoader(ForkedBooter.java:290)
	at org.apache.maven.surefire.booter.ForkedBooter.runSuitesInProcess(ForkedBooter.java:242)
	at org.apache.maven.surefire.booter.ForkedBooter.main(ForkedBooter.java:121)

authorizationRequestObjectWithMultivaluedClaimHS256(org.xdi.oxauth.ws.rs.MultivaluedClaims)  Time elapsed: 1.244 sec  <<< FAILURE!
java.lang.AssertionError: expected [true] but found [false]
	at org.testng.Assert.fail(Assert.java:93)
	at org.testng.Assert.failNotEquals(Assert.java:512)
	at org.testng.Assert.assertTrue(Assert.java:41)
	at org.testng.Assert.assertTrue(Assert.java:51)
	at org.xdi.oxauth.ws.rs.MultivaluedClaims.authorizationRequestObjectWithMultivaluedClaimHS256(MultivaluedClaims.java:1557)
	at sun.reflect.NativeMethodAccessorImpl.invoke0(Native Method)
	at sun.reflect.NativeMethodAccessorImpl.invoke(NativeMethodAccessorImpl.java:62)
	at sun.reflect.DelegatingMethodAccessorImpl.invoke(DelegatingMethodAccessorImpl.java:43)
	at java.lang.reflect.Method.invoke(Method.java:498)
	at org.testng.internal.MethodInvocationHelper.invokeMethod(MethodInvocationHelper.java:108)
	at org.testng.internal.Invoker.invokeMethod(Invoker.java:661)
	at org.testng.internal.Invoker.invokeTestMethod(Invoker.java:869)
	at org.testng.internal.Invoker.invokeTestMethods(Invoker.java:1193)
	at org.testng.internal.TestMethodWorker.invokeTestMethods(TestMethodWorker.java:126)
	at org.testng.internal.TestMethodWorker.run(TestMethodWorker.java:109)
	at org.testng.TestRunner.privateRun(TestRunner.java:744)
	at org.testng.TestRunner.run(TestRunner.java:602)
	at org.testng.SuiteRunner.runTest(SuiteRunner.java:380)
	at org.testng.SuiteRunner.runSequentially(SuiteRunner.java:375)
	at org.testng.SuiteRunner.privateRun(SuiteRunner.java:340)
	at org.testng.SuiteRunner.run(SuiteRunner.java:289)
	at org.testng.SuiteRunnerWorker.runSuite(SuiteRunnerWorker.java:52)
	at org.testng.SuiteRunnerWorker.run(SuiteRunnerWorker.java:86)
	at org.testng.TestNG.runSuitesSequentially(TestNG.java:1301)
	at org.testng.TestNG.runSuitesLocally(TestNG.java:1226)
	at org.testng.TestNG.runSuites(TestNG.java:1144)
	at org.testng.TestNG.run(TestNG.java:1115)
	at org.apache.maven.surefire.testng.TestNGExecutor.run(TestNGExecutor.java:281)
	at org.apache.maven.surefire.testng.TestNGXmlTestSuite.execute(TestNGXmlTestSuite.java:75)
	at org.apache.maven.surefire.testng.TestNGProvider.invoke(TestNGProvider.java:121)
	at org.apache.maven.surefire.booter.ForkedBooter.invokeProviderInSameClassLoader(ForkedBooter.java:290)
	at org.apache.maven.surefire.booter.ForkedBooter.runSuitesInProcess(ForkedBooter.java:242)
	at org.apache.maven.surefire.booter.ForkedBooter.main(ForkedBooter.java:121)

authorizationRequestObjectWithMultivaluedClaimHS384(org.xdi.oxauth.ws.rs.MultivaluedClaims)  Time elapsed: 1.487 sec  <<< FAILURE!
java.lang.AssertionError: expected [true] but found [false]
	at org.testng.Assert.fail(Assert.java:93)
	at org.testng.Assert.failNotEquals(Assert.java:512)
	at org.testng.Assert.assertTrue(Assert.java:41)
	at org.testng.Assert.assertTrue(Assert.java:51)
	at org.xdi.oxauth.ws.rs.MultivaluedClaims.authorizationRequestObjectWithMultivaluedClaimHS384(MultivaluedClaims.java:1654)
	at sun.reflect.NativeMethodAccessorImpl.invoke0(Native Method)
	at sun.reflect.NativeMethodAccessorImpl.invoke(NativeMethodAccessorImpl.java:62)
	at sun.reflect.DelegatingMethodAccessorImpl.invoke(DelegatingMethodAccessorImpl.java:43)
	at java.lang.reflect.Method.invoke(Method.java:498)
	at org.testng.internal.MethodInvocationHelper.invokeMethod(MethodInvocationHelper.java:108)
	at org.testng.internal.Invoker.invokeMethod(Invoker.java:661)
	at org.testng.internal.Invoker.invokeTestMethod(Invoker.java:869)
	at org.testng.internal.Invoker.invokeTestMethods(Invoker.java:1193)
	at org.testng.internal.TestMethodWorker.invokeTestMethods(TestMethodWorker.java:126)
	at org.testng.internal.TestMethodWorker.run(TestMethodWorker.java:109)
	at org.testng.TestRunner.privateRun(TestRunner.java:744)
	at org.testng.TestRunner.run(TestRunner.java:602)
	at org.testng.SuiteRunner.runTest(SuiteRunner.java:380)
	at org.testng.SuiteRunner.runSequentially(SuiteRunner.java:375)
	at org.testng.SuiteRunner.privateRun(SuiteRunner.java:340)
	at org.testng.SuiteRunner.run(SuiteRunner.java:289)
	at org.testng.SuiteRunnerWorker.runSuite(SuiteRunnerWorker.java:52)
	at org.testng.SuiteRunnerWorker.run(SuiteRunnerWorker.java:86)
	at org.testng.TestNG.runSuitesSequentially(TestNG.java:1301)
	at org.testng.TestNG.runSuitesLocally(TestNG.java:1226)
	at org.testng.TestNG.runSuites(TestNG.java:1144)
	at org.testng.TestNG.run(TestNG.java:1115)
	at org.apache.maven.surefire.testng.TestNGExecutor.run(TestNGExecutor.java:281)
	at org.apache.maven.surefire.testng.TestNGXmlTestSuite.execute(TestNGXmlTestSuite.java:75)
	at org.apache.maven.surefire.testng.TestNGProvider.invoke(TestNGProvider.java:121)
	at org.apache.maven.surefire.booter.ForkedBooter.invokeProviderInSameClassLoader(ForkedBooter.java:290)
	at org.apache.maven.surefire.booter.ForkedBooter.runSuitesInProcess(ForkedBooter.java:242)
	at org.apache.maven.surefire.booter.ForkedBooter.main(ForkedBooter.java:121)

authorizationRequestObjectWithMultivaluedClaimHS512(org.xdi.oxauth.ws.rs.MultivaluedClaims)  Time elapsed: 1.173 sec  <<< FAILURE!
java.lang.AssertionError: expected [true] but found [false]
	at org.testng.Assert.fail(Assert.java:93)
	at org.testng.Assert.failNotEquals(Assert.java:512)
	at org.testng.Assert.assertTrue(Assert.java:41)
	at org.testng.Assert.assertTrue(Assert.java:51)
	at org.xdi.oxauth.ws.rs.MultivaluedClaims.authorizationRequestObjectWithMultivaluedClaimHS512(MultivaluedClaims.java:1751)
	at sun.reflect.NativeMethodAccessorImpl.invoke0(Native Method)
	at sun.reflect.NativeMethodAccessorImpl.invoke(NativeMethodAccessorImpl.java:62)
	at sun.reflect.DelegatingMethodAccessorImpl.invoke(DelegatingMethodAccessorImpl.java:43)
	at java.lang.reflect.Method.invoke(Method.java:498)
	at org.testng.internal.MethodInvocationHelper.invokeMethod(MethodInvocationHelper.java:108)
	at org.testng.internal.Invoker.invokeMethod(Invoker.java:661)
	at org.testng.internal.Invoker.invokeTestMethod(Invoker.java:869)
	at org.testng.internal.Invoker.invokeTestMethods(Invoker.java:1193)
	at org.testng.internal.TestMethodWorker.invokeTestMethods(TestMethodWorker.java:126)
	at org.testng.internal.TestMethodWorker.run(TestMethodWorker.java:109)
	at org.testng.TestRunner.privateRun(TestRunner.java:744)
	at org.testng.TestRunner.run(TestRunner.java:602)
	at org.testng.SuiteRunner.runTest(SuiteRunner.java:380)
	at org.testng.SuiteRunner.runSequentially(SuiteRunner.java:375)
	at org.testng.SuiteRunner.privateRun(SuiteRunner.java:340)
	at org.testng.SuiteRunner.run(SuiteRunner.java:289)
	at org.testng.SuiteRunnerWorker.runSuite(SuiteRunnerWorker.java:52)
	at org.testng.SuiteRunnerWorker.run(SuiteRunnerWorker.java:86)
	at org.testng.TestNG.runSuitesSequentially(TestNG.java:1301)
	at org.testng.TestNG.runSuitesLocally(TestNG.java:1226)
	at org.testng.TestNG.runSuites(TestNG.java:1144)
	at org.testng.TestNG.run(TestNG.java:1115)
	at org.apache.maven.surefire.testng.TestNGExecutor.run(TestNGExecutor.java:281)
	at org.apache.maven.surefire.testng.TestNGXmlTestSuite.execute(TestNGXmlTestSuite.java:75)
	at org.apache.maven.surefire.testng.TestNGProvider.invoke(TestNGProvider.java:121)
	at org.apache.maven.surefire.booter.ForkedBooter.invokeProviderInSameClassLoader(ForkedBooter.java:290)
	at org.apache.maven.surefire.booter.ForkedBooter.runSuitesInProcess(ForkedBooter.java:242)
	at org.apache.maven.surefire.booter.ForkedBooter.main(ForkedBooter.java:121)

authorizationRequestObjectWithMultivaluedClaimNone(org.xdi.oxauth.ws.rs.MultivaluedClaims)  Time elapsed: 1.174 sec  <<< FAILURE!
java.lang.AssertionError: expected [true] but found [false]
	at org.testng.Assert.fail(Assert.java:93)
	at org.testng.Assert.failNotEquals(Assert.java:512)
	at org.testng.Assert.assertTrue(Assert.java:41)
	at org.testng.Assert.assertTrue(Assert.java:51)
	at org.xdi.oxauth.ws.rs.MultivaluedClaims.authorizationRequestObjectWithMultivaluedClaimNone(MultivaluedClaims.java:1461)
	at sun.reflect.NativeMethodAccessorImpl.invoke0(Native Method)
	at sun.reflect.NativeMethodAccessorImpl.invoke(NativeMethodAccessorImpl.java:62)
	at sun.reflect.DelegatingMethodAccessorImpl.invoke(DelegatingMethodAccessorImpl.java:43)
	at java.lang.reflect.Method.invoke(Method.java:498)
	at org.testng.internal.MethodInvocationHelper.invokeMethod(MethodInvocationHelper.java:108)
	at org.testng.internal.Invoker.invokeMethod(Invoker.java:661)
	at org.testng.internal.Invoker.invokeTestMethod(Invoker.java:869)
	at org.testng.internal.Invoker.invokeTestMethods(Invoker.java:1193)
	at org.testng.internal.TestMethodWorker.invokeTestMethods(TestMethodWorker.java:126)
	at org.testng.internal.TestMethodWorker.run(TestMethodWorker.java:109)
	at org.testng.TestRunner.privateRun(TestRunner.java:744)
	at org.testng.TestRunner.run(TestRunner.java:602)
	at org.testng.SuiteRunner.runTest(SuiteRunner.java:380)
	at org.testng.SuiteRunner.runSequentially(SuiteRunner.java:375)
	at org.testng.SuiteRunner.privateRun(SuiteRunner.java:340)
	at org.testng.SuiteRunner.run(SuiteRunner.java:289)
	at org.testng.SuiteRunnerWorker.runSuite(SuiteRunnerWorker.java:52)
	at org.testng.SuiteRunnerWorker.run(SuiteRunnerWorker.java:86)
	at org.testng.TestNG.runSuitesSequentially(TestNG.java:1301)
	at org.testng.TestNG.runSuitesLocally(TestNG.java:1226)
	at org.testng.TestNG.runSuites(TestNG.java:1144)
	at org.testng.TestNG.run(TestNG.java:1115)
	at org.apache.maven.surefire.testng.TestNGExecutor.run(TestNGExecutor.java:281)
	at org.apache.maven.surefire.testng.TestNGXmlTestSuite.execute(TestNGXmlTestSuite.java:75)
	at org.apache.maven.surefire.testng.TestNGProvider.invoke(TestNGProvider.java:121)
	at org.apache.maven.surefire.booter.ForkedBooter.invokeProviderInSameClassLoader(ForkedBooter.java:290)
	at org.apache.maven.surefire.booter.ForkedBooter.runSuitesInProcess(ForkedBooter.java:242)
	at org.apache.maven.surefire.booter.ForkedBooter.main(ForkedBooter.java:121)

authorizationRequestObjectWithMultivaluedClaimRS256(org.xdi.oxauth.ws.rs.MultivaluedClaims)  Time elapsed: 1.484 sec  <<< FAILURE!
java.lang.AssertionError: expected [true] but found [false]
	at org.testng.Assert.fail(Assert.java:93)
	at org.testng.Assert.failNotEquals(Assert.java:512)
	at org.testng.Assert.assertTrue(Assert.java:41)
	at org.testng.Assert.assertTrue(Assert.java:51)
	at org.xdi.oxauth.ws.rs.MultivaluedClaims.authorizationRequestObjectWithMultivaluedClaimRS256(MultivaluedClaims.java:1850)
	at sun.reflect.NativeMethodAccessorImpl.invoke0(Native Method)
	at sun.reflect.NativeMethodAccessorImpl.invoke(NativeMethodAccessorImpl.java:62)
	at sun.reflect.DelegatingMethodAccessorImpl.invoke(DelegatingMethodAccessorImpl.java:43)
	at java.lang.reflect.Method.invoke(Method.java:498)
	at org.testng.internal.MethodInvocationHelper.invokeMethod(MethodInvocationHelper.java:108)
	at org.testng.internal.Invoker.invokeMethod(Invoker.java:661)
	at org.testng.internal.Invoker.invokeTestMethod(Invoker.java:869)
	at org.testng.internal.Invoker.invokeTestMethods(Invoker.java:1193)
	at org.testng.internal.TestMethodWorker.invokeTestMethods(TestMethodWorker.java:126)
	at org.testng.internal.TestMethodWorker.run(TestMethodWorker.java:109)
	at org.testng.TestRunner.privateRun(TestRunner.java:744)
	at org.testng.TestRunner.run(TestRunner.java:602)
	at org.testng.SuiteRunner.runTest(SuiteRunner.java:380)
	at org.testng.SuiteRunner.runSequentially(SuiteRunner.java:375)
	at org.testng.SuiteRunner.privateRun(SuiteRunner.java:340)
	at org.testng.SuiteRunner.run(SuiteRunner.java:289)
	at org.testng.SuiteRunnerWorker.runSuite(SuiteRunnerWorker.java:52)
	at org.testng.SuiteRunnerWorker.run(SuiteRunnerWorker.java:86)
	at org.testng.TestNG.runSuitesSequentially(TestNG.java:1301)
	at org.testng.TestNG.runSuitesLocally(TestNG.java:1226)
	at org.testng.TestNG.runSuites(TestNG.java:1144)
	at org.testng.TestNG.run(TestNG.java:1115)
	at org.apache.maven.surefire.testng.TestNGExecutor.run(TestNGExecutor.java:281)
	at org.apache.maven.surefire.testng.TestNGXmlTestSuite.execute(TestNGXmlTestSuite.java:75)
	at org.apache.maven.surefire.testng.TestNGProvider.invoke(TestNGProvider.java:121)
	at org.apache.maven.surefire.booter.ForkedBooter.invokeProviderInSameClassLoader(ForkedBooter.java:290)
	at org.apache.maven.surefire.booter.ForkedBooter.runSuitesInProcess(ForkedBooter.java:242)
	at org.apache.maven.surefire.booter.ForkedBooter.main(ForkedBooter.java:121)

authorizationRequestObjectWithMultivaluedClaimRS384(org.xdi.oxauth.ws.rs.MultivaluedClaims)  Time elapsed: 1.264 sec  <<< FAILURE!
java.lang.AssertionError: expected [true] but found [false]
	at org.testng.Assert.fail(Assert.java:93)
	at org.testng.Assert.failNotEquals(Assert.java:512)
	at org.testng.Assert.assertTrue(Assert.java:41)
	at org.testng.Assert.assertTrue(Assert.java:51)
	at org.xdi.oxauth.ws.rs.MultivaluedClaims.authorizationRequestObjectWithMultivaluedClaimRS384(MultivaluedClaims.java:1953)
	at sun.reflect.NativeMethodAccessorImpl.invoke0(Native Method)
	at sun.reflect.NativeMethodAccessorImpl.invoke(NativeMethodAccessorImpl.java:62)
	at sun.reflect.DelegatingMethodAccessorImpl.invoke(DelegatingMethodAccessorImpl.java:43)
	at java.lang.reflect.Method.invoke(Method.java:498)
	at org.testng.internal.MethodInvocationHelper.invokeMethod(MethodInvocationHelper.java:108)
	at org.testng.internal.Invoker.invokeMethod(Invoker.java:661)
	at org.testng.internal.Invoker.invokeTestMethod(Invoker.java:869)
	at org.testng.internal.Invoker.invokeTestMethods(Invoker.java:1193)
	at org.testng.internal.TestMethodWorker.invokeTestMethods(TestMethodWorker.java:126)
	at org.testng.internal.TestMethodWorker.run(TestMethodWorker.java:109)
	at org.testng.TestRunner.privateRun(TestRunner.java:744)
	at org.testng.TestRunner.run(TestRunner.java:602)
	at org.testng.SuiteRunner.runTest(SuiteRunner.java:380)
	at org.testng.SuiteRunner.runSequentially(SuiteRunner.java:375)
	at org.testng.SuiteRunner.privateRun(SuiteRunner.java:340)
	at org.testng.SuiteRunner.run(SuiteRunner.java:289)
	at org.testng.SuiteRunnerWorker.runSuite(SuiteRunnerWorker.java:52)
	at org.testng.SuiteRunnerWorker.run(SuiteRunnerWorker.java:86)
	at org.testng.TestNG.runSuitesSequentially(TestNG.java:1301)
	at org.testng.TestNG.runSuitesLocally(TestNG.java:1226)
	at org.testng.TestNG.runSuites(TestNG.java:1144)
	at org.testng.TestNG.run(TestNG.java:1115)
	at org.apache.maven.surefire.testng.TestNGExecutor.run(TestNGExecutor.java:281)
	at org.apache.maven.surefire.testng.TestNGXmlTestSuite.execute(TestNGXmlTestSuite.java:75)
	at org.apache.maven.surefire.testng.TestNGProvider.invoke(TestNGProvider.java:121)
	at org.apache.maven.surefire.booter.ForkedBooter.invokeProviderInSameClassLoader(ForkedBooter.java:290)
	at org.apache.maven.surefire.booter.ForkedBooter.runSuitesInProcess(ForkedBooter.java:242)
	at org.apache.maven.surefire.booter.ForkedBooter.main(ForkedBooter.java:121)

authorizationRequestObjectWithMultivaluedClaimRS512(org.xdi.oxauth.ws.rs.MultivaluedClaims)  Time elapsed: 1.368 sec  <<< FAILURE!
java.lang.AssertionError: expected [true] but found [false]
	at org.testng.Assert.fail(Assert.java:93)
	at org.testng.Assert.failNotEquals(Assert.java:512)
	at org.testng.Assert.assertTrue(Assert.java:41)
	at org.testng.Assert.assertTrue(Assert.java:51)
	at org.xdi.oxauth.ws.rs.MultivaluedClaims.authorizationRequestObjectWithMultivaluedClaimRS512(MultivaluedClaims.java:2056)
	at sun.reflect.NativeMethodAccessorImpl.invoke0(Native Method)
	at sun.reflect.NativeMethodAccessorImpl.invoke(NativeMethodAccessorImpl.java:62)
	at sun.reflect.DelegatingMethodAccessorImpl.invoke(DelegatingMethodAccessorImpl.java:43)
	at java.lang.reflect.Method.invoke(Method.java:498)
	at org.testng.internal.MethodInvocationHelper.invokeMethod(MethodInvocationHelper.java:108)
	at org.testng.internal.Invoker.invokeMethod(Invoker.java:661)
	at org.testng.internal.Invoker.invokeTestMethod(Invoker.java:869)
	at org.testng.internal.Invoker.invokeTestMethods(Invoker.java:1193)
	at org.testng.internal.TestMethodWorker.invokeTestMethods(TestMethodWorker.java:126)
	at org.testng.internal.TestMethodWorker.run(TestMethodWorker.java:109)
	at org.testng.TestRunner.privateRun(TestRunner.java:744)
	at org.testng.TestRunner.run(TestRunner.java:602)
	at org.testng.SuiteRunner.runTest(SuiteRunner.java:380)
	at org.testng.SuiteRunner.runSequentially(SuiteRunner.java:375)
	at org.testng.SuiteRunner.privateRun(SuiteRunner.java:340)
	at org.testng.SuiteRunner.run(SuiteRunner.java:289)
	at org.testng.SuiteRunnerWorker.runSuite(SuiteRunnerWorker.java:52)
	at org.testng.SuiteRunnerWorker.run(SuiteRunnerWorker.java:86)
	at org.testng.TestNG.runSuitesSequentially(TestNG.java:1301)
	at org.testng.TestNG.runSuitesLocally(TestNG.java:1226)
	at org.testng.TestNG.runSuites(TestNG.java:1144)
	at org.testng.TestNG.run(TestNG.java:1115)
	at org.apache.maven.surefire.testng.TestNGExecutor.run(TestNGExecutor.java:281)
	at org.apache.maven.surefire.testng.TestNGXmlTestSuite.execute(TestNGXmlTestSuite.java:75)
	at org.apache.maven.surefire.testng.TestNGProvider.invoke(TestNGProvider.java:121)
	at org.apache.maven.surefire.booter.ForkedBooter.invokeProviderInSameClassLoader(ForkedBooter.java:290)
	at org.apache.maven.surefire.booter.ForkedBooter.runSuitesInProcess(ForkedBooter.java:242)
	at org.apache.maven.surefire.booter.ForkedBooter.main(ForkedBooter.java:121)

authorizationRequestWithMultivaluedClaimAlgA128KWEncA128GCM(org.xdi.oxauth.ws.rs.MultivaluedClaims)  Time elapsed: 1.159 sec  <<< FAILURE!
org.xdi.oxauth.model.exception.InvalidJweException: org.bouncycastle.crypto.InvalidCipherTextException: checksum failed
	at org.xdi.oxauth.model.jwe.JweDecrypterImpl.decryptEncryptionKey(JweDecrypterImpl.java:126)
	at org.xdi.oxauth.model.jwe.AbstractJweDecrypter.decrypt(AbstractJweDecrypter.java:79)
	at org.xdi.oxauth.model.jwe.Jwe.parse(Jwe.java:91)
	at org.xdi.oxauth.ws.rs.MultivaluedClaims.authorizationRequestWithMultivaluedClaimAlgA128KWEncA128GCM(MultivaluedClaims.java:996)
	at sun.reflect.NativeMethodAccessorImpl.invoke0(Native Method)
	at sun.reflect.NativeMethodAccessorImpl.invoke(NativeMethodAccessorImpl.java:62)
	at sun.reflect.DelegatingMethodAccessorImpl.invoke(DelegatingMethodAccessorImpl.java:43)
	at java.lang.reflect.Method.invoke(Method.java:498)
	at org.testng.internal.MethodInvocationHelper.invokeMethod(MethodInvocationHelper.java:108)
	at org.testng.internal.Invoker.invokeMethod(Invoker.java:661)
	at org.testng.internal.Invoker.invokeTestMethod(Invoker.java:869)
	at org.testng.internal.Invoker.invokeTestMethods(Invoker.java:1193)
	at org.testng.internal.TestMethodWorker.invokeTestMethods(TestMethodWorker.java:126)
	at org.testng.internal.TestMethodWorker.run(TestMethodWorker.java:109)
	at org.testng.TestRunner.privateRun(TestRunner.java:744)
	at org.testng.TestRunner.run(TestRunner.java:602)
	at org.testng.SuiteRunner.runTest(SuiteRunner.java:380)
	at org.testng.SuiteRunner.runSequentially(SuiteRunner.java:375)
	at org.testng.SuiteRunner.privateRun(SuiteRunner.java:340)
	at org.testng.SuiteRunner.run(SuiteRunner.java:289)
	at org.testng.SuiteRunnerWorker.runSuite(SuiteRunnerWorker.java:52)
	at org.testng.SuiteRunnerWorker.run(SuiteRunnerWorker.java:86)
	at org.testng.TestNG.runSuitesSequentially(TestNG.java:1301)
	at org.testng.TestNG.runSuitesLocally(TestNG.java:1226)
	at org.testng.TestNG.runSuites(TestNG.java:1144)
	at org.testng.TestNG.run(TestNG.java:1115)
	at org.apache.maven.surefire.testng.TestNGExecutor.run(TestNGExecutor.java:281)
	at org.apache.maven.surefire.testng.TestNGXmlTestSuite.execute(TestNGXmlTestSuite.java:75)
	at org.apache.maven.surefire.testng.TestNGProvider.invoke(TestNGProvider.java:121)
	at org.apache.maven.surefire.booter.ForkedBooter.invokeProviderInSameClassLoader(ForkedBooter.java:290)
	at org.apache.maven.surefire.booter.ForkedBooter.runSuitesInProcess(ForkedBooter.java:242)
	at org.apache.maven.surefire.booter.ForkedBooter.main(ForkedBooter.java:121)
Caused by: org.bouncycastle.crypto.InvalidCipherTextException: checksum failed
	at org.bouncycastle.crypto.engines.RFC3394WrapEngine.unwrap(Unknown Source)
	at org.xdi.oxauth.model.jwe.JweDecrypterImpl.decryptEncryptionKey(JweDecrypterImpl.java:105)
	... 31 more

authorizationRequestWithMultivaluedClaimAlgA256KWEncA256GCM(org.xdi.oxauth.ws.rs.MultivaluedClaims)  Time elapsed: 1.11 sec  <<< FAILURE!
org.xdi.oxauth.model.exception.InvalidJweException: org.bouncycastle.crypto.InvalidCipherTextException: checksum failed
	at org.xdi.oxauth.model.jwe.JweDecrypterImpl.decryptEncryptionKey(JweDecrypterImpl.java:126)
	at org.xdi.oxauth.model.jwe.AbstractJweDecrypter.decrypt(AbstractJweDecrypter.java:79)
	at org.xdi.oxauth.model.jwe.Jwe.parse(Jwe.java:91)
	at org.xdi.oxauth.ws.rs.MultivaluedClaims.authorizationRequestWithMultivaluedClaimAlgA256KWEncA256GCM(MultivaluedClaims.java:1082)
	at sun.reflect.NativeMethodAccessorImpl.invoke0(Native Method)
	at sun.reflect.NativeMethodAccessorImpl.invoke(NativeMethodAccessorImpl.java:62)
	at sun.reflect.DelegatingMethodAccessorImpl.invoke(DelegatingMethodAccessorImpl.java:43)
	at java.lang.reflect.Method.invoke(Method.java:498)
	at org.testng.internal.MethodInvocationHelper.invokeMethod(MethodInvocationHelper.java:108)
	at org.testng.internal.Invoker.invokeMethod(Invoker.java:661)
	at org.testng.internal.Invoker.invokeTestMethod(Invoker.java:869)
	at org.testng.internal.Invoker.invokeTestMethods(Invoker.java:1193)
	at org.testng.internal.TestMethodWorker.invokeTestMethods(TestMethodWorker.java:126)
	at org.testng.internal.TestMethodWorker.run(TestMethodWorker.java:109)
	at org.testng.TestRunner.privateRun(TestRunner.java:744)
	at org.testng.TestRunner.run(TestRunner.java:602)
	at org.testng.SuiteRunner.runTest(SuiteRunner.java:380)
	at org.testng.SuiteRunner.runSequentially(SuiteRunner.java:375)
	at org.testng.SuiteRunner.privateRun(SuiteRunner.java:340)
	at org.testng.SuiteRunner.run(SuiteRunner.java:289)
	at org.testng.SuiteRunnerWorker.runSuite(SuiteRunnerWorker.java:52)
	at org.testng.SuiteRunnerWorker.run(SuiteRunnerWorker.java:86)
	at org.testng.TestNG.runSuitesSequentially(TestNG.java:1301)
	at org.testng.TestNG.runSuitesLocally(TestNG.java:1226)
	at org.testng.TestNG.runSuites(TestNG.java:1144)
	at org.testng.TestNG.run(TestNG.java:1115)
	at org.apache.maven.surefire.testng.TestNGExecutor.run(TestNGExecutor.java:281)
	at org.apache.maven.surefire.testng.TestNGXmlTestSuite.execute(TestNGXmlTestSuite.java:75)
	at org.apache.maven.surefire.testng.TestNGProvider.invoke(TestNGProvider.java:121)
	at org.apache.maven.surefire.booter.ForkedBooter.invokeProviderInSameClassLoader(ForkedBooter.java:290)
	at org.apache.maven.surefire.booter.ForkedBooter.runSuitesInProcess(ForkedBooter.java:242)
	at org.apache.maven.surefire.booter.ForkedBooter.main(ForkedBooter.java:121)
Caused by: org.bouncycastle.crypto.InvalidCipherTextException: checksum failed
	at org.bouncycastle.crypto.engines.RFC3394WrapEngine.unwrap(Unknown Source)
	at org.xdi.oxauth.model.jwe.JweDecrypterImpl.decryptEncryptionKey(JweDecrypterImpl.java:105)
	... 31 more

requestParameterMethod6(org.xdi.oxauth.ws.rs.OpenIDRequestObjectHttpTest)  Time elapsed: 1.165 sec  <<< FAILURE!
java.lang.AssertionError: expected object to not be null
	at org.testng.Assert.fail(Assert.java:93)
	at org.testng.Assert.assertNotNull(Assert.java:422)
	at org.testng.Assert.assertNotNull(Assert.java:407)
	at org.xdi.oxauth.ws.rs.OpenIDRequestObjectHttpTest.requestParameterMethod6(OpenIDRequestObjectHttpTest.java:440)
	at sun.reflect.NativeMethodAccessorImpl.invoke0(Native Method)
	at sun.reflect.NativeMethodAccessorImpl.invoke(NativeMethodAccessorImpl.java:62)
	at sun.reflect.DelegatingMethodAccessorImpl.invoke(DelegatingMethodAccessorImpl.java:43)
	at java.lang.reflect.Method.invoke(Method.java:498)
	at org.testng.internal.MethodInvocationHelper.invokeMethod(MethodInvocationHelper.java:108)
	at org.testng.internal.Invoker.invokeMethod(Invoker.java:661)
	at org.testng.internal.Invoker.invokeTestMethod(Invoker.java:869)
	at org.testng.internal.Invoker.invokeTestMethods(Invoker.java:1193)
	at org.testng.internal.TestMethodWorker.invokeTestMethods(TestMethodWorker.java:126)
	at org.testng.internal.TestMethodWorker.run(TestMethodWorker.java:109)
	at org.testng.TestRunner.privateRun(TestRunner.java:744)
	at org.testng.TestRunner.run(TestRunner.java:602)
	at org.testng.SuiteRunner.runTest(SuiteRunner.java:380)
	at org.testng.SuiteRunner.runSequentially(SuiteRunner.java:375)
	at org.testng.SuiteRunner.privateRun(SuiteRunner.java:340)
	at org.testng.SuiteRunner.run(SuiteRunner.java:289)
	at org.testng.SuiteRunnerWorker.runSuite(SuiteRunnerWorker.java:52)
	at org.testng.SuiteRunnerWorker.run(SuiteRunnerWorker.java:86)
	at org.testng.TestNG.runSuitesSequentially(TestNG.java:1301)
	at org.testng.TestNG.runSuitesLocally(TestNG.java:1226)
	at org.testng.TestNG.runSuites(TestNG.java:1144)
	at org.testng.TestNG.run(TestNG.java:1115)
	at org.apache.maven.surefire.testng.TestNGExecutor.run(TestNGExecutor.java:281)
	at org.apache.maven.surefire.testng.TestNGXmlTestSuite.execute(TestNGXmlTestSuite.java:75)
	at org.apache.maven.surefire.testng.TestNGProvider.invoke(TestNGProvider.java:121)
	at org.apache.maven.surefire.booter.ForkedBooter.invokeProviderInSameClassLoader(ForkedBooter.java:290)
	at org.apache.maven.surefire.booter.ForkedBooter.runSuitesInProcess(ForkedBooter.java:242)
	at org.apache.maven.surefire.booter.ForkedBooter.main(ForkedBooter.java:121)

requestParameterMethodAlgA128KWEncA128GCM(org.xdi.oxauth.ws.rs.OpenIDRequestObjectHttpTest)  Time elapsed: 0.231 sec  <<< FAILURE!
java.lang.AssertionError: The accessToken is null expected object to not be null
	at org.testng.Assert.fail(Assert.java:93)
	at org.testng.Assert.assertNotNull(Assert.java:422)
	at org.xdi.oxauth.ws.rs.OpenIDRequestObjectHttpTest.requestParameterMethodAlgA128KWEncA128GCM(OpenIDRequestObjectHttpTest.java:2508)
	at sun.reflect.NativeMethodAccessorImpl.invoke0(Native Method)
	at sun.reflect.NativeMethodAccessorImpl.invoke(NativeMethodAccessorImpl.java:62)
	at sun.reflect.DelegatingMethodAccessorImpl.invoke(DelegatingMethodAccessorImpl.java:43)
	at java.lang.reflect.Method.invoke(Method.java:498)
	at org.testng.internal.MethodInvocationHelper.invokeMethod(MethodInvocationHelper.java:108)
	at org.testng.internal.Invoker.invokeMethod(Invoker.java:661)
	at org.testng.internal.Invoker.invokeTestMethod(Invoker.java:869)
	at org.testng.internal.Invoker.invokeTestMethods(Invoker.java:1193)
	at org.testng.internal.TestMethodWorker.invokeTestMethods(TestMethodWorker.java:126)
	at org.testng.internal.TestMethodWorker.run(TestMethodWorker.java:109)
	at org.testng.TestRunner.privateRun(TestRunner.java:744)
	at org.testng.TestRunner.run(TestRunner.java:602)
	at org.testng.SuiteRunner.runTest(SuiteRunner.java:380)
	at org.testng.SuiteRunner.runSequentially(SuiteRunner.java:375)
	at org.testng.SuiteRunner.privateRun(SuiteRunner.java:340)
	at org.testng.SuiteRunner.run(SuiteRunner.java:289)
	at org.testng.SuiteRunnerWorker.runSuite(SuiteRunnerWorker.java:52)
	at org.testng.SuiteRunnerWorker.run(SuiteRunnerWorker.java:86)
	at org.testng.TestNG.runSuitesSequentially(TestNG.java:1301)
	at org.testng.TestNG.runSuitesLocally(TestNG.java:1226)
	at org.testng.TestNG.runSuites(TestNG.java:1144)
	at org.testng.TestNG.run(TestNG.java:1115)
	at org.apache.maven.surefire.testng.TestNGExecutor.run(TestNGExecutor.java:281)
	at org.apache.maven.surefire.testng.TestNGXmlTestSuite.execute(TestNGXmlTestSuite.java:75)
	at org.apache.maven.surefire.testng.TestNGProvider.invoke(TestNGProvider.java:121)
	at org.apache.maven.surefire.booter.ForkedBooter.invokeProviderInSameClassLoader(ForkedBooter.java:290)
	at org.apache.maven.surefire.booter.ForkedBooter.runSuitesInProcess(ForkedBooter.java:242)
	at org.apache.maven.surefire.booter.ForkedBooter.main(ForkedBooter.java:121)

requestParameterMethodAlgA256KWEncA256GCM(org.xdi.oxauth.ws.rs.OpenIDRequestObjectHttpTest)  Time elapsed: 0.231 sec  <<< FAILURE!
java.lang.AssertionError: The accessToken is null expected object to not be null
	at org.testng.Assert.fail(Assert.java:93)
	at org.testng.Assert.assertNotNull(Assert.java:422)
	at org.xdi.oxauth.ws.rs.OpenIDRequestObjectHttpTest.requestParameterMethodAlgA256KWEncA256GCM(OpenIDRequestObjectHttpTest.java:2596)
	at sun.reflect.NativeMethodAccessorImpl.invoke0(Native Method)
	at sun.reflect.NativeMethodAccessorImpl.invoke(NativeMethodAccessorImpl.java:62)
	at sun.reflect.DelegatingMethodAccessorImpl.invoke(DelegatingMethodAccessorImpl.java:43)
	at java.lang.reflect.Method.invoke(Method.java:498)
	at org.testng.internal.MethodInvocationHelper.invokeMethod(MethodInvocationHelper.java:108)
	at org.testng.internal.Invoker.invokeMethod(Invoker.java:661)
	at org.testng.internal.Invoker.invokeTestMethod(Invoker.java:869)
	at org.testng.internal.Invoker.invokeTestMethods(Invoker.java:1193)
	at org.testng.internal.TestMethodWorker.invokeTestMethods(TestMethodWorker.java:126)
	at org.testng.internal.TestMethodWorker.run(TestMethodWorker.java:109)
	at org.testng.TestRunner.privateRun(TestRunner.java:744)
	at org.testng.TestRunner.run(TestRunner.java:602)
	at org.testng.SuiteRunner.runTest(SuiteRunner.java:380)
	at org.testng.SuiteRunner.runSequentially(SuiteRunner.java:375)
	at org.testng.SuiteRunner.privateRun(SuiteRunner.java:340)
	at org.testng.SuiteRunner.run(SuiteRunner.java:289)
	at org.testng.SuiteRunnerWorker.runSuite(SuiteRunnerWorker.java:52)
	at org.testng.SuiteRunnerWorker.run(SuiteRunnerWorker.java:86)
	at org.testng.TestNG.runSuitesSequentially(TestNG.java:1301)
	at org.testng.TestNG.runSuitesLocally(TestNG.java:1226)
	at org.testng.TestNG.runSuites(TestNG.java:1144)
	at org.testng.TestNG.run(TestNG.java:1115)
	at org.apache.maven.surefire.testng.TestNGExecutor.run(TestNGExecutor.java:281)
	at org.apache.maven.surefire.testng.TestNGXmlTestSuite.execute(TestNGXmlTestSuite.java:75)
	at org.apache.maven.surefire.testng.TestNGProvider.invoke(TestNGProvider.java:121)
	at org.apache.maven.surefire.booter.ForkedBooter.invokeProviderInSameClassLoader(ForkedBooter.java:290)
	at org.apache.maven.surefire.booter.ForkedBooter.runSuitesInProcess(ForkedBooter.java:242)
	at org.apache.maven.surefire.booter.ForkedBooter.main(ForkedBooter.java:121)

requestIdTokenAlgA128KWEncA128GCM(org.xdi.oxauth.ws.rs.TokenEncryptionHttpTest)  Time elapsed: 0.194 sec  <<< FAILURE!
java.lang.AssertionError: org.bouncycastle.crypto.InvalidCipherTextException: checksum failed
	at org.testng.Assert.fail(Assert.java:82)
	at org.xdi.oxauth.ws.rs.TokenEncryptionHttpTest.requestIdTokenAlgA128KWEncA128GCM(TokenEncryptionHttpTest.java:338)
	at sun.reflect.NativeMethodAccessorImpl.invoke0(Native Method)
	at sun.reflect.NativeMethodAccessorImpl.invoke(NativeMethodAccessorImpl.java:62)
	at sun.reflect.DelegatingMethodAccessorImpl.invoke(DelegatingMethodAccessorImpl.java:43)
	at java.lang.reflect.Method.invoke(Method.java:498)
	at org.testng.internal.MethodInvocationHelper.invokeMethod(MethodInvocationHelper.java:108)
	at org.testng.internal.Invoker.invokeMethod(Invoker.java:661)
	at org.testng.internal.Invoker.invokeTestMethod(Invoker.java:869)
	at org.testng.internal.Invoker.invokeTestMethods(Invoker.java:1193)
	at org.testng.internal.TestMethodWorker.invokeTestMethods(TestMethodWorker.java:126)
	at org.testng.internal.TestMethodWorker.run(TestMethodWorker.java:109)
	at org.testng.TestRunner.privateRun(TestRunner.java:744)
	at org.testng.TestRunner.run(TestRunner.java:602)
	at org.testng.SuiteRunner.runTest(SuiteRunner.java:380)
	at org.testng.SuiteRunner.runSequentially(SuiteRunner.java:375)
	at org.testng.SuiteRunner.privateRun(SuiteRunner.java:340)
	at org.testng.SuiteRunner.run(SuiteRunner.java:289)
	at org.testng.SuiteRunnerWorker.runSuite(SuiteRunnerWorker.java:52)
	at org.testng.SuiteRunnerWorker.run(SuiteRunnerWorker.java:86)
	at org.testng.TestNG.runSuitesSequentially(TestNG.java:1301)
	at org.testng.TestNG.runSuitesLocally(TestNG.java:1226)
	at org.testng.TestNG.runSuites(TestNG.java:1144)
	at org.testng.TestNG.run(TestNG.java:1115)
	at org.apache.maven.surefire.testng.TestNGExecutor.run(TestNGExecutor.java:281)
	at org.apache.maven.surefire.testng.TestNGXmlTestSuite.execute(TestNGXmlTestSuite.java:75)
	at org.apache.maven.surefire.testng.TestNGProvider.invoke(TestNGProvider.java:121)
	at org.apache.maven.surefire.booter.ForkedBooter.invokeProviderInSameClassLoader(ForkedBooter.java:290)
	at org.apache.maven.surefire.booter.ForkedBooter.runSuitesInProcess(ForkedBooter.java:242)
	at org.apache.maven.surefire.booter.ForkedBooter.main(ForkedBooter.java:121)
Caused by: org.xdi.oxauth.model.exception.InvalidJweException: org.bouncycastle.crypto.InvalidCipherTextException: checksum failed
	at org.xdi.oxauth.model.jwe.JweDecrypterImpl.decryptEncryptionKey(JweDecrypterImpl.java:126)
	at org.xdi.oxauth.model.jwe.AbstractJweDecrypter.decrypt(AbstractJweDecrypter.java:79)
	at org.xdi.oxauth.model.jwe.Jwe.parse(Jwe.java:91)
	at org.xdi.oxauth.ws.rs.TokenEncryptionHttpTest.requestIdTokenAlgA128KWEncA128GCM(TokenEncryptionHttpTest.java:328)
	... 28 more
Caused by: org.bouncycastle.crypto.InvalidCipherTextException: checksum failed
	at org.bouncycastle.crypto.engines.RFC3394WrapEngine.unwrap(Unknown Source)
	at org.xdi.oxauth.model.jwe.JweDecrypterImpl.decryptEncryptionKey(JweDecrypterImpl.java:105)
	... 31 more

requestIdTokenAlgA256KWEncA256GCM(org.xdi.oxauth.ws.rs.TokenEncryptionHttpTest)  Time elapsed: 0.198 sec  <<< FAILURE!
java.lang.AssertionError: org.bouncycastle.crypto.InvalidCipherTextException: checksum failed
	at org.testng.Assert.fail(Assert.java:82)
	at org.xdi.oxauth.ws.rs.TokenEncryptionHttpTest.requestIdTokenAlgA256KWEncA256GCM(TokenEncryptionHttpTest.java:410)
	at sun.reflect.NativeMethodAccessorImpl.invoke0(Native Method)
	at sun.reflect.NativeMethodAccessorImpl.invoke(NativeMethodAccessorImpl.java:62)
	at sun.reflect.DelegatingMethodAccessorImpl.invoke(DelegatingMethodAccessorImpl.java:43)
	at java.lang.reflect.Method.invoke(Method.java:498)
	at org.testng.internal.MethodInvocationHelper.invokeMethod(MethodInvocationHelper.java:108)
	at org.testng.internal.Invoker.invokeMethod(Invoker.java:661)
	at org.testng.internal.Invoker.invokeTestMethod(Invoker.java:869)
	at org.testng.internal.Invoker.invokeTestMethods(Invoker.java:1193)
	at org.testng.internal.TestMethodWorker.invokeTestMethods(TestMethodWorker.java:126)
	at org.testng.internal.TestMethodWorker.run(TestMethodWorker.java:109)
	at org.testng.TestRunner.privateRun(TestRunner.java:744)
	at org.testng.TestRunner.run(TestRunner.java:602)
	at org.testng.SuiteRunner.runTest(SuiteRunner.java:380)
	at org.testng.SuiteRunner.runSequentially(SuiteRunner.java:375)
	at org.testng.SuiteRunner.privateRun(SuiteRunner.java:340)
	at org.testng.SuiteRunner.run(SuiteRunner.java:289)
	at org.testng.SuiteRunnerWorker.runSuite(SuiteRunnerWorker.java:52)
	at org.testng.SuiteRunnerWorker.run(SuiteRunnerWorker.java:86)
	at org.testng.TestNG.runSuitesSequentially(TestNG.java:1301)
	at org.testng.TestNG.runSuitesLocally(TestNG.java:1226)
	at org.testng.TestNG.runSuites(TestNG.java:1144)
	at org.testng.TestNG.run(TestNG.java:1115)
	at org.apache.maven.surefire.testng.TestNGExecutor.run(TestNGExecutor.java:281)
	at org.apache.maven.surefire.testng.TestNGXmlTestSuite.execute(TestNGXmlTestSuite.java:75)
	at org.apache.maven.surefire.testng.TestNGProvider.invoke(TestNGProvider.java:121)
	at org.apache.maven.surefire.booter.ForkedBooter.invokeProviderInSameClassLoader(ForkedBooter.java:290)
	at org.apache.maven.surefire.booter.ForkedBooter.runSuitesInProcess(ForkedBooter.java:242)
	at org.apache.maven.surefire.booter.ForkedBooter.main(ForkedBooter.java:121)
Caused by: org.xdi.oxauth.model.exception.InvalidJweException: org.bouncycastle.crypto.InvalidCipherTextException: checksum failed
	at org.xdi.oxauth.model.jwe.JweDecrypterImpl.decryptEncryptionKey(JweDecrypterImpl.java:126)
	at org.xdi.oxauth.model.jwe.AbstractJweDecrypter.decrypt(AbstractJweDecrypter.java:79)
	at org.xdi.oxauth.model.jwe.Jwe.parse(Jwe.java:91)
	at org.xdi.oxauth.ws.rs.TokenEncryptionHttpTest.requestIdTokenAlgA256KWEncA256GCM(TokenEncryptionHttpTest.java:400)
	... 28 more
Caused by: org.bouncycastle.crypto.InvalidCipherTextException: checksum failed
	at org.bouncycastle.crypto.engines.RFC3394WrapEngine.unwrap(Unknown Source)
	at org.xdi.oxauth.model.jwe.JweDecrypterImpl.decryptEncryptionKey(JweDecrypterImpl.java:105)
	... 31 more

requestUserInfoAdditionalClaims(org.xdi.oxauth.ws.rs.UserInfoRestWebServiceHttpTest)  Time elapsed: 1.901 sec  <<< FAILURE!
java.lang.AssertionError: Unexpected result: iname not found expected object to not be null
	at org.testng.Assert.fail(Assert.java:93)
	at org.testng.Assert.assertNotNull(Assert.java:422)
	at org.xdi.oxauth.ws.rs.UserInfoRestWebServiceHttpTest.requestUserInfoAdditionalClaims(UserInfoRestWebServiceHttpTest.java:464)
	at sun.reflect.NativeMethodAccessorImpl.invoke0(Native Method)
	at sun.reflect.NativeMethodAccessorImpl.invoke(NativeMethodAccessorImpl.java:62)
	at sun.reflect.DelegatingMethodAccessorImpl.invoke(DelegatingMethodAccessorImpl.java:43)
	at java.lang.reflect.Method.invoke(Method.java:498)
	at org.testng.internal.MethodInvocationHelper.invokeMethod(MethodInvocationHelper.java:108)
	at org.testng.internal.Invoker.invokeMethod(Invoker.java:661)
	at org.testng.internal.Invoker.invokeTestMethod(Invoker.java:869)
	at org.testng.internal.Invoker.invokeTestMethods(Invoker.java:1193)
	at org.testng.internal.TestMethodWorker.invokeTestMethods(TestMethodWorker.java:126)
	at org.testng.internal.TestMethodWorker.run(TestMethodWorker.java:109)
	at org.testng.TestRunner.privateRun(TestRunner.java:744)
	at org.testng.TestRunner.run(TestRunner.java:602)
	at org.testng.SuiteRunner.runTest(SuiteRunner.java:380)
	at org.testng.SuiteRunner.runSequentially(SuiteRunner.java:375)
	at org.testng.SuiteRunner.privateRun(SuiteRunner.java:340)
	at org.testng.SuiteRunner.run(SuiteRunner.java:289)
	at org.testng.SuiteRunnerWorker.runSuite(SuiteRunnerWorker.java:52)
	at org.testng.SuiteRunnerWorker.run(SuiteRunnerWorker.java:86)
	at org.testng.TestNG.runSuitesSequentially(TestNG.java:1301)
	at org.testng.TestNG.runSuitesLocally(TestNG.java:1226)
	at org.testng.TestNG.runSuites(TestNG.java:1144)
	at org.testng.TestNG.run(TestNG.java:1115)
	at org.apache.maven.surefire.testng.TestNGExecutor.run(TestNGExecutor.java:281)
	at org.apache.maven.surefire.testng.TestNGXmlTestSuite.execute(TestNGXmlTestSuite.java:75)
	at org.apache.maven.surefire.testng.TestNGProvider.invoke(TestNGProvider.java:121)
	at org.apache.maven.surefire.booter.ForkedBooter.invokeProviderInSameClassLoader(ForkedBooter.java:290)
	at org.apache.maven.surefire.booter.ForkedBooter.runSuitesInProcess(ForkedBooter.java:242)
	at org.apache.maven.surefire.booter.ForkedBooter.main(ForkedBooter.java:121)

requestUserInfoAlgA128KWEncA128GCM(org.xdi.oxauth.ws.rs.UserInfoRestWebServiceHttpTest)  Time elapsed: 1.341 sec  <<< FAILURE!
java.lang.AssertionError: expected object to not be null
	at org.testng.Assert.fail(Assert.java:93)
	at org.testng.Assert.assertNotNull(Assert.java:422)
	at org.testng.Assert.assertNotNull(Assert.java:407)
	at org.xdi.oxauth.ws.rs.UserInfoRestWebServiceHttpTest.requestUserInfoAlgA128KWEncA128GCM(UserInfoRestWebServiceHttpTest.java:1354)
	at sun.reflect.NativeMethodAccessorImpl.invoke0(Native Method)
	at sun.reflect.NativeMethodAccessorImpl.invoke(NativeMethodAccessorImpl.java:62)
	at sun.reflect.DelegatingMethodAccessorImpl.invoke(DelegatingMethodAccessorImpl.java:43)
	at java.lang.reflect.Method.invoke(Method.java:498)
	at org.testng.internal.MethodInvocationHelper.invokeMethod(MethodInvocationHelper.java:108)
	at org.testng.internal.Invoker.invokeMethod(Invoker.java:661)
	at org.testng.internal.Invoker.invokeTestMethod(Invoker.java:869)
	at org.testng.internal.Invoker.invokeTestMethods(Invoker.java:1193)
	at org.testng.internal.TestMethodWorker.invokeTestMethods(TestMethodWorker.java:126)
	at org.testng.internal.TestMethodWorker.run(TestMethodWorker.java:109)
	at org.testng.TestRunner.privateRun(TestRunner.java:744)
	at org.testng.TestRunner.run(TestRunner.java:602)
	at org.testng.SuiteRunner.runTest(SuiteRunner.java:380)
	at org.testng.SuiteRunner.runSequentially(SuiteRunner.java:375)
	at org.testng.SuiteRunner.privateRun(SuiteRunner.java:340)
	at org.testng.SuiteRunner.run(SuiteRunner.java:289)
	at org.testng.SuiteRunnerWorker.runSuite(SuiteRunnerWorker.java:52)
	at org.testng.SuiteRunnerWorker.run(SuiteRunnerWorker.java:86)
	at org.testng.TestNG.runSuitesSequentially(TestNG.java:1301)
	at org.testng.TestNG.runSuitesLocally(TestNG.java:1226)
	at org.testng.TestNG.runSuites(TestNG.java:1144)
	at org.testng.TestNG.run(TestNG.java:1115)
	at org.apache.maven.surefire.testng.TestNGExecutor.run(TestNGExecutor.java:281)
	at org.apache.maven.surefire.testng.TestNGXmlTestSuite.execute(TestNGXmlTestSuite.java:75)
	at org.apache.maven.surefire.testng.TestNGProvider.invoke(TestNGProvider.java:121)
	at org.apache.maven.surefire.booter.ForkedBooter.invokeProviderInSameClassLoader(ForkedBooter.java:290)
	at org.apache.maven.surefire.booter.ForkedBooter.runSuitesInProcess(ForkedBooter.java:242)
	at org.apache.maven.surefire.booter.ForkedBooter.main(ForkedBooter.java:121)

requestUserInfoAlgA256KWEncA256GCM(org.xdi.oxauth.ws.rs.UserInfoRestWebServiceHttpTest)  Time elapsed: 1.29 sec  <<< FAILURE!
java.lang.AssertionError: expected object to not be null
	at org.testng.Assert.fail(Assert.java:93)
	at org.testng.Assert.assertNotNull(Assert.java:422)
	at org.testng.Assert.assertNotNull(Assert.java:407)
	at org.xdi.oxauth.ws.rs.UserInfoRestWebServiceHttpTest.requestUserInfoAlgA256KWEncA256GCM(UserInfoRestWebServiceHttpTest.java:1412)
	at sun.reflect.NativeMethodAccessorImpl.invoke0(Native Method)
	at sun.reflect.NativeMethodAccessorImpl.invoke(NativeMethodAccessorImpl.java:62)
	at sun.reflect.DelegatingMethodAccessorImpl.invoke(DelegatingMethodAccessorImpl.java:43)
	at java.lang.reflect.Method.invoke(Method.java:498)
	at org.testng.internal.MethodInvocationHelper.invokeMethod(MethodInvocationHelper.java:108)
	at org.testng.internal.Invoker.invokeMethod(Invoker.java:661)
	at org.testng.internal.Invoker.invokeTestMethod(Invoker.java:869)
	at org.testng.internal.Invoker.invokeTestMethods(Invoker.java:1193)
	at org.testng.internal.TestMethodWorker.invokeTestMethods(TestMethodWorker.java:126)
	at org.testng.internal.TestMethodWorker.run(TestMethodWorker.java:109)
	at org.testng.TestRunner.privateRun(TestRunner.java:744)
	at org.testng.TestRunner.run(TestRunner.java:602)
	at org.testng.SuiteRunner.runTest(SuiteRunner.java:380)
	at org.testng.SuiteRunner.runSequentially(SuiteRunner.java:375)
	at org.testng.SuiteRunner.privateRun(SuiteRunner.java:340)
	at org.testng.SuiteRunner.run(SuiteRunner.java:289)
	at org.testng.SuiteRunnerWorker.runSuite(SuiteRunnerWorker.java:52)
	at org.testng.SuiteRunnerWorker.run(SuiteRunnerWorker.java:86)
	at org.testng.TestNG.runSuitesSequentially(TestNG.java:1301)
	at org.testng.TestNG.runSuitesLocally(TestNG.java:1226)
	at org.testng.TestNG.runSuites(TestNG.java:1144)
	at org.testng.TestNG.run(TestNG.java:1115)
	at org.apache.maven.surefire.testng.TestNGExecutor.run(TestNGExecutor.java:281)
	at org.apache.maven.surefire.testng.TestNGXmlTestSuite.execute(TestNGXmlTestSuite.java:75)
	at org.apache.maven.surefire.testng.TestNGProvider.invoke(TestNGProvider.java:121)
	at org.apache.maven.surefire.booter.ForkedBooter.invokeProviderInSameClassLoader(ForkedBooter.java:290)
	at org.apache.maven.surefire.booter.ForkedBooter.runSuitesInProcess(ForkedBooter.java:242)
	at org.apache.maven.surefire.booter.ForkedBooter.main(ForkedBooter.java:121)

canProvideEncryptedIdTokenResponseAlgA128KWEncA128GCM(org.xdi.oxauth.interop.CanProvideEncryptedIdTokenResponse)  Time elapsed: 1.124 sec  <<< FAILURE!
java.lang.AssertionError: org.bouncycastle.crypto.InvalidCipherTextException: checksum failed
	at org.testng.Assert.fail(Assert.java:82)
	at org.xdi.oxauth.interop.CanProvideEncryptedIdTokenResponse.canProvideEncryptedIdTokenResponseAlgA128KWEncA128GCM(CanProvideEncryptedIdTokenResponse.java:104)
	at sun.reflect.NativeMethodAccessorImpl.invoke0(Native Method)
	at sun.reflect.NativeMethodAccessorImpl.invoke(NativeMethodAccessorImpl.java:62)
	at sun.reflect.DelegatingMethodAccessorImpl.invoke(DelegatingMethodAccessorImpl.java:43)
	at java.lang.reflect.Method.invoke(Method.java:498)
	at org.testng.internal.MethodInvocationHelper.invokeMethod(MethodInvocationHelper.java:108)
	at org.testng.internal.Invoker.invokeMethod(Invoker.java:661)
	at org.testng.internal.Invoker.invokeTestMethod(Invoker.java:869)
	at org.testng.internal.Invoker.invokeTestMethods(Invoker.java:1193)
	at org.testng.internal.TestMethodWorker.invokeTestMethods(TestMethodWorker.java:126)
	at org.testng.internal.TestMethodWorker.run(TestMethodWorker.java:109)
	at org.testng.TestRunner.privateRun(TestRunner.java:744)
	at org.testng.TestRunner.run(TestRunner.java:602)
	at org.testng.SuiteRunner.runTest(SuiteRunner.java:380)
	at org.testng.SuiteRunner.runSequentially(SuiteRunner.java:375)
	at org.testng.SuiteRunner.privateRun(SuiteRunner.java:340)
	at org.testng.SuiteRunner.run(SuiteRunner.java:289)
	at org.testng.SuiteRunnerWorker.runSuite(SuiteRunnerWorker.java:52)
	at org.testng.SuiteRunnerWorker.run(SuiteRunnerWorker.java:86)
	at org.testng.TestNG.runSuitesSequentially(TestNG.java:1301)
	at org.testng.TestNG.runSuitesLocally(TestNG.java:1226)
	at org.testng.TestNG.runSuites(TestNG.java:1144)
	at org.testng.TestNG.run(TestNG.java:1115)
	at org.apache.maven.surefire.testng.TestNGExecutor.run(TestNGExecutor.java:281)
	at org.apache.maven.surefire.testng.TestNGXmlTestSuite.execute(TestNGXmlTestSuite.java:75)
	at org.apache.maven.surefire.testng.TestNGProvider.invoke(TestNGProvider.java:121)
	at org.apache.maven.surefire.booter.ForkedBooter.invokeProviderInSameClassLoader(ForkedBooter.java:290)
	at org.apache.maven.surefire.booter.ForkedBooter.runSuitesInProcess(ForkedBooter.java:242)
	at org.apache.maven.surefire.booter.ForkedBooter.main(ForkedBooter.java:121)
Caused by: org.xdi.oxauth.model.exception.InvalidJweException: org.bouncycastle.crypto.InvalidCipherTextException: checksum failed
	at org.xdi.oxauth.model.jwe.JweDecrypterImpl.decryptEncryptionKey(JweDecrypterImpl.java:126)
	at org.xdi.oxauth.model.jwe.AbstractJweDecrypter.decrypt(AbstractJweDecrypter.java:79)
	at org.xdi.oxauth.model.jwe.Jwe.parse(Jwe.java:91)
	at org.xdi.oxauth.interop.CanProvideEncryptedIdTokenResponse.canProvideEncryptedIdTokenResponseAlgA128KWEncA128GCM(CanProvideEncryptedIdTokenResponse.java:95)
	... 28 more
Caused by: org.bouncycastle.crypto.InvalidCipherTextException: checksum failed
	at org.bouncycastle.crypto.engines.RFC3394WrapEngine.unwrap(Unknown Source)
	at org.xdi.oxauth.model.jwe.JweDecrypterImpl.decryptEncryptionKey(JweDecrypterImpl.java:105)
	... 31 more

canProvideEncryptedIdTokenResponseAlgA256KWEncA256GCM(org.xdi.oxauth.interop.CanProvideEncryptedIdTokenResponse)  Time elapsed: 1.136 sec  <<< FAILURE!
java.lang.AssertionError: org.bouncycastle.crypto.InvalidCipherTextException: checksum failed
	at org.testng.Assert.fail(Assert.java:82)
	at org.xdi.oxauth.interop.CanProvideEncryptedIdTokenResponse.canProvideEncryptedIdTokenResponseAlgA256KWEncA256GCM(CanProvideEncryptedIdTokenResponse.java:173)
	at sun.reflect.NativeMethodAccessorImpl.invoke0(Native Method)
	at sun.reflect.NativeMethodAccessorImpl.invoke(NativeMethodAccessorImpl.java:62)
	at sun.reflect.DelegatingMethodAccessorImpl.invoke(DelegatingMethodAccessorImpl.java:43)
	at java.lang.reflect.Method.invoke(Method.java:498)
	at org.testng.internal.MethodInvocationHelper.invokeMethod(MethodInvocationHelper.java:108)
	at org.testng.internal.Invoker.invokeMethod(Invoker.java:661)
	at org.testng.internal.Invoker.invokeTestMethod(Invoker.java:869)
	at org.testng.internal.Invoker.invokeTestMethods(Invoker.java:1193)
	at org.testng.internal.TestMethodWorker.invokeTestMethods(TestMethodWorker.java:126)
	at org.testng.internal.TestMethodWorker.run(TestMethodWorker.java:109)
	at org.testng.TestRunner.privateRun(TestRunner.java:744)
	at org.testng.TestRunner.run(TestRunner.java:602)
	at org.testng.SuiteRunner.runTest(SuiteRunner.java:380)
	at org.testng.SuiteRunner.runSequentially(SuiteRunner.java:375)
	at org.testng.SuiteRunner.privateRun(SuiteRunner.java:340)
	at org.testng.SuiteRunner.run(SuiteRunner.java:289)
	at org.testng.SuiteRunnerWorker.runSuite(SuiteRunnerWorker.java:52)
	at org.testng.SuiteRunnerWorker.run(SuiteRunnerWorker.java:86)
	at org.testng.TestNG.runSuitesSequentially(TestNG.java:1301)
	at org.testng.TestNG.runSuitesLocally(TestNG.java:1226)
	at org.testng.TestNG.runSuites(TestNG.java:1144)
	at org.testng.TestNG.run(TestNG.java:1115)
	at org.apache.maven.surefire.testng.TestNGExecutor.run(TestNGExecutor.java:281)
	at org.apache.maven.surefire.testng.TestNGXmlTestSuite.execute(TestNGXmlTestSuite.java:75)
	at org.apache.maven.surefire.testng.TestNGProvider.invoke(TestNGProvider.java:121)
	at org.apache.maven.surefire.booter.ForkedBooter.invokeProviderInSameClassLoader(ForkedBooter.java:290)
	at org.apache.maven.surefire.booter.ForkedBooter.runSuitesInProcess(ForkedBooter.java:242)
	at org.apache.maven.surefire.booter.ForkedBooter.main(ForkedBooter.java:121)
Caused by: org.xdi.oxauth.model.exception.InvalidJweException: org.bouncycastle.crypto.InvalidCipherTextException: checksum failed
	at org.xdi.oxauth.model.jwe.JweDecrypterImpl.decryptEncryptionKey(JweDecrypterImpl.java:126)
	at org.xdi.oxauth.model.jwe.AbstractJweDecrypter.decrypt(AbstractJweDecrypter.java:79)
	at org.xdi.oxauth.model.jwe.Jwe.parse(Jwe.java:91)
	at org.xdi.oxauth.interop.CanProvideEncryptedIdTokenResponse.canProvideEncryptedIdTokenResponseAlgA256KWEncA256GCM(CanProvideEncryptedIdTokenResponse.java:164)
	... 28 more
Caused by: org.bouncycastle.crypto.InvalidCipherTextException: checksum failed
	at org.bouncycastle.crypto.engines.RFC3394WrapEngine.unwrap(Unknown Source)
	at org.xdi.oxauth.model.jwe.JweDecrypterImpl.decryptEncryptionKey(JweDecrypterImpl.java:105)
	... 31 more

canProvideEncryptedUserInfoResponseAlgA128KWEncA128GCM(org.xdi.oxauth.interop.CanProvideEncryptedUserInfoResponse)  Time elapsed: 1.226 sec  <<< FAILURE!
java.lang.AssertionError: expected object to not be null
	at org.testng.Assert.fail(Assert.java:93)
	at org.testng.Assert.assertNotNull(Assert.java:422)
	at org.testng.Assert.assertNotNull(Assert.java:407)
	at org.xdi.oxauth.interop.CanProvideEncryptedUserInfoResponse.canProvideEncryptedUserInfoResponseAlgA128KWEncA128GCM(CanProvideEncryptedUserInfoResponse.java:97)
	at sun.reflect.NativeMethodAccessorImpl.invoke0(Native Method)
	at sun.reflect.NativeMethodAccessorImpl.invoke(NativeMethodAccessorImpl.java:62)
	at sun.reflect.DelegatingMethodAccessorImpl.invoke(DelegatingMethodAccessorImpl.java:43)
	at java.lang.reflect.Method.invoke(Method.java:498)
	at org.testng.internal.MethodInvocationHelper.invokeMethod(MethodInvocationHelper.java:108)
	at org.testng.internal.Invoker.invokeMethod(Invoker.java:661)
	at org.testng.internal.Invoker.invokeTestMethod(Invoker.java:869)
	at org.testng.internal.Invoker.invokeTestMethods(Invoker.java:1193)
	at org.testng.internal.TestMethodWorker.invokeTestMethods(TestMethodWorker.java:126)
	at org.testng.internal.TestMethodWorker.run(TestMethodWorker.java:109)
	at org.testng.TestRunner.privateRun(TestRunner.java:744)
	at org.testng.TestRunner.run(TestRunner.java:602)
	at org.testng.SuiteRunner.runTest(SuiteRunner.java:380)
	at org.testng.SuiteRunner.runSequentially(SuiteRunner.java:375)
	at org.testng.SuiteRunner.privateRun(SuiteRunner.java:340)
	at org.testng.SuiteRunner.run(SuiteRunner.java:289)
	at org.testng.SuiteRunnerWorker.runSuite(SuiteRunnerWorker.java:52)
	at org.testng.SuiteRunnerWorker.run(SuiteRunnerWorker.java:86)
	at org.testng.TestNG.runSuitesSequentially(TestNG.java:1301)
	at org.testng.TestNG.runSuitesLocally(TestNG.java:1226)
	at org.testng.TestNG.runSuites(TestNG.java:1144)
	at org.testng.TestNG.run(TestNG.java:1115)
	at org.apache.maven.surefire.testng.TestNGExecutor.run(TestNGExecutor.java:281)
	at org.apache.maven.surefire.testng.TestNGXmlTestSuite.execute(TestNGXmlTestSuite.java:75)
	at org.apache.maven.surefire.testng.TestNGProvider.invoke(TestNGProvider.java:121)
	at org.apache.maven.surefire.booter.ForkedBooter.invokeProviderInSameClassLoader(ForkedBooter.java:290)
	at org.apache.maven.surefire.booter.ForkedBooter.runSuitesInProcess(ForkedBooter.java:242)
	at org.apache.maven.surefire.booter.ForkedBooter.main(ForkedBooter.java:121)

canProvideEncryptedUserInfoResponseAlgA256KWEncA256GCM(org.xdi.oxauth.interop.CanProvideEncryptedUserInfoResponse)  Time elapsed: 1.179 sec  <<< FAILURE!
java.lang.AssertionError: expected object to not be null
	at org.testng.Assert.fail(Assert.java:93)
	at org.testng.Assert.assertNotNull(Assert.java:422)
	at org.testng.Assert.assertNotNull(Assert.java:407)
	at org.xdi.oxauth.interop.CanProvideEncryptedUserInfoResponse.canProvideEncryptedUserInfoResponseAlgA256KWEncA256GCM(CanProvideEncryptedUserInfoResponse.java:171)
	at sun.reflect.NativeMethodAccessorImpl.invoke0(Native Method)
	at sun.reflect.NativeMethodAccessorImpl.invoke(NativeMethodAccessorImpl.java:62)
	at sun.reflect.DelegatingMethodAccessorImpl.invoke(DelegatingMethodAccessorImpl.java:43)
	at java.lang.reflect.Method.invoke(Method.java:498)
	at org.testng.internal.MethodInvocationHelper.invokeMethod(MethodInvocationHelper.java:108)
	at org.testng.internal.Invoker.invokeMethod(Invoker.java:661)
	at org.testng.internal.Invoker.invokeTestMethod(Invoker.java:869)
	at org.testng.internal.Invoker.invokeTestMethods(Invoker.java:1193)
	at org.testng.internal.TestMethodWorker.invokeTestMethods(TestMethodWorker.java:126)
	at org.testng.internal.TestMethodWorker.run(TestMethodWorker.java:109)
	at org.testng.TestRunner.privateRun(TestRunner.java:744)
	at org.testng.TestRunner.run(TestRunner.java:602)
	at org.testng.SuiteRunner.runTest(SuiteRunner.java:380)
	at org.testng.SuiteRunner.runSequentially(SuiteRunner.java:375)
	at org.testng.SuiteRunner.privateRun(SuiteRunner.java:340)
	at org.testng.SuiteRunner.run(SuiteRunner.java:289)
	at org.testng.SuiteRunnerWorker.runSuite(SuiteRunnerWorker.java:52)
	at org.testng.SuiteRunnerWorker.run(SuiteRunnerWorker.java:86)
	at org.testng.TestNG.runSuitesSequentially(TestNG.java:1301)
	at org.testng.TestNG.runSuitesLocally(TestNG.java:1226)
	at org.testng.TestNG.runSuites(TestNG.java:1144)
	at org.testng.TestNG.run(TestNG.java:1115)
	at org.apache.maven.surefire.testng.TestNGExecutor.run(TestNGExecutor.java:281)
	at org.apache.maven.surefire.testng.TestNGXmlTestSuite.execute(TestNGXmlTestSuite.java:75)
	at org.apache.maven.surefire.testng.TestNGProvider.invoke(TestNGProvider.java:121)
	at org.apache.maven.surefire.booter.ForkedBooter.invokeProviderInSameClassLoader(ForkedBooter.java:290)
	at org.apache.maven.surefire.booter.ForkedBooter.runSuitesInProcess(ForkedBooter.java:242)
	at org.apache.maven.surefire.booter.ForkedBooter.main(ForkedBooter.java:121)

canRequestAndUseEncryptedIdTokenResponse(org.xdi.oxauth.interop.CanRequestAndUseEncryptedIdTokenResponse)  Time elapsed: 1.131 sec  <<< FAILURE!
org.xdi.oxauth.model.exception.InvalidJweException: org.bouncycastle.crypto.InvalidCipherTextException: checksum failed
	at org.xdi.oxauth.model.jwe.JweDecrypterImpl.decryptEncryptionKey(JweDecrypterImpl.java:126)
	at org.xdi.oxauth.model.jwe.AbstractJweDecrypter.decrypt(AbstractJweDecrypter.java:79)
	at org.xdi.oxauth.model.jwe.Jwe.parse(Jwe.java:91)
	at org.xdi.oxauth.interop.CanRequestAndUseEncryptedIdTokenResponse.canRequestAndUseEncryptedIdTokenResponse(CanRequestAndUseEncryptedIdTokenResponse.java:93)
	at sun.reflect.NativeMethodAccessorImpl.invoke0(Native Method)
	at sun.reflect.NativeMethodAccessorImpl.invoke(NativeMethodAccessorImpl.java:62)
	at sun.reflect.DelegatingMethodAccessorImpl.invoke(DelegatingMethodAccessorImpl.java:43)
	at java.lang.reflect.Method.invoke(Method.java:498)
	at org.testng.internal.MethodInvocationHelper.invokeMethod(MethodInvocationHelper.java:108)
	at org.testng.internal.Invoker.invokeMethod(Invoker.java:661)
	at org.testng.internal.Invoker.invokeTestMethod(Invoker.java:869)
	at org.testng.internal.Invoker.invokeTestMethods(Invoker.java:1193)
	at org.testng.internal.TestMethodWorker.invokeTestMethods(TestMethodWorker.java:126)
	at org.testng.internal.TestMethodWorker.run(TestMethodWorker.java:109)
	at org.testng.TestRunner.privateRun(TestRunner.java:744)
	at org.testng.TestRunner.run(TestRunner.java:602)
	at org.testng.SuiteRunner.runTest(SuiteRunner.java:380)
	at org.testng.SuiteRunner.runSequentially(SuiteRunner.java:375)
	at org.testng.SuiteRunner.privateRun(SuiteRunner.java:340)
	at org.testng.SuiteRunner.run(SuiteRunner.java:289)
	at org.testng.SuiteRunnerWorker.runSuite(SuiteRunnerWorker.java:52)
	at org.testng.SuiteRunnerWorker.run(SuiteRunnerWorker.java:86)
	at org.testng.TestNG.runSuitesSequentially(TestNG.java:1301)
	at org.testng.TestNG.runSuitesLocally(TestNG.java:1226)
	at org.testng.TestNG.runSuites(TestNG.java:1144)
	at org.testng.TestNG.run(TestNG.java:1115)
	at org.apache.maven.surefire.testng.TestNGExecutor.run(TestNGExecutor.java:281)
	at org.apache.maven.surefire.testng.TestNGXmlTestSuite.execute(TestNGXmlTestSuite.java:75)
	at org.apache.maven.surefire.testng.TestNGProvider.invoke(TestNGProvider.java:121)
	at org.apache.maven.surefire.booter.ForkedBooter.invokeProviderInSameClassLoader(ForkedBooter.java:290)
	at org.apache.maven.surefire.booter.ForkedBooter.runSuitesInProcess(ForkedBooter.java:242)
	at org.apache.maven.surefire.booter.ForkedBooter.main(ForkedBooter.java:121)
Caused by: org.bouncycastle.crypto.InvalidCipherTextException: checksum failed
	at org.bouncycastle.crypto.engines.RFC3394WrapEngine.unwrap(Unknown Source)
	at org.xdi.oxauth.model.jwe.JweDecrypterImpl.decryptEncryptionKey(JweDecrypterImpl.java:105)
	... 31 more

providingIndividuallyRequestedEssentialAndVoluntaryClaims(org.xdi.oxauth.interop.ProvidingIndividuallyRequestedEssentialAndVoluntaryClaims)  Time elapsed: 1.166 sec  <<< FAILURE!
java.lang.AssertionError: expected object to not be null
	at org.testng.Assert.fail(Assert.java:93)
	at org.testng.Assert.assertNotNull(Assert.java:422)
	at org.testng.Assert.assertNotNull(Assert.java:407)
	at org.xdi.oxauth.interop.ProvidingIndividuallyRequestedEssentialAndVoluntaryClaims.providingIndividuallyRequestedEssentialAndVoluntaryClaims(ProvidingIndividuallyRequestedEssentialAndVoluntaryClaims.java:118)
	at sun.reflect.NativeMethodAccessorImpl.invoke0(Native Method)
	at sun.reflect.NativeMethodAccessorImpl.invoke(NativeMethodAccessorImpl.java:62)
	at sun.reflect.DelegatingMethodAccessorImpl.invoke(DelegatingMethodAccessorImpl.java:43)
	at java.lang.reflect.Method.invoke(Method.java:498)
	at org.testng.internal.MethodInvocationHelper.invokeMethod(MethodInvocationHelper.java:108)
	at org.testng.internal.Invoker.invokeMethod(Invoker.java:661)
	at org.testng.internal.Invoker.invokeTestMethod(Invoker.java:869)
	at org.testng.internal.Invoker.invokeTestMethods(Invoker.java:1193)
	at org.testng.internal.TestMethodWorker.invokeTestMethods(TestMethodWorker.java:126)
	at org.testng.internal.TestMethodWorker.run(TestMethodWorker.java:109)
	at org.testng.TestRunner.privateRun(TestRunner.java:744)
	at org.testng.TestRunner.run(TestRunner.java:602)
	at org.testng.SuiteRunner.runTest(SuiteRunner.java:380)
	at org.testng.SuiteRunner.runSequentially(SuiteRunner.java:375)
	at org.testng.SuiteRunner.privateRun(SuiteRunner.java:340)
	at org.testng.SuiteRunner.run(SuiteRunner.java:289)
	at org.testng.SuiteRunnerWorker.runSuite(SuiteRunnerWorker.java:52)
	at org.testng.SuiteRunnerWorker.run(SuiteRunnerWorker.java:86)
	at org.testng.TestNG.runSuitesSequentially(TestNG.java:1301)
	at org.testng.TestNG.runSuitesLocally(TestNG.java:1226)
	at org.testng.TestNG.runSuites(TestNG.java:1144)
	at org.testng.TestNG.run(TestNG.java:1115)
	at org.apache.maven.surefire.testng.TestNGExecutor.run(TestNGExecutor.java:281)
	at org.apache.maven.surefire.testng.TestNGXmlTestSuite.execute(TestNGXmlTestSuite.java:75)
	at org.apache.maven.surefire.testng.TestNGProvider.invoke(TestNGProvider.java:121)
	at org.apache.maven.surefire.booter.ForkedBooter.invokeProviderInSameClassLoader(ForkedBooter.java:290)
	at org.apache.maven.surefire.booter.ForkedBooter.runSuitesInProcess(ForkedBooter.java:242)
	at org.apache.maven.surefire.booter.ForkedBooter.main(ForkedBooter.java:121)

providingIndividuallyRequestedEssentialClaims(org.xdi.oxauth.interop.ProvidingIndividuallyRequestedEssentialClaims)  Time elapsed: 1.144 sec  <<< FAILURE!
java.lang.AssertionError: expected object to not be null
	at org.testng.Assert.fail(Assert.java:93)
	at org.testng.Assert.assertNotNull(Assert.java:422)
	at org.testng.Assert.assertNotNull(Assert.java:407)
	at org.xdi.oxauth.interop.ProvidingIndividuallyRequestedEssentialClaims.providingIndividuallyRequestedEssentialClaims(ProvidingIndividuallyRequestedEssentialClaims.java:114)
	at sun.reflect.NativeMethodAccessorImpl.invoke0(Native Method)
	at sun.reflect.NativeMethodAccessorImpl.invoke(NativeMethodAccessorImpl.java:62)
	at sun.reflect.DelegatingMethodAccessorImpl.invoke(DelegatingMethodAccessorImpl.java:43)
	at java.lang.reflect.Method.invoke(Method.java:498)
	at org.testng.internal.MethodInvocationHelper.invokeMethod(MethodInvocationHelper.java:108)
	at org.testng.internal.Invoker.invokeMethod(Invoker.java:661)
	at org.testng.internal.Invoker.invokeTestMethod(Invoker.java:869)
	at org.testng.internal.Invoker.invokeTestMethods(Invoker.java:1193)
	at org.testng.internal.TestMethodWorker.invokeTestMethods(TestMethodWorker.java:126)
	at org.testng.internal.TestMethodWorker.run(TestMethodWorker.java:109)
	at org.testng.TestRunner.privateRun(TestRunner.java:744)
	at org.testng.TestRunner.run(TestRunner.java:602)
	at org.testng.SuiteRunner.runTest(SuiteRunner.java:380)
	at org.testng.SuiteRunner.runSequentially(SuiteRunner.java:375)
	at org.testng.SuiteRunner.privateRun(SuiteRunner.java:340)
	at org.testng.SuiteRunner.run(SuiteRunner.java:289)
	at org.testng.SuiteRunnerWorker.runSuite(SuiteRunnerWorker.java:52)
	at org.testng.SuiteRunnerWorker.run(SuiteRunnerWorker.java:86)
	at org.testng.TestNG.runSuitesSequentially(TestNG.java:1301)
	at org.testng.TestNG.runSuitesLocally(TestNG.java:1226)
	at org.testng.TestNG.runSuites(TestNG.java:1144)
	at org.testng.TestNG.run(TestNG.java:1115)
	at org.apache.maven.surefire.testng.TestNGExecutor.run(TestNGExecutor.java:281)
	at org.apache.maven.surefire.testng.TestNGXmlTestSuite.execute(TestNGXmlTestSuite.java:75)
	at org.apache.maven.surefire.testng.TestNGProvider.invoke(TestNGProvider.java:121)
	at org.apache.maven.surefire.booter.ForkedBooter.invokeProviderInSameClassLoader(ForkedBooter.java:290)
	at org.apache.maven.surefire.booter.ForkedBooter.runSuitesInProcess(ForkedBooter.java:242)
	at org.apache.maven.surefire.booter.ForkedBooter.main(ForkedBooter.java:121)

providingIndividuallyRequestedVoluntaryClaims(org.xdi.oxauth.interop.ProvidingIndividuallyRequestedVoluntaryClaims)  Time elapsed: 1.138 sec  <<< FAILURE!
java.lang.AssertionError: expected object to not be null
	at org.testng.Assert.fail(Assert.java:93)
	at org.testng.Assert.assertNotNull(Assert.java:422)
	at org.testng.Assert.assertNotNull(Assert.java:407)
	at org.xdi.oxauth.interop.ProvidingIndividuallyRequestedVoluntaryClaims.providingIndividuallyRequestedVoluntaryClaims(ProvidingIndividuallyRequestedVoluntaryClaims.java:115)
	at sun.reflect.NativeMethodAccessorImpl.invoke0(Native Method)
	at sun.reflect.NativeMethodAccessorImpl.invoke(NativeMethodAccessorImpl.java:62)
	at sun.reflect.DelegatingMethodAccessorImpl.invoke(DelegatingMethodAccessorImpl.java:43)
	at java.lang.reflect.Method.invoke(Method.java:498)
	at org.testng.internal.MethodInvocationHelper.invokeMethod(MethodInvocationHelper.java:108)
	at org.testng.internal.Invoker.invokeMethod(Invoker.java:661)
	at org.testng.internal.Invoker.invokeTestMethod(Invoker.java:869)
	at org.testng.internal.Invoker.invokeTestMethods(Invoker.java:1193)
	at org.testng.internal.TestMethodWorker.invokeTestMethods(TestMethodWorker.java:126)
	at org.testng.internal.TestMethodWorker.run(TestMethodWorker.java:109)
	at org.testng.TestRunner.privateRun(TestRunner.java:744)
	at org.testng.TestRunner.run(TestRunner.java:602)
	at org.testng.SuiteRunner.runTest(SuiteRunner.java:380)
	at org.testng.SuiteRunner.runSequentially(SuiteRunner.java:375)
	at org.testng.SuiteRunner.privateRun(SuiteRunner.java:340)
	at org.testng.SuiteRunner.run(SuiteRunner.java:289)
	at org.testng.SuiteRunnerWorker.runSuite(SuiteRunnerWorker.java:52)
	at org.testng.SuiteRunnerWorker.run(SuiteRunnerWorker.java:86)
	at org.testng.TestNG.runSuitesSequentially(TestNG.java:1301)
	at org.testng.TestNG.runSuitesLocally(TestNG.java:1226)
	at org.testng.TestNG.runSuites(TestNG.java:1144)
	at org.testng.TestNG.run(TestNG.java:1115)
	at org.apache.maven.surefire.testng.TestNGExecutor.run(TestNGExecutor.java:281)
	at org.apache.maven.surefire.testng.TestNGXmlTestSuite.execute(TestNGXmlTestSuite.java:75)
	at org.apache.maven.surefire.testng.TestNGProvider.invoke(TestNGProvider.java:121)
	at org.apache.maven.surefire.booter.ForkedBooter.invokeProviderInSameClassLoader(ForkedBooter.java:290)
	at org.apache.maven.surefire.booter.ForkedBooter.runSuitesInProcess(ForkedBooter.java:242)
	at org.apache.maven.surefire.booter.ForkedBooter.main(ForkedBooter.java:121)

supportClaimsRequestSpecifyingSubValueSucceed(org.xdi.oxauth.interop.SupportClaimsRequestSpecifyingSubValue)  Time elapsed: 1.324 sec  <<< FAILURE!
java.lang.AssertionError: expected object to not be null
	at org.testng.Assert.fail(Assert.java:93)
	at org.testng.Assert.assertNotNull(Assert.java:422)
	at org.testng.Assert.assertNotNull(Assert.java:407)
	at org.xdi.oxauth.interop.SupportClaimsRequestSpecifyingSubValue.supportClaimsRequestSpecifyingSubValueSucceed(SupportClaimsRequestSpecifyingSubValue.java:153)
	at sun.reflect.NativeMethodAccessorImpl.invoke0(Native Method)
	at sun.reflect.NativeMethodAccessorImpl.invoke(NativeMethodAccessorImpl.java:62)
	at sun.reflect.DelegatingMethodAccessorImpl.invoke(DelegatingMethodAccessorImpl.java:43)
	at java.lang.reflect.Method.invoke(Method.java:498)
	at org.testng.internal.MethodInvocationHelper.invokeMethod(MethodInvocationHelper.java:108)
	at org.testng.internal.Invoker.invokeMethod(Invoker.java:661)
	at org.testng.internal.Invoker.invokeTestMethod(Invoker.java:869)
	at org.testng.internal.Invoker.invokeTestMethods(Invoker.java:1193)
	at org.testng.internal.TestMethodWorker.invokeTestMethods(TestMethodWorker.java:126)
	at org.testng.internal.TestMethodWorker.run(TestMethodWorker.java:109)
	at org.testng.TestRunner.privateRun(TestRunner.java:744)
	at org.testng.TestRunner.run(TestRunner.java:602)
	at org.testng.SuiteRunner.runTest(SuiteRunner.java:380)
	at org.testng.SuiteRunner.runSequentially(SuiteRunner.java:375)
	at org.testng.SuiteRunner.privateRun(SuiteRunner.java:340)
	at org.testng.SuiteRunner.run(SuiteRunner.java:289)
	at org.testng.SuiteRunnerWorker.runSuite(SuiteRunnerWorker.java:52)
	at org.testng.SuiteRunnerWorker.run(SuiteRunnerWorker.java:86)
	at org.testng.TestNG.runSuitesSequentially(TestNG.java:1301)
	at org.testng.TestNG.runSuitesLocally(TestNG.java:1226)
	at org.testng.TestNG.runSuites(TestNG.java:1144)
	at org.testng.TestNG.run(TestNG.java:1115)
	at org.apache.maven.surefire.testng.TestNGExecutor.run(TestNGExecutor.java:281)
	at org.apache.maven.surefire.testng.TestNGXmlTestSuite.execute(TestNGXmlTestSuite.java:75)
	at org.apache.maven.surefire.testng.TestNGProvider.invoke(TestNGProvider.java:121)
	at org.apache.maven.surefire.booter.ForkedBooter.invokeProviderInSameClassLoader(ForkedBooter.java:290)
	at org.apache.maven.surefire.booter.ForkedBooter.runSuitesInProcess(ForkedBooter.java:242)
	at org.apache.maven.surefire.booter.ForkedBooter.main(ForkedBooter.java:121)

supportsCombiningClaimsRequestedWithScopeAndRequestObject(org.xdi.oxauth.interop.SupportsCombiningClaimsRequestedWithScopeAndRequestObject)  Time elapsed: 1.219 sec  <<< FAILURE!
java.lang.AssertionError: expected object to not be null
	at org.testng.Assert.fail(Assert.java:93)
	at org.testng.Assert.assertNotNull(Assert.java:422)
	at org.testng.Assert.assertNotNull(Assert.java:407)
	at org.xdi.oxauth.interop.SupportsCombiningClaimsRequestedWithScopeAndRequestObject.supportsCombiningClaimsRequestedWithScopeAndRequestObject(SupportsCombiningClaimsRequestedWithScopeAndRequestObject.java:130)
	at sun.reflect.NativeMethodAccessorImpl.invoke0(Native Method)
	at sun.reflect.NativeMethodAccessorImpl.invoke(NativeMethodAccessorImpl.java:62)
	at sun.reflect.DelegatingMethodAccessorImpl.invoke(DelegatingMethodAccessorImpl.java:43)
	at java.lang.reflect.Method.invoke(Method.java:498)
	at org.testng.internal.MethodInvocationHelper.invokeMethod(MethodInvocationHelper.java:108)
	at org.testng.internal.Invoker.invokeMethod(Invoker.java:661)
	at org.testng.internal.Invoker.invokeTestMethod(Invoker.java:869)
	at org.testng.internal.Invoker.invokeTestMethods(Invoker.java:1193)
	at org.testng.internal.TestMethodWorker.invokeTestMethods(TestMethodWorker.java:126)
	at org.testng.internal.TestMethodWorker.run(TestMethodWorker.java:109)
	at org.testng.TestRunner.privateRun(TestRunner.java:744)
	at org.testng.TestRunner.run(TestRunner.java:602)
	at org.testng.SuiteRunner.runTest(SuiteRunner.java:380)
	at org.testng.SuiteRunner.runSequentially(SuiteRunner.java:375)
	at org.testng.SuiteRunner.privateRun(SuiteRunner.java:340)
	at org.testng.SuiteRunner.run(SuiteRunner.java:289)
	at org.testng.SuiteRunnerWorker.runSuite(SuiteRunnerWorker.java:52)
	at org.testng.SuiteRunnerWorker.run(SuiteRunnerWorker.java:86)
	at org.testng.TestNG.runSuitesSequentially(TestNG.java:1301)
	at org.testng.TestNG.runSuitesLocally(TestNG.java:1226)
	at org.testng.TestNG.runSuites(TestNG.java:1144)
	at org.testng.TestNG.run(TestNG.java:1115)
	at org.apache.maven.surefire.testng.TestNGExecutor.run(TestNGExecutor.java:281)
	at org.apache.maven.surefire.testng.TestNGXmlTestSuite.execute(TestNGXmlTestSuite.java:75)
	at org.apache.maven.surefire.testng.TestNGProvider.invoke(TestNGProvider.java:121)
	at org.apache.maven.surefire.booter.ForkedBooter.invokeProviderInSameClassLoader(ForkedBooter.java:290)
	at org.apache.maven.surefire.booter.ForkedBooter.runSuitesInProcess(ForkedBooter.java:242)
	at org.apache.maven.surefire.booter.ForkedBooter.main(ForkedBooter.java:121)

supportsReturningClaimsInIdToken(org.xdi.oxauth.interop.SupportsReturningClaimsInIdToken)  Time elapsed: 1.274 sec  <<< FAILURE!
java.lang.AssertionError: expected object to not be null
	at org.testng.Assert.fail(Assert.java:93)
	at org.testng.Assert.assertNotNull(Assert.java:422)
	at org.testng.Assert.assertNotNull(Assert.java:407)
	at org.xdi.oxauth.interop.SupportsReturningClaimsInIdToken.supportsReturningClaimsInIdToken(SupportsReturningClaimsInIdToken.java:114)
	at sun.reflect.NativeMethodAccessorImpl.invoke0(Native Method)
	at sun.reflect.NativeMethodAccessorImpl.invoke(NativeMethodAccessorImpl.java:62)
	at sun.reflect.DelegatingMethodAccessorImpl.invoke(DelegatingMethodAccessorImpl.java:43)
	at java.lang.reflect.Method.invoke(Method.java:498)
	at org.testng.internal.MethodInvocationHelper.invokeMethod(MethodInvocationHelper.java:108)
	at org.testng.internal.Invoker.invokeMethod(Invoker.java:661)
	at org.testng.internal.Invoker.invokeTestMethod(Invoker.java:869)
	at org.testng.internal.Invoker.invokeTestMethods(Invoker.java:1193)
	at org.testng.internal.TestMethodWorker.invokeTestMethods(TestMethodWorker.java:126)
	at org.testng.internal.TestMethodWorker.run(TestMethodWorker.java:109)
	at org.testng.TestRunner.privateRun(TestRunner.java:744)
	at org.testng.TestRunner.run(TestRunner.java:602)
	at org.testng.SuiteRunner.runTest(SuiteRunner.java:380)
	at org.testng.SuiteRunner.runSequentially(SuiteRunner.java:375)
	at org.testng.SuiteRunner.privateRun(SuiteRunner.java:340)
	at org.testng.SuiteRunner.run(SuiteRunner.java:289)
	at org.testng.SuiteRunnerWorker.runSuite(SuiteRunnerWorker.java:52)
	at org.testng.SuiteRunnerWorker.run(SuiteRunnerWorker.java:86)
	at org.testng.TestNG.runSuitesSequentially(TestNG.java:1301)
	at org.testng.TestNG.runSuitesLocally(TestNG.java:1226)
	at org.testng.TestNG.runSuites(TestNG.java:1144)
	at org.testng.TestNG.run(TestNG.java:1115)
	at org.apache.maven.surefire.testng.TestNGExecutor.run(TestNGExecutor.java:281)
	at org.apache.maven.surefire.testng.TestNGXmlTestSuite.execute(TestNGXmlTestSuite.java:75)
	at org.apache.maven.surefire.testng.TestNGProvider.invoke(TestNGProvider.java:121)
	at org.apache.maven.surefire.booter.ForkedBooter.invokeProviderInSameClassLoader(ForkedBooter.java:290)
	at org.apache.maven.surefire.booter.ForkedBooter.runSuitesInProcess(ForkedBooter.java:242)
	at org.apache.maven.surefire.booter.ForkedBooter.main(ForkedBooter.java:121)

supportsReturningDifferentClaimsInIdTokenAndUserInfoEndpoint(org.xdi.oxauth.interop.SupportsReturningDifferentClaimsInIdTokenAndUserInfoEndpoint)  Time elapsed: 1.214 sec  <<< FAILURE!
java.lang.AssertionError: expected object to not be null
	at org.testng.Assert.fail(Assert.java:93)
	at org.testng.Assert.assertNotNull(Assert.java:422)
	at org.testng.Assert.assertNotNull(Assert.java:407)
	at org.xdi.oxauth.interop.SupportsReturningDifferentClaimsInIdTokenAndUserInfoEndpoint.supportsReturningDifferentClaimsInIdTokenAndUserInfoEndpoint(SupportsReturningDifferentClaimsInIdTokenAndUserInfoEndpoint.java:116)
	at sun.reflect.NativeMethodAccessorImpl.invoke0(Native Method)
	at sun.reflect.NativeMethodAccessorImpl.invoke(NativeMethodAccessorImpl.java:62)
	at sun.reflect.DelegatingMethodAccessorImpl.invoke(DelegatingMethodAccessorImpl.java:43)
	at java.lang.reflect.Method.invoke(Method.java:498)
	at org.testng.internal.MethodInvocationHelper.invokeMethod(MethodInvocationHelper.java:108)
	at org.testng.internal.Invoker.invokeMethod(Invoker.java:661)
	at org.testng.internal.Invoker.invokeTestMethod(Invoker.java:869)
	at org.testng.internal.Invoker.invokeTestMethods(Invoker.java:1193)
	at org.testng.internal.TestMethodWorker.invokeTestMethods(TestMethodWorker.java:126)
	at org.testng.internal.TestMethodWorker.run(TestMethodWorker.java:109)
	at org.testng.TestRunner.privateRun(TestRunner.java:744)
	at org.testng.TestRunner.run(TestRunner.java:602)
	at org.testng.SuiteRunner.runTest(SuiteRunner.java:380)
	at org.testng.SuiteRunner.runSequentially(SuiteRunner.java:375)
	at org.testng.SuiteRunner.privateRun(SuiteRunner.java:340)
	at org.testng.SuiteRunner.run(SuiteRunner.java:289)
	at org.testng.SuiteRunnerWorker.runSuite(SuiteRunnerWorker.java:52)
	at org.testng.SuiteRunnerWorker.run(SuiteRunnerWorker.java:86)
	at org.testng.TestNG.runSuitesSequentially(TestNG.java:1301)
	at org.testng.TestNG.runSuitesLocally(TestNG.java:1226)
	at org.testng.TestNG.runSuites(TestNG.java:1144)
	at org.testng.TestNG.run(TestNG.java:1115)
	at org.apache.maven.surefire.testng.TestNGExecutor.run(TestNGExecutor.java:281)
	at org.apache.maven.surefire.testng.TestNGXmlTestSuite.execute(TestNGXmlTestSuite.java:75)
	at org.apache.maven.surefire.testng.TestNGProvider.invoke(TestNGProvider.java:121)
	at org.apache.maven.surefire.booter.ForkedBooter.invokeProviderInSameClassLoader(ForkedBooter.java:290)
	at org.apache.maven.surefire.booter.ForkedBooter.runSuitesInProcess(ForkedBooter.java:242)
	at org.apache.maven.surefire.booter.ForkedBooter.main(ForkedBooter.java:121)


Results :

Failed tests: 
  CanProvideEncryptedIdTokenResponse.canProvideEncryptedIdTokenResponseAlgA128KWEncA128GCM:104 org.bouncycastle.crypto.InvalidCipherTextException: checksum failed
  CanProvideEncryptedIdTokenResponse.canProvideEncryptedIdTokenResponseAlgA256KWEncA256GCM:173 org.bouncycastle.crypto.InvalidCipherTextException: checksum failed
  CanProvideEncryptedUserInfoResponse.canProvideEncryptedUserInfoResponseAlgA128KWEncA128GCM:97 expected object to not be null
  CanProvideEncryptedUserInfoResponse.canProvideEncryptedUserInfoResponseAlgA256KWEncA256GCM:171 expected object to not be null
  CanRequestAndUseEncryptedIdTokenResponse.canRequestAndUseEncryptedIdTokenResponse:93 » InvalidJwe
  ProvidingIndividuallyRequestedEssentialAndVoluntaryClaims.providingIndividuallyRequestedEssentialAndVoluntaryClaims:118 expected object to not be null
  ProvidingIndividuallyRequestedEssentialClaims.providingIndividuallyRequestedEssentialClaims:114 expected object to not be null
  ProvidingIndividuallyRequestedVoluntaryClaims.providingIndividuallyRequestedVoluntaryClaims:115 expected object to not be null
  SupportClaimsRequestSpecifyingSubValue.supportClaimsRequestSpecifyingSubValueSucceed:153 expected object to not be null
  SupportsCombiningClaimsRequestedWithScopeAndRequestObject.supportsCombiningClaimsRequestedWithScopeAndRequestObject:130 expected object to not be null
  SupportsReturningClaimsInIdToken.supportsReturningClaimsInIdToken:114 expected object to not be null
  SupportsReturningDifferentClaimsInIdTokenAndUserInfoEndpoint.supportsReturningDifferentClaimsInIdTokenAndUserInfoEndpoint:116 expected object to not be null
  MultivaluedClaims.authorizationRequestObjectWithMultivaluedClaimAlgA128KWEncA128GCM:2446->BaseTest.authenticateResourceOwnerAndGrantAccess:253->BaseTest.authenticateResourceOwnerAndGrantAccess:262->BaseTest.authenticateResourceOwnerAndGrantAccess:272->BaseTest.authenticateResourceOwnerAndGrantAccess:283->BaseTest.processAuthentication:341 » NoSuchElement
  MultivaluedClaims.authorizationRequestObjectWithMultivaluedClaimAlgA256KWEncA256GCM:2544->BaseTest.authenticateResourceOwnerAndGrantAccess:253->BaseTest.authenticateResourceOwnerAndGrantAccess:262->BaseTest.authenticateResourceOwnerAndGrantAccess:272->BaseTest.authenticateResourceOwnerAndGrantAccess:283->BaseTest.processAuthentication:341 » NoSuchElement
  MultivaluedClaims.authorizationRequestObjectWithMultivaluedClaimAlgRSA15EncA128CBCPLUSHS256:2678 expected [true] but found [false]
  MultivaluedClaims.authorizationRequestObjectWithMultivaluedClaimAlgRSA15EncA256CBCPLUSHS512:2788 expected [true] but found [false]
  MultivaluedClaims.authorizationRequestObjectWithMultivaluedClaimAlgRSAOAEPEncA256GCM:2898 expected [true] but found [false]
  MultivaluedClaims.authorizationRequestObjectWithMultivaluedClaimES256:2159 expected [true] but found [false]
  MultivaluedClaims.authorizationRequestObjectWithMultivaluedClaimES384:2262 expected [true] but found [false]
  MultivaluedClaims.authorizationRequestObjectWithMultivaluedClaimES512:2365 expected [true] but found [false]
  MultivaluedClaims.authorizationRequestObjectWithMultivaluedClaimHS256:1557 expected [true] but found [false]
  MultivaluedClaims.authorizationRequestObjectWithMultivaluedClaimHS384:1654 expected [true] but found [false]
  MultivaluedClaims.authorizationRequestObjectWithMultivaluedClaimHS512:1751 expected [true] but found [false]
  MultivaluedClaims.authorizationRequestObjectWithMultivaluedClaimNone:1461 expected [true] but found [false]
  MultivaluedClaims.authorizationRequestObjectWithMultivaluedClaimRS256:1850 expected [true] but found [false]
  MultivaluedClaims.authorizationRequestObjectWithMultivaluedClaimRS384:1953 expected [true] but found [false]
  MultivaluedClaims.authorizationRequestObjectWithMultivaluedClaimRS512:2056 expected [true] but found [false]
  MultivaluedClaims.authorizationRequestWithMultivaluedClaimAlgA128KWEncA128GCM:996 » InvalidJwe
  MultivaluedClaims.authorizationRequestWithMultivaluedClaimAlgA256KWEncA256GCM:1082 » InvalidJwe
  OpenIDRequestObjectHttpTest.requestParameterMethod6:440 expected object to not be null
  OpenIDRequestObjectHttpTest.requestParameterMethodAlgA128KWEncA128GCM:2508 The accessToken is null expected object to not be null
  OpenIDRequestObjectHttpTest.requestParameterMethodAlgA256KWEncA256GCM:2596 The accessToken is null expected object to not be null
  TokenEncryptionHttpTest.requestIdTokenAlgA128KWEncA128GCM:338 org.bouncycastle.crypto.InvalidCipherTextException: checksum failed
  TokenEncryptionHttpTest.requestIdTokenAlgA256KWEncA256GCM:410 org.bouncycastle.crypto.InvalidCipherTextException: checksum failed
  UserInfoRestWebServiceHttpTest.requestUserInfoAdditionalClaims:464 Unexpected result: iname not found expected object to not be null
  UserInfoRestWebServiceHttpTest.requestUserInfoAlgA128KWEncA128GCM:1354 expected object to not be null
  UserInfoRestWebServiceHttpTest.requestUserInfoAlgA256KWEncA256GCM:1412 expected object to not be null

Tests run: 660, Failures: 37, Errors: 0, Skipped: 0

[INFO] ------------------------------------------------------------------------
[INFO] Reactor Summary:
[INFO] 
[INFO] oxAuth ............................................. SUCCESS [  2.727 s]
[INFO] oxAuth Model ....................................... SUCCESS [ 33.821 s]
[INFO] oxAuth Client ...................................... FAILURE [12:15 min]
[INFO] oxauth-static ...................................... SKIPPED
[INFO] oxAuth RP .......................................... SKIPPED
[INFO] oxAuth RP Demo ..................................... SKIPPED
[INFO] oxAuth Server ...................................... SKIPPED
[INFO] ------------------------------------------------------------------------
[INFO] BUILD FAILURE
[INFO] ------------------------------------------------------------------------
[INFO] Total time: 12:53 min
[INFO] Finished at: 2018-07-05T14:38:20-04:00
[INFO] Final Memory: 69M/446M
[INFO] ------------------------------------------------------------------------
[ERROR] Failed to execute goal org.apache.maven.plugins:maven-surefire-plugin:2.19.1:test (default-test) on project oxauth-client: There are test failures.
[ERROR] 
[ERROR] Please refer to /home/tomcat/.jenkins/jobs/oxAuth/workspace/Client/target/surefire-reports for the individual test results.
[ERROR] -> [Help 1]
[ERROR] 
[ERROR] To see the full stack trace of the errors, re-run Maven with the -e switch.
[ERROR] Re-run Maven using the -X switch to enable full debug logging.
[ERROR] 
[ERROR] For more information about the errors and possible solutions, please read the following articles:
[ERROR] [Help 1] http://cwiki.apache.org/confluence/display/MAVEN/MojoFailureException
[ERROR] 
[ERROR] After correcting the problems, you can resume the build with the command
[ERROR]   mvn <goals> -rf :oxauth-client
Build step 'Invoke top-level Maven targets' marked build as failure
[FINDBUGS] Skipping publisher since build result is FAILURE
Publishing Javadoc
TestNG Reports Processing: START
Looking for TestNG results report in workspace using pattern: **/testng-results.xml
Saving reports...
Processing '/home/tomcat/.jenkins/jobs/oxAuth/builds/3305/testng/testng-results-1.xml'
Processing '/home/tomcat/.jenkins/jobs/oxAuth/builds/3305/testng/testng-results.xml'
5.547226% of tests failed, which exceeded threshold of 0%. Marking build as UNSTABLE
TestNG Reports Processing: FINISH
Sending e-mails to: support@gluu.org yuriy@gluu.org
Finished: FAILURE