FailedConsole Output

Skipping 5,204 KB.. Full Log
ome.htm",
        "https://client.example.com/cb",
        "https://client.example.com/cb1",
        "https://client.example.com/cb2"
    ],
    "response_types": ["id_token"],
    "application_type": "web",
    "client_name": "oxAuth test app",
    "sector_identifier_uri": "https://ce-dev4.gluu.org/oxauth/sectoridentifier/@!38D4.410C.1D43.8932!0001!37F2.B744!0012!D426.70FD",
    "id_token_signed_response_alg": "ES384"
}

-------------------------------------------------------
RESPONSE:
-------------------------------------------------------
HTTP/1.1 200
Cache-Control: no-store
Connection: Keep-Alive
Content-Length: 1340
Content-Type: application/json
Date: Wed, 04 Jul 2018 18:42:08 GMT
Keep-Alive: timeout=5, max=100
Pragma: no-cache
Server: Jetty(9.4.9.v20180320)
Strict-Transport-Security: max-age=31536000; includeSubDomains
X-Content-Type-Options: nosniff
X-Xss-Protection: 1; mode=block

{
    "client_id": "@!38D4.410C.1D43.8932!0001!37F2.B744!0008!DAE7.AD2F.0DA3.9471",
    "client_secret": "97780f38-34fa-4d4d-aaac-dcfe30816023",
    "registration_access_token": "c51f3cc6-caaa-4516-99a1-e22a00474f21",
    "registration_client_uri": "https://ce-dev4.gluu.org/oxauth/restv1/register?client_id=@!38D4.410C.1D43.8932!0001!37F2.B744!0008!DAE7.AD2F.0DA3.9471",
    "client_id_issued_at": 1530729728,
    "client_secret_expires_at": 1530816128,
    "redirect_uris": [
        "https://client.example.com/cb2",
        "https://client.example.com/cb1",
        "https://client.example.com/cb",
        "https://ce-dev4.gluu.org/oxauth-rp/home.htm"
    ],
    "response_types": [
        "id_token",
        "token"
    ],
    "grant_types": ["implicit"],
    "application_type": "web",
    "client_name": "oxAuth test app",
    "sector_identifier_uri": "https://ce-dev4.gluu.org/oxauth/sectoridentifier/@!38D4.410C.1D43.8932!0001!37F2.B744!0012!D426.70FD",
    "subject_type": "pairwise",
    "id_token_signed_response_alg": "ES384",
    "token_endpoint_auth_method": "client_secret_basic",
    "require_auth_time": false,
    "frontchannel_logout_session_required": false,
    "scope": "permission uma_protection clientinfo email user_name sub org_name address openid test_scope1 work_phone phone profile test",
    "claims": ""
}

authenticateResourceOwnerAndGrantAccess: Cleaning cookies
authenticateResourceOwnerAndGrantAccess: authorizationRequestUrl:https://ce-dev4.gluu.org/oxauth/restv1/authorize?response_type=id_token&client_id=%40%2138D4.410C.1D43.8932%210001%2137F2.B744%210008%21DAE7.AD2F.0DA3.9471&scope=openid+profile+address+email&redirect_uri=https%3A%2F%2Fce-dev4.gluu.org%2Foxauth-rp%2Fhome.htm&state=2d4b0b52-faa6-429a-a0c7-e98cf20f1b8d&nonce=d78ac9fc-2902-437d-851f-9ab4346f4e9d
14:42:28.565 [main] ERROR com.gargoylesoftware.htmlunit.javascript.StrictErrorReporter - runtimeError: message=[An invalid or illegal selector was specified (selector: '*,:x' error: Invalid selector: :x).] sourceName=[https://ce-dev4.gluu.org/oxauth/js/jquery-1.12.4.min.js] line=[2] lineSource=[null] lineOffset=[0]
authenticateResourceOwnerAndGrantAccess: sessionState:8666dc6f-4aa2-4618-8046-b4e03a602af7
-------------------------------------------------------
REQUEST:
-------------------------------------------------------
https://ce-dev4.gluu.org/oxauth/restv1/authorize?response_type=id_token&client_id=%40%2138D4.410C.1D43.8932%210001%2137F2.B744%210008%21DAE7.AD2F.0DA3.9471&scope=openid+profile+address+email&redirect_uri=https%3A%2F%2Fce-dev4.gluu.org%2Foxauth-rp%2Fhome.htm&state=2d4b0b52-faa6-429a-a0c7-e98cf20f1b8d&nonce=d78ac9fc-2902-437d-851f-9ab4346f4e9d

-------------------------------------------------------
RESPONSE:
-------------------------------------------------------
HTTP/1.1 302 Found
Location: https://ce-dev4.gluu.org/oxauth-rp/home.htm#scope=address+openid+profile+email&id_token=eyJraWQiOiJlODJjOTVmMi0xYzk5LTQ3YzItYjZhMC05NWQ2ZWQwYTIyMjgiLCJ0eXAiOiJKV1QiLCJhbGciOiJFUzM4NCJ9.eyJpc3MiOiJodHRwczovL2NlLWRldjQuZ2x1dS5vcmciLCJhdWQiOiJAITM4RDQuNDEwQy4xRDQzLjg5MzIhMDAwMSEzN0YyLkI3NDQhMDAwOCFEQUU3LkFEMkYuMERBMy45NDcxIiwiZXhwIjoxNTMwNzMzMzI5LCJpYXQiOjE1MzA3Mjk3MjksIm5vbmNlIjoiZDc4YWM5ZmMtMjkwMi00MzdkLTg1MWYtOWFiNDM0NmY0ZTlkIiwiYXV0aF90aW1lIjoxNTMwNzI5NzI5LCJveE9wZW5JRENvbm5lY3RWZXJzaW9uIjoib3BlbmlkY29ubmVjdC0xLjAiLCJzdWIiOiJJNlplNnJ4S3JZbWFFWEFsQ2k2OXUyamNWb0RVQ1JrNHFKRFN2SGdVRVdRIn0.MGUCMQCRLR-4Nzq-zk44r4B57lmYuQDjqYZjJeTuuF2phf80C3gb0XdjcJitA-t3HjrFD7wCMDdi5q_0FUMMQMlSkpcuU9Empb4q2sjLNSv09mkVZvEOVIsU7mLgiT0HMnRBAYmUpg&session_id=2d99af0d-8c17-4c57-8f5b-a545299af119&state=2d4b0b52-faa6-429a-a0c7-e98cf20f1b8d&session_state=8666dc6f-4aa2-4618-8046-b4e03a602af7

#######################################################
TEST: OC5:FeatureTest-Uses Asymmetric ID Token Signatures ES512
#######################################################
-------------------------------------------------------
REQUEST:
-------------------------------------------------------
POST /oxauth/restv1/register HTTP/1.1
Content-Type: application/json
Accept: application/json
Host: ce-dev4.gluu.org

{
    "redirect_uris": [
        "https://ce-dev4.gluu.org/oxauth-rp/home.htm",
        "https://client.example.com/cb",
        "https://client.example.com/cb1",
        "https://client.example.com/cb2"
    ],
    "response_types": ["id_token"],
    "application_type": "web",
    "client_name": "oxAuth test app",
    "sector_identifier_uri": "https://ce-dev4.gluu.org/oxauth/sectoridentifier/@!38D4.410C.1D43.8932!0001!37F2.B744!0012!D426.70FD",
    "id_token_signed_response_alg": "ES512"
}

-------------------------------------------------------
RESPONSE:
-------------------------------------------------------
HTTP/1.1 200
Cache-Control: no-store
Connection: Keep-Alive
Content-Length: 1340
Content-Type: application/json
Date: Wed, 04 Jul 2018 18:42:09 GMT
Keep-Alive: timeout=5, max=100
Pragma: no-cache
Server: Jetty(9.4.9.v20180320)
Strict-Transport-Security: max-age=31536000; includeSubDomains
X-Content-Type-Options: nosniff
X-Xss-Protection: 1; mode=block

{
    "client_id": "@!38D4.410C.1D43.8932!0001!37F2.B744!0008!90D6.0675.7353.6B4B",
    "client_secret": "468a5c86-fdb7-4fde-8a9e-1fa902a121fe",
    "registration_access_token": "1dfddbb3-6eb5-49a2-a321-deba8e145376",
    "registration_client_uri": "https://ce-dev4.gluu.org/oxauth/restv1/register?client_id=@!38D4.410C.1D43.8932!0001!37F2.B744!0008!90D6.0675.7353.6B4B",
    "client_id_issued_at": 1530729729,
    "client_secret_expires_at": 1530816129,
    "redirect_uris": [
        "https://client.example.com/cb2",
        "https://client.example.com/cb1",
        "https://client.example.com/cb",
        "https://ce-dev4.gluu.org/oxauth-rp/home.htm"
    ],
    "response_types": [
        "id_token",
        "token"
    ],
    "grant_types": ["implicit"],
    "application_type": "web",
    "client_name": "oxAuth test app",
    "sector_identifier_uri": "https://ce-dev4.gluu.org/oxauth/sectoridentifier/@!38D4.410C.1D43.8932!0001!37F2.B744!0012!D426.70FD",
    "subject_type": "pairwise",
    "id_token_signed_response_alg": "ES512",
    "token_endpoint_auth_method": "client_secret_basic",
    "require_auth_time": false,
    "frontchannel_logout_session_required": false,
    "scope": "permission uma_protection clientinfo email user_name sub org_name address openid test_scope1 work_phone phone profile test",
    "claims": ""
}

authenticateResourceOwnerAndGrantAccess: Cleaning cookies
authenticateResourceOwnerAndGrantAccess: authorizationRequestUrl:https://ce-dev4.gluu.org/oxauth/restv1/authorize?response_type=id_token&client_id=%40%2138D4.410C.1D43.8932%210001%2137F2.B744%210008%2190D6.0675.7353.6B4B&scope=openid+profile+address+email&redirect_uri=https%3A%2F%2Fce-dev4.gluu.org%2Foxauth-rp%2Fhome.htm&state=6da55a7b-3e37-4c74-afd2-5ad7f1a41e4c&nonce=2a45ee21-ea03-47ba-910a-562c779f4d18
14:42:29.701 [main] ERROR com.gargoylesoftware.htmlunit.javascript.StrictErrorReporter - runtimeError: message=[An invalid or illegal selector was specified (selector: '*,:x' error: Invalid selector: :x).] sourceName=[https://ce-dev4.gluu.org/oxauth/js/jquery-1.12.4.min.js] line=[2] lineSource=[null] lineOffset=[0]
authenticateResourceOwnerAndGrantAccess: sessionState:dfdfda2f-0294-4b8d-a41a-1d17f53ab81c
-------------------------------------------------------
REQUEST:
-------------------------------------------------------
https://ce-dev4.gluu.org/oxauth/restv1/authorize?response_type=id_token&client_id=%40%2138D4.410C.1D43.8932%210001%2137F2.B744%210008%2190D6.0675.7353.6B4B&scope=openid+profile+address+email&redirect_uri=https%3A%2F%2Fce-dev4.gluu.org%2Foxauth-rp%2Fhome.htm&state=6da55a7b-3e37-4c74-afd2-5ad7f1a41e4c&nonce=2a45ee21-ea03-47ba-910a-562c779f4d18

-------------------------------------------------------
RESPONSE:
-------------------------------------------------------
HTTP/1.1 302 Found
Location: https://ce-dev4.gluu.org/oxauth-rp/home.htm#scope=address+openid+profile+email&id_token=eyJraWQiOiJjZjI3MmY3ZS1lMjZmLTQ4ZGQtYTUwZC0wOWVmY2U0ZDUwMTQiLCJ0eXAiOiJKV1QiLCJhbGciOiJFUzUxMiJ9.eyJpc3MiOiJodHRwczovL2NlLWRldjQuZ2x1dS5vcmciLCJhdWQiOiJAITM4RDQuNDEwQy4xRDQzLjg5MzIhMDAwMSEzN0YyLkI3NDQhMDAwOCE5MEQ2LjA2NzUuNzM1My42QjRCIiwiZXhwIjoxNTMwNzMzMzMwLCJpYXQiOjE1MzA3Mjk3MzAsIm5vbmNlIjoiMmE0NWVlMjEtZWEwMy00N2JhLTkxMGEtNTYyYzc3OWY0ZDE4IiwiYXV0aF90aW1lIjoxNTMwNzI5NzMwLCJveE9wZW5JRENvbm5lY3RWZXJzaW9uIjoib3BlbmlkY29ubmVjdC0xLjAiLCJzdWIiOiJGNkF3RkFHME5OLS1Cd3JQdnJkSFY0aFR3VlVtNUVySkE2ZlJKVDM3ZXJZIn0.MIGIAkIBNnSCfa4xoOsCijuWU9kqymH8SM5MBJT3q1uIngoCjpGD7aU_w5hkufgJiuxrQp6PmKj9CHqCocc92lLzKXwDvEMCQgCTlYBOhWLMDIfyRnxf0QFwZojk27xpFSDsN1fs90mukkAcbY14GMk7xzHW61ClN6wOOUpc2WvbH5O-7FvN25AVWw&session_id=49aeb25e-32dc-4597-ac4b-bc0954467686&state=6da55a7b-3e37-4c74-afd2-5ad7f1a41e4c&session_state=dfdfda2f-0294-4b8d-a41a-1d17f53ab81c

#######################################################
TEST: OC5:FeatureTest-Uses Asymmetric ID Token Signatures RS256
#######################################################
-------------------------------------------------------
REQUEST:
-------------------------------------------------------
POST /oxauth/restv1/register HTTP/1.1
Content-Type: application/json
Accept: application/json
Host: ce-dev4.gluu.org

{
    "redirect_uris": [
        "https://ce-dev4.gluu.org/oxauth-rp/home.htm",
        "https://client.example.com/cb",
        "https://client.example.com/cb1",
        "https://client.example.com/cb2"
    ],
    "response_types": ["id_token"],
    "application_type": "web",
    "client_name": "oxAuth test app",
    "sector_identifier_uri": "https://ce-dev4.gluu.org/oxauth/sectoridentifier/@!38D4.410C.1D43.8932!0001!37F2.B744!0012!D426.70FD",
    "id_token_signed_response_alg": "RS256"
}

-------------------------------------------------------
RESPONSE:
-------------------------------------------------------
HTTP/1.1 200
Cache-Control: no-store
Connection: Keep-Alive
Content-Length: 1340
Content-Type: application/json
Date: Wed, 04 Jul 2018 18:42:10 GMT
Keep-Alive: timeout=5, max=100
Pragma: no-cache
Server: Jetty(9.4.9.v20180320)
Strict-Transport-Security: max-age=31536000; includeSubDomains
X-Content-Type-Options: nosniff
X-Xss-Protection: 1; mode=block

{
    "client_id": "@!38D4.410C.1D43.8932!0001!37F2.B744!0008!3E02.A8A9.358F.62BE",
    "client_secret": "95307a41-34c1-429b-87fe-ff84fcc3bad0",
    "registration_access_token": "17c0325f-9a9e-4202-9b73-f48753ba0590",
    "registration_client_uri": "https://ce-dev4.gluu.org/oxauth/restv1/register?client_id=@!38D4.410C.1D43.8932!0001!37F2.B744!0008!3E02.A8A9.358F.62BE",
    "client_id_issued_at": 1530729730,
    "client_secret_expires_at": 1530816130,
    "redirect_uris": [
        "https://client.example.com/cb2",
        "https://client.example.com/cb1",
        "https://client.example.com/cb",
        "https://ce-dev4.gluu.org/oxauth-rp/home.htm"
    ],
    "response_types": [
        "id_token",
        "token"
    ],
    "grant_types": ["implicit"],
    "application_type": "web",
    "client_name": "oxAuth test app",
    "sector_identifier_uri": "https://ce-dev4.gluu.org/oxauth/sectoridentifier/@!38D4.410C.1D43.8932!0001!37F2.B744!0012!D426.70FD",
    "subject_type": "pairwise",
    "id_token_signed_response_alg": "RS256",
    "token_endpoint_auth_method": "client_secret_basic",
    "require_auth_time": false,
    "frontchannel_logout_session_required": false,
    "scope": "permission uma_protection clientinfo email user_name sub org_name address openid test_scope1 work_phone phone profile test",
    "claims": ""
}

authenticateResourceOwnerAndGrantAccess: Cleaning cookies
authenticateResourceOwnerAndGrantAccess: authorizationRequestUrl:https://ce-dev4.gluu.org/oxauth/restv1/authorize?response_type=id_token&client_id=%40%2138D4.410C.1D43.8932%210001%2137F2.B744%210008%213E02.A8A9.358F.62BE&scope=openid+profile+address+email&redirect_uri=https%3A%2F%2Fce-dev4.gluu.org%2Foxauth-rp%2Fhome.htm&state=aa255d34-a194-4084-8f10-640f0d3d6a99&nonce=87ea7f85-aa66-4905-af4f-a78c69b261f6
14:42:30.900 [main] ERROR com.gargoylesoftware.htmlunit.javascript.StrictErrorReporter - runtimeError: message=[An invalid or illegal selector was specified (selector: '*,:x' error: Invalid selector: :x).] sourceName=[https://ce-dev4.gluu.org/oxauth/js/jquery-1.12.4.min.js] line=[2] lineSource=[null] lineOffset=[0]
authenticateResourceOwnerAndGrantAccess: sessionState:3bd07195-6844-48a1-bbd4-e6fdc7c6dfc3
-------------------------------------------------------
REQUEST:
-------------------------------------------------------
https://ce-dev4.gluu.org/oxauth/restv1/authorize?response_type=id_token&client_id=%40%2138D4.410C.1D43.8932%210001%2137F2.B744%210008%213E02.A8A9.358F.62BE&scope=openid+profile+address+email&redirect_uri=https%3A%2F%2Fce-dev4.gluu.org%2Foxauth-rp%2Fhome.htm&state=aa255d34-a194-4084-8f10-640f0d3d6a99&nonce=87ea7f85-aa66-4905-af4f-a78c69b261f6

-------------------------------------------------------
RESPONSE:
-------------------------------------------------------
HTTP/1.1 302 Found
Location: https://ce-dev4.gluu.org/oxauth-rp/home.htm#scope=address+openid+profile+email&id_token=eyJraWQiOiI4NzE2OGJjMS1lNTU4LTQxNjktOGRkMS05ZmJkNDUxZGU1ZDciLCJ0eXAiOiJKV1QiLCJhbGciOiJSUzI1NiJ9.eyJpc3MiOiJodHRwczovL2NlLWRldjQuZ2x1dS5vcmciLCJhdWQiOiJAITM4RDQuNDEwQy4xRDQzLjg5MzIhMDAwMSEzN0YyLkI3NDQhMDAwOCEzRTAyLkE4QTkuMzU4Ri42MkJFIiwiZXhwIjoxNTMwNzMzMzMxLCJpYXQiOjE1MzA3Mjk3MzEsIm5vbmNlIjoiODdlYTdmODUtYWE2Ni00OTA1LWFmNGYtYTc4YzY5YjI2MWY2IiwiYXV0aF90aW1lIjoxNTMwNzI5NzMxLCJveE9wZW5JRENvbm5lY3RWZXJzaW9uIjoib3BlbmlkY29ubmVjdC0xLjAiLCJzdWIiOiJnV25CelkzeWMwVGlTOVNxeHhUQ3NqbkYzUl9tUVM5QTlPbzJyZVQtc2N3In0.XxHNyRapvGhP9E1y0aB5Ha8omMgsxBvDrvn12q3HCPLty507mSQ-skGrJw38s4g5WmfUFfkcBHin1-wXC5gmFYOHSuV5h9kSZ3DR71fSSxpWQK34NFrSLmP1GMTrPoa6lKJJ4XzgP5DcJowRbE_mLDcaOCcdNRYK4neIHq10ZmwZDkCUcKYYJD_U0jsCwgrSMGonZvB_xxfTcT6v7Z5T6q16LZT2vJ53a71zGH_xhq2UaEt2WhljGKjBXhKTYP5Lcdz2Zd6tAG-ybANwIlqTng4haaeUCkjYXZBV0LSU65sgEZblC-ngMKcfyXYU1o7ar2qOmMhZJmrbDRIf_5skOg&session_id=e151fc0b-0dae-422b-8302-0be766d1cc1a&state=aa255d34-a194-4084-8f10-640f0d3d6a99&session_state=3bd07195-6844-48a1-bbd4-e6fdc7c6dfc3

#######################################################
TEST: OC5:FeatureTest-Uses Asymmetric ID Token Signatures RS384
#######################################################
-------------------------------------------------------
REQUEST:
-------------------------------------------------------
POST /oxauth/restv1/register HTTP/1.1
Content-Type: application/json
Accept: application/json
Host: ce-dev4.gluu.org

{
    "redirect_uris": [
        "https://ce-dev4.gluu.org/oxauth-rp/home.htm",
        "https://client.example.com/cb",
        "https://client.example.com/cb1",
        "https://client.example.com/cb2"
    ],
    "response_types": ["id_token"],
    "application_type": "web",
    "client_name": "oxAuth test app",
    "sector_identifier_uri": "https://ce-dev4.gluu.org/oxauth/sectoridentifier/@!38D4.410C.1D43.8932!0001!37F2.B744!0012!D426.70FD",
    "id_token_signed_response_alg": "RS384"
}

-------------------------------------------------------
RESPONSE:
-------------------------------------------------------
HTTP/1.1 200
Cache-Control: no-store
Connection: Keep-Alive
Content-Length: 1340
Content-Type: application/json
Date: Wed, 04 Jul 2018 18:42:11 GMT
Keep-Alive: timeout=5, max=100
Pragma: no-cache
Server: Jetty(9.4.9.v20180320)
Strict-Transport-Security: max-age=31536000; includeSubDomains
X-Content-Type-Options: nosniff
X-Xss-Protection: 1; mode=block

{
    "client_id": "@!38D4.410C.1D43.8932!0001!37F2.B744!0008!5CD5.041C.C931.65D4",
    "client_secret": "cae54f8e-f48f-47ee-ae2f-55e0f3b68de0",
    "registration_access_token": "a08f90d0-8945-473f-94db-a9e18d90f9fc",
    "registration_client_uri": "https://ce-dev4.gluu.org/oxauth/restv1/register?client_id=@!38D4.410C.1D43.8932!0001!37F2.B744!0008!5CD5.041C.C931.65D4",
    "client_id_issued_at": 1530729732,
    "client_secret_expires_at": 1530816132,
    "redirect_uris": [
        "https://client.example.com/cb2",
        "https://client.example.com/cb1",
        "https://client.example.com/cb",
        "https://ce-dev4.gluu.org/oxauth-rp/home.htm"
    ],
    "response_types": [
        "id_token",
        "token"
    ],
    "grant_types": ["implicit"],
    "application_type": "web",
    "client_name": "oxAuth test app",
    "sector_identifier_uri": "https://ce-dev4.gluu.org/oxauth/sectoridentifier/@!38D4.410C.1D43.8932!0001!37F2.B744!0012!D426.70FD",
    "subject_type": "pairwise",
    "id_token_signed_response_alg": "RS384",
    "token_endpoint_auth_method": "client_secret_basic",
    "require_auth_time": false,
    "frontchannel_logout_session_required": false,
    "scope": "permission uma_protection clientinfo email user_name sub org_name address openid test_scope1 work_phone phone profile test",
    "claims": ""
}

authenticateResourceOwnerAndGrantAccess: Cleaning cookies
authenticateResourceOwnerAndGrantAccess: authorizationRequestUrl:https://ce-dev4.gluu.org/oxauth/restv1/authorize?response_type=id_token&client_id=%40%2138D4.410C.1D43.8932%210001%2137F2.B744%210008%215CD5.041C.C931.65D4&scope=openid+profile+address+email&redirect_uri=https%3A%2F%2Fce-dev4.gluu.org%2Foxauth-rp%2Fhome.htm&state=79dd6730-671e-4a83-881c-f352c38cd488&nonce=505bed8c-1535-480a-8ad6-814b3e701010
14:42:32.056 [main] ERROR com.gargoylesoftware.htmlunit.javascript.StrictErrorReporter - runtimeError: message=[An invalid or illegal selector was specified (selector: '*,:x' error: Invalid selector: :x).] sourceName=[https://ce-dev4.gluu.org/oxauth/js/jquery-1.12.4.min.js] line=[2] lineSource=[null] lineOffset=[0]
authenticateResourceOwnerAndGrantAccess: sessionState:888d06a8-ab0a-4cb7-bf82-fb5e1674fef8
-------------------------------------------------------
REQUEST:
-------------------------------------------------------
https://ce-dev4.gluu.org/oxauth/restv1/authorize?response_type=id_token&client_id=%40%2138D4.410C.1D43.8932%210001%2137F2.B744%210008%215CD5.041C.C931.65D4&scope=openid+profile+address+email&redirect_uri=https%3A%2F%2Fce-dev4.gluu.org%2Foxauth-rp%2Fhome.htm&state=79dd6730-671e-4a83-881c-f352c38cd488&nonce=505bed8c-1535-480a-8ad6-814b3e701010

-------------------------------------------------------
RESPONSE:
-------------------------------------------------------
HTTP/1.1 302 Found
Location: https://ce-dev4.gluu.org/oxauth-rp/home.htm#scope=address+openid+profile+email&id_token=eyJraWQiOiJiNGM2NmNhMi02ZDg3LTRjMjItYTk1Yy04ODlkMjM2MjBmNTQiLCJ0eXAiOiJKV1QiLCJhbGciOiJSUzM4NCJ9.eyJpc3MiOiJodHRwczovL2NlLWRldjQuZ2x1dS5vcmciLCJhdWQiOiJAITM4RDQuNDEwQy4xRDQzLjg5MzIhMDAwMSEzN0YyLkI3NDQhMDAwOCE1Q0Q1LjA0MUMuQzkzMS42NUQ0IiwiZXhwIjoxNTMwNzMzMzMyLCJpYXQiOjE1MzA3Mjk3MzIsIm5vbmNlIjoiNTA1YmVkOGMtMTUzNS00ODBhLThhZDYtODE0YjNlNzAxMDEwIiwiYXV0aF90aW1lIjoxNTMwNzI5NzMyLCJveE9wZW5JRENvbm5lY3RWZXJzaW9uIjoib3BlbmlkY29ubmVjdC0xLjAiLCJzdWIiOiIzZlVDakRsZnhyMzM4VXNJU3lwVHFkQlhWdWhDWldPeUVnNGZTX2ZyaGhJIn0.LIJZjgUEH9OKyZzoYgLrfq23NNLmAG17IQRdWkalX9SduYCEy-hqFO4N_NqCyU8ckWszTIA6zaDXFGyYdBVfOPwKjN2X75dhAuNMXUyKB8sD9ryyQlndTD9z3Z3anylp314EDNEn9uoQhKIcrWmlbe8v9nm_gu3l1NUsD9ncohApaCIq8t-ufmWNSGWGSW3ClszG0zZnJA5MNZ7eLNxFkR1ImDFR7dJIe2Ox3gBnfJw92LKCgnXbTihAZfbmvUm_UQgaje_3PD_Vq40VuSv4qMjw2OjxRwGlSBAmxkbTx54Tm1Fg7sFyEU9iNJmz0AX8cvl_vme_EK95x5iK8qmq9A&session_id=6a21c812-d2a4-40ad-a4ac-4d682b948c7e&state=79dd6730-671e-4a83-881c-f352c38cd488&session_state=888d06a8-ab0a-4cb7-bf82-fb5e1674fef8

#######################################################
TEST: OC5:FeatureTest-Uses Asymmetric ID Token Signatures RS512
#######################################################
-------------------------------------------------------
REQUEST:
-------------------------------------------------------
POST /oxauth/restv1/register HTTP/1.1
Content-Type: application/json
Accept: application/json
Host: ce-dev4.gluu.org

{
    "redirect_uris": [
        "https://ce-dev4.gluu.org/oxauth-rp/home.htm",
        "https://client.example.com/cb",
        "https://client.example.com/cb1",
        "https://client.example.com/cb2"
    ],
    "response_types": ["id_token"],
    "application_type": "web",
    "client_name": "oxAuth test app",
    "sector_identifier_uri": "https://ce-dev4.gluu.org/oxauth/sectoridentifier/@!38D4.410C.1D43.8932!0001!37F2.B744!0012!D426.70FD",
    "id_token_signed_response_alg": "RS512"
}

-------------------------------------------------------
RESPONSE:
-------------------------------------------------------
HTTP/1.1 200
Cache-Control: no-store
Connection: Keep-Alive
Content-Length: 1340
Content-Type: application/json
Date: Wed, 04 Jul 2018 18:42:13 GMT
Keep-Alive: timeout=5, max=100
Pragma: no-cache
Server: Jetty(9.4.9.v20180320)
Strict-Transport-Security: max-age=31536000; includeSubDomains
X-Content-Type-Options: nosniff
X-Xss-Protection: 1; mode=block

{
    "client_id": "@!38D4.410C.1D43.8932!0001!37F2.B744!0008!E8CB.3D2D.6685.8F32",
    "client_secret": "46b2ceb9-2cec-4c08-aece-28ab0f01a357",
    "registration_access_token": "b1a90f04-d0fb-4ad0-b6a2-f72a93c85f33",
    "registration_client_uri": "https://ce-dev4.gluu.org/oxauth/restv1/register?client_id=@!38D4.410C.1D43.8932!0001!37F2.B744!0008!E8CB.3D2D.6685.8F32",
    "client_id_issued_at": 1530729733,
    "client_secret_expires_at": 1530816133,
    "redirect_uris": [
        "https://client.example.com/cb2",
        "https://client.example.com/cb1",
        "https://client.example.com/cb",
        "https://ce-dev4.gluu.org/oxauth-rp/home.htm"
    ],
    "response_types": [
        "id_token",
        "token"
    ],
    "grant_types": ["implicit"],
    "application_type": "web",
    "client_name": "oxAuth test app",
    "sector_identifier_uri": "https://ce-dev4.gluu.org/oxauth/sectoridentifier/@!38D4.410C.1D43.8932!0001!37F2.B744!0012!D426.70FD",
    "subject_type": "pairwise",
    "id_token_signed_response_alg": "RS512",
    "token_endpoint_auth_method": "client_secret_basic",
    "require_auth_time": false,
    "frontchannel_logout_session_required": false,
    "scope": "permission uma_protection clientinfo email user_name sub org_name address openid test_scope1 work_phone phone profile test",
    "claims": ""
}

authenticateResourceOwnerAndGrantAccess: Cleaning cookies
authenticateResourceOwnerAndGrantAccess: authorizationRequestUrl:https://ce-dev4.gluu.org/oxauth/restv1/authorize?response_type=id_token&client_id=%40%2138D4.410C.1D43.8932%210001%2137F2.B744%210008%21E8CB.3D2D.6685.8F32&scope=openid+profile+address+email&redirect_uri=https%3A%2F%2Fce-dev4.gluu.org%2Foxauth-rp%2Fhome.htm&state=591a75a1-1517-4160-bf04-0f601502dd8d&nonce=5e69568c-02f4-443b-8f69-1d67e6eeab29
14:42:33.196 [main] ERROR com.gargoylesoftware.htmlunit.javascript.StrictErrorReporter - runtimeError: message=[An invalid or illegal selector was specified (selector: '*,:x' error: Invalid selector: :x).] sourceName=[https://ce-dev4.gluu.org/oxauth/js/jquery-1.12.4.min.js] line=[2] lineSource=[null] lineOffset=[0]
authenticateResourceOwnerAndGrantAccess: sessionState:3bfa62b5-cbcf-41dc-9609-9687300f7087
-------------------------------------------------------
REQUEST:
-------------------------------------------------------
https://ce-dev4.gluu.org/oxauth/restv1/authorize?response_type=id_token&client_id=%40%2138D4.410C.1D43.8932%210001%2137F2.B744%210008%21E8CB.3D2D.6685.8F32&scope=openid+profile+address+email&redirect_uri=https%3A%2F%2Fce-dev4.gluu.org%2Foxauth-rp%2Fhome.htm&state=591a75a1-1517-4160-bf04-0f601502dd8d&nonce=5e69568c-02f4-443b-8f69-1d67e6eeab29

-------------------------------------------------------
RESPONSE:
-------------------------------------------------------
HTTP/1.1 302 Found
Location: https://ce-dev4.gluu.org/oxauth-rp/home.htm#scope=address+openid+profile+email&id_token=eyJraWQiOiI5Njg5MjgzZC03NzgxLTQ1MDgtOGZmNS00ZGU2OGQ1Y2U0MjMiLCJ0eXAiOiJKV1QiLCJhbGciOiJSUzUxMiJ9.eyJpc3MiOiJodHRwczovL2NlLWRldjQuZ2x1dS5vcmciLCJhdWQiOiJAITM4RDQuNDEwQy4xRDQzLjg5MzIhMDAwMSEzN0YyLkI3NDQhMDAwOCFFOENCLjNEMkQuNjY4NS44RjMyIiwiZXhwIjoxNTMwNzMzMzM0LCJpYXQiOjE1MzA3Mjk3MzQsIm5vbmNlIjoiNWU2OTU2OGMtMDJmNC00NDNiLThmNjktMWQ2N2U2ZWVhYjI5IiwiYXV0aF90aW1lIjoxNTMwNzI5NzMzLCJveE9wZW5JRENvbm5lY3RWZXJzaW9uIjoib3BlbmlkY29ubmVjdC0xLjAiLCJzdWIiOiJwZk9LLUowYmh0a2tZVnc2WldfR19icHd4S1VtNFUxdVJJdFV5eDhLZDdFIn0.Iec-87FzHnGtft-9JwSUh53tka5kWe0ILWUeeufkxfkfXmOqM2P3qTa1UFvoSHoG5gKgJtiaDsgPIHdtFoKQnzmv9XHx0klWUNw8kXKzRhhBB597PGgkY0x3EG4QdxxLFpRTyVARewfZPrOed5JTW0UCTttXCaaKmOAP3yxmuJ10geObWCyDpwsxHoqd0AonIZQqn1nYXgACmIc2QHVAZZ3K-g66x6o_YaHRskHudOP1zYOaNcebsKguDKGZzPb1XzMcI0o7p5uiWVFxvBT3vDr-GESWMv8vRGa6bIB5ApNpjKjAgxXgjswPG96mp_fX1C1nlAD-nCJ9YlHGtnsAOA&session_id=14b0a8aa-730d-4136-8857-5b30ef58aef8&state=591a75a1-1517-4160-bf04-0f601502dd8d&session_state=3bfa62b5-cbcf-41dc-9609-9687300f7087

#######################################################
TEST: OpenID Connect Discovery
#######################################################
-------------------------------------------------------
REQUEST:
-------------------------------------------------------
GET /.well-known/webfinger?resource=acct%3Atest_user%40ce-dev4.gluu.org&rel=http%3A%2F%2Fopenid.net%2Fspecs%2Fconnect%2F1.0%2Fissuer HTTP/1.1
Host: ce-dev4.gluu.org

-------------------------------------------------------
RESPONSE:
-------------------------------------------------------
HTTP/1.1 200
Connection: Keep-Alive
Content-Length: 181
Content-Type: application/jrd+json;charset=iso-8859-1
Date: Wed, 04 Jul 2018 18:42:14 GMT
Keep-Alive: timeout=5, max=100
Server: Jetty(9.4.9.v20180320)
Strict-Transport-Security: max-age=31536000; includeSubDomains
X-Content-Type-Options: nosniff
X-Xss-Protection: 1; mode=block

{
    "subject": "acct:test_user@ce-dev4.gluu.org",
    "links": [{
        "rel": "http://openid.net/specs/connect/1.0/issuer",
        "href": "https://ce-dev4.gluu.org"
    }]
}


OpenID Connect Configuration
-------------------------------------------------------
REQUEST:
-------------------------------------------------------
GET /.well-known/openid-configuration HTTP/1.1
Host: ce-dev4.gluu.org

-------------------------------------------------------
RESPONSE:
-------------------------------------------------------
HTTP/1.1 200
Connection: Keep-Alive
Content-Length: 6342
Content-Type: application/json
Date: Wed, 04 Jul 2018 18:42:14 GMT
Keep-Alive: timeout=5, max=100
Server: Jetty(9.4.9.v20180320)
Strict-Transport-Security: max-age=31536000; includeSubDomains
X-Content-Type-Options: nosniff
X-Xss-Protection: 1; mode=block

{
    "issuer": "https://ce-dev4.gluu.org",
    "authorization_endpoint": "https://ce-dev4.gluu.org/oxauth/restv1/authorize",
    "token_endpoint": "https://ce-dev4.gluu.org/oxauth/restv1/token",
    "userinfo_endpoint": "https://ce-dev4.gluu.org/oxauth/restv1/userinfo",
    "clientinfo_endpoint": "https://ce-dev4.gluu.org/oxauth/restv1/clientinfo",
    "check_session_iframe": "https://ce-dev4.gluu.org/oxauth/opiframe",
    "end_session_endpoint": "https://ce-dev4.gluu.org/oxauth/restv1/end_session",
    "jwks_uri": "https://ce-dev4.gluu.org/oxauth/restv1/jwks",
    "registration_endpoint": "https://ce-dev4.gluu.org/oxauth/restv1/register",
    "id_generation_endpoint": "https://ce-dev4.gluu.org/oxauth/restv1/id",
    "introspection_endpoint": "https://ce-dev4.gluu.org/oxauth/restv1/introspection",
    "scopes_supported": [
        "permission",
        "clientinfo",
        "email",
        "user_name",
        "sub",
        "org_name",
        "address",
        "openid",
        "test_scope1",
        "work_phone",
        "phone",
        "profile",
        "mobile_phone",
        "test"
    ],
    "response_types_supported": [
        "id_token",
        "code",
        "id_token code token",
        "id_token code",
        "code token",
        "id_token token",
        "token"
    ],
    "grant_types_supported": [
        "implicit",
        "refresh_token",
        "urn:ietf:params:oauth:grant-type:uma-ticket",
        "client_credentials",
        "authorization_code",
        "password"
    ],
    "acr_values_supported": [
        "super_gluu",
        "u2f",
        "otp",
        "basic",
        "auth_ldap_server"
    ],
    "auth_level_mapping": {
        "-1": ["auth_ldap_server"],
        "50": ["otp"],
        "100": ["basic"],
        "10": ["u2f"],
        "15": ["super_gluu"]
    },
    "subject_types_supported": [
        "public",
        "pairwise"
    ],
    "userinfo_signing_alg_values_supported": [
        "HS256",
        "HS384",
        "HS512",
        "RS256",
        "RS384",
        "RS512",
        "ES256",
        "ES384",
        "ES512"
    ],
    "userinfo_encryption_alg_values_supported": [
        "RSA1_5",
        "RSA-OAEP",
        "A128KW",
        "A256KW"
    ],
    "userinfo_encryption_enc_values_supported": [
        "RSA1_5",
        "RSA-OAEP",
        "A128KW",
        "A256KW"
    ],
    "id_token_signing_alg_values_supported": [
        "none",
        "HS256",
        "HS384",
        "HS512",
        "RS256",
        "RS384",
        "RS512",
        "ES256",
        "ES384",
        "ES512"
    ],
    "id_token_encryption_alg_values_supported": [
        "RSA1_5",
        "RSA-OAEP",
        "A128KW",
        "A256KW"
    ],
    "id_token_encryption_enc_values_supported": [
        "A128CBC+HS256",
        "A256CBC+HS512",
        "A128GCM",
        "A256GCM"
    ],
    "request_object_signing_alg_values_supported": [
        "none",
        "HS256",
        "HS384",
        "HS512",
        "RS256",
        "RS384",
        "RS512",
        "ES256",
        "ES384",
        "ES512"
    ],
    "request_object_encryption_alg_values_supported": [
        "RSA1_5",
        "RSA-OAEP",
        "A128KW",
        "A256KW"
    ],
    "request_object_encryption_enc_values_supported": [
        "A128CBC+HS256",
        "A256CBC+HS512",
        "A128GCM",
        "A256GCM"
    ],
    "token_endpoint_auth_methods_supported": [
        "client_secret_basic",
        "client_secret_post",
        "client_secret_jwt",
        "private_key_jwt"
    ],
    "token_endpoint_auth_signing_alg_values_supported": [
        "HS256",
        "HS384",
        "HS512",
        "RS256",
        "RS384",
        "RS512",
        "ES256",
        "ES384",
        "ES512"
    ],
    "display_values_supported": [
        "page",
        "popup"
    ],
    "claim_types_supported": ["normal"],
    "claims_supported": [
        "birthdate",
        "country",
        "name",
        "email",
        "email_verified",
        "given_name",
        "gender",
        "inum",
        "family_name",
        "updated_at",
        "locale",
        "member_of",
        "middle_name",
        "nickname",
        "oxAuthAppType",
        "oxAuthIdTokenSignedResponseAlg",
        "oxAuthRedirectURI",
        "oxAuthScope",
        "phone_number_verified",
        "picture",
        "preferred_username",
        "profile",
        "zoneinfo",
        "user_name",
        "website"
    ],
    "service_documentation": "http://gluu.org/docs",
    "claims_locales_supported": ["en"],
    "ui_locales_supported": [
        "en",
        "es"
    ],
    "scope_to_claims_mapping": [
        {"permission": []},
        {"uma_protection": []},
        {"clientinfo": [
            "name",
            "inum",
            "oxAuthAppType",
            "oxAuthIdTokenSignedResponseAlg",
            "oxAuthRedirectURI",
            "oxAuthScope"
        ]},
        {"email": [
            "email_verified",
            "email"
        ]},
        {"user_name": ["user_name"]},
        {"sub": []},
        {"org_name": []},
        {"address": [
            "formatted",
            "postal_code",
            "street_address",
            "locality",
            "country",
            "region"
        ]},
        {"openid": []},
        {"test_scope1": []},
        {"work_phone": []},
        {"phone": [
            "phone_number_verified",
            "phone_number"
        ]},
        {"profile": [
            "name",
            "family_name",
            "given_name",
            "middle_name",
            "nickname",
            "preferred_username",
            "profile",
            "picture",
            "website",
            "gender",
            "birthdate",
            "zoneinfo",
            "locale",
            "updated_at"
        ]},
        {"mobile_phone": ["phone_mobile_number"]},
        {"test": ["member_of"]}
    ],
    "claims_parameter_supported": true,
    "request_parameter_supported": true,
    "request_uri_parameter_supported": true,
    "require_request_uri_registration": false,
    "op_policy_uri": "http://ox.gluu.org/doku.php?id=oxauth:policy",
    "op_tos_uri": "http://ox.gluu.org/doku.php?id=oxauth:tos",
    "frontchannel_logout_supported": true,
    "frontchannel_logout_session_supported": true
}


#######################################################
TEST: OC5:FeatureTest-Uses Discovery
#######################################################
#######################################################
TEST: OpenID Connect Discovery
#######################################################
-------------------------------------------------------
REQUEST:
-------------------------------------------------------
GET /.well-known/webfinger?resource=acct%3Atest_user%40ce-dev4.gluu.org&rel=http%3A%2F%2Fopenid.net%2Fspecs%2Fconnect%2F1.0%2Fissuer HTTP/1.1
Host: ce-dev4.gluu.org

-------------------------------------------------------
RESPONSE:
-------------------------------------------------------
HTTP/1.1 200
Connection: Keep-Alive
Content-Length: 181
Content-Type: application/jrd+json;charset=iso-8859-1
Date: Wed, 04 Jul 2018 18:42:14 GMT
Keep-Alive: timeout=5, max=100
Server: Jetty(9.4.9.v20180320)
Strict-Transport-Security: max-age=31536000; includeSubDomains
X-Content-Type-Options: nosniff
X-Xss-Protection: 1; mode=block

{
    "subject": "acct:test_user@ce-dev4.gluu.org",
    "links": [{
        "rel": "http://openid.net/specs/connect/1.0/issuer",
        "href": "https://ce-dev4.gluu.org"
    }]
}


OpenID Connect Configuration
-------------------------------------------------------
REQUEST:
-------------------------------------------------------
GET /.well-known/openid-configuration HTTP/1.1
Host: ce-dev4.gluu.org

-------------------------------------------------------
RESPONSE:
-------------------------------------------------------
HTTP/1.1 200
Connection: Keep-Alive
Content-Length: 6342
Content-Type: application/json
Date: Wed, 04 Jul 2018 18:42:14 GMT
Keep-Alive: timeout=5, max=100
Server: Jetty(9.4.9.v20180320)
Strict-Transport-Security: max-age=31536000; includeSubDomains
X-Content-Type-Options: nosniff
X-Xss-Protection: 1; mode=block

{
    "issuer": "https://ce-dev4.gluu.org",
    "authorization_endpoint": "https://ce-dev4.gluu.org/oxauth/restv1/authorize",
    "token_endpoint": "https://ce-dev4.gluu.org/oxauth/restv1/token",
    "userinfo_endpoint": "https://ce-dev4.gluu.org/oxauth/restv1/userinfo",
    "clientinfo_endpoint": "https://ce-dev4.gluu.org/oxauth/restv1/clientinfo",
    "check_session_iframe": "https://ce-dev4.gluu.org/oxauth/opiframe",
    "end_session_endpoint": "https://ce-dev4.gluu.org/oxauth/restv1/end_session",
    "jwks_uri": "https://ce-dev4.gluu.org/oxauth/restv1/jwks",
    "registration_endpoint": "https://ce-dev4.gluu.org/oxauth/restv1/register",
    "id_generation_endpoint": "https://ce-dev4.gluu.org/oxauth/restv1/id",
    "introspection_endpoint": "https://ce-dev4.gluu.org/oxauth/restv1/introspection",
    "scopes_supported": [
        "permission",
        "clientinfo",
        "email",
        "user_name",
        "sub",
        "org_name",
        "address",
        "openid",
        "test_scope1",
        "work_phone",
        "phone",
        "profile",
        "mobile_phone",
        "test"
    ],
    "response_types_supported": [
        "id_token",
        "code",
        "id_token code token",
        "id_token code",
        "code token",
        "id_token token",
        "token"
    ],
    "grant_types_supported": [
        "implicit",
        "refresh_token",
        "urn:ietf:params:oauth:grant-type:uma-ticket",
        "client_credentials",
        "authorization_code",
        "password"
    ],
    "acr_values_supported": [
        "super_gluu",
        "u2f",
        "otp",
        "basic",
        "auth_ldap_server"
    ],
    "auth_level_mapping": {
        "-1": ["auth_ldap_server"],
        "50": ["otp"],
        "100": ["basic"],
        "10": ["u2f"],
        "15": ["super_gluu"]
    },
    "subject_types_supported": [
        "public",
        "pairwise"
    ],
    "userinfo_signing_alg_values_supported": [
        "HS256",
        "HS384",
        "HS512",
        "RS256",
        "RS384",
        "RS512",
        "ES256",
        "ES384",
        "ES512"
    ],
    "userinfo_encryption_alg_values_supported": [
        "RSA1_5",
        "RSA-OAEP",
        "A128KW",
        "A256KW"
    ],
    "userinfo_encryption_enc_values_supported": [
        "RSA1_5",
        "RSA-OAEP",
        "A128KW",
        "A256KW"
    ],
    "id_token_signing_alg_values_supported": [
        "none",
        "HS256",
        "HS384",
        "HS512",
        "RS256",
        "RS384",
        "RS512",
        "ES256",
        "ES384",
        "ES512"
    ],
    "id_token_encryption_alg_values_supported": [
        "RSA1_5",
        "RSA-OAEP",
        "A128KW",
        "A256KW"
    ],
    "id_token_encryption_enc_values_supported": [
        "A128CBC+HS256",
        "A256CBC+HS512",
        "A128GCM",
        "A256GCM"
    ],
    "request_object_signing_alg_values_supported": [
        "none",
        "HS256",
        "HS384",
        "HS512",
        "RS256",
        "RS384",
        "RS512",
        "ES256",
        "ES384",
        "ES512"
    ],
    "request_object_encryption_alg_values_supported": [
        "RSA1_5",
        "RSA-OAEP",
        "A128KW",
        "A256KW"
    ],
    "request_object_encryption_enc_values_supported": [
        "A128CBC+HS256",
        "A256CBC+HS512",
        "A128GCM",
        "A256GCM"
    ],
    "token_endpoint_auth_methods_supported": [
        "client_secret_basic",
        "client_secret_post",
        "client_secret_jwt",
        "private_key_jwt"
    ],
    "token_endpoint_auth_signing_alg_values_supported": [
        "HS256",
        "HS384",
        "HS512",
        "RS256",
        "RS384",
        "RS512",
        "ES256",
        "ES384",
        "ES512"
    ],
    "display_values_supported": [
        "page",
        "popup"
    ],
    "claim_types_supported": ["normal"],
    "claims_supported": [
        "birthdate",
        "country",
        "name",
        "email",
        "email_verified",
        "given_name",
        "gender",
        "inum",
        "family_name",
        "updated_at",
        "locale",
        "member_of",
        "middle_name",
        "nickname",
        "oxAuthAppType",
        "oxAuthIdTokenSignedResponseAlg",
        "oxAuthRedirectURI",
        "oxAuthScope",
        "phone_number_verified",
        "picture",
        "preferred_username",
        "profile",
        "zoneinfo",
        "user_name",
        "website"
    ],
    "service_documentation": "http://gluu.org/docs",
    "claims_locales_supported": ["en"],
    "ui_locales_supported": [
        "en",
        "es"
    ],
    "scope_to_claims_mapping": [
        {"permission": []},
        {"uma_protection": []},
        {"clientinfo": [
            "name",
            "inum",
            "oxAuthAppType",
            "oxAuthIdTokenSignedResponseAlg",
            "oxAuthRedirectURI",
            "oxAuthScope"
        ]},
        {"email": [
            "email_verified",
            "email"
        ]},
        {"user_name": ["user_name"]},
        {"sub": []},
        {"org_name": []},
        {"address": [
            "formatted",
            "postal_code",
            "street_address",
            "locality",
            "country",
            "region"
        ]},
        {"openid": []},
        {"test_scope1": []},
        {"work_phone": []},
        {"phone": [
            "phone_number_verified",
            "phone_number"
        ]},
        {"profile": [
            "name",
            "family_name",
            "given_name",
            "middle_name",
            "nickname",
            "preferred_username",
            "profile",
            "picture",
            "website",
            "gender",
            "birthdate",
            "zoneinfo",
            "locale",
            "updated_at"
        ]},
        {"mobile_phone": ["phone_mobile_number"]},
        {"test": ["member_of"]}
    ],
    "claims_parameter_supported": true,
    "request_parameter_supported": true,
    "request_uri_parameter_supported": true,
    "require_request_uri_registration": false,
    "op_policy_uri": "http://ox.gluu.org/doku.php?id=oxauth:policy",
    "op_tos_uri": "http://ox.gluu.org/doku.php?id=oxauth:tos",
    "frontchannel_logout_supported": true,
    "frontchannel_logout_session_supported": true
}


#######################################################
TEST: OC5:FeatureTest-Uses Dynamic Registration
#######################################################
-------------------------------------------------------
REQUEST:
-------------------------------------------------------
POST /oxauth/restv1/register HTTP/1.1
Content-Type: application/json
Accept: application/json
Host: ce-dev4.gluu.org

{
    "redirect_uris": [
        "https://ce-dev4.gluu.org/oxauth-rp/home.htm",
        "https://client.example.com/cb",
        "https://client.example.com/cb1",
        "https://client.example.com/cb2"
    ],
    "application_type": "web",
    "contacts": [
        "javier@gluu.org",
        "javier.rojas.blum@gmail.com"
    ],
    "client_name": "oxAuth test app",
    "logo_uri": "http://www.gluu.org/wp-content/themes/gluursn/images/logo.png",
    "policy_uri": "http://www.gluu.org/policy",
    "jwks_uri": "https://ce-dev4.gluu.org/oxauth-client/test/resources/jwks.json",
    "sector_identifier_uri": "https://ce-dev4.gluu.org/oxauth/sectoridentifier/@!38D4.410C.1D43.8932!0001!37F2.B744!0012!D426.70FD",
    "subject_type": "public",
    "request_object_signing_alg": "RS256",
    "token_endpoint_auth_method": "client_secret_jwt"
}

-------------------------------------------------------
RESPONSE:
-------------------------------------------------------
HTTP/1.1 200
Cache-Control: no-store
Connection: Keep-Alive
Content-Length: 1695
Content-Type: application/json
Date: Wed, 04 Jul 2018 18:42:14 GMT
Keep-Alive: timeout=5, max=100
Pragma: no-cache
Server: Jetty(9.4.9.v20180320)
Strict-Transport-Security: max-age=31536000; includeSubDomains
X-Content-Type-Options: nosniff
X-Xss-Protection: 1; mode=block

{
    "client_id": "@!38D4.410C.1D43.8932!0001!37F2.B744!0008!28BE.B860.1C3A.5A8F",
    "client_secret": "25789218-5a92-405f-b535-fe5deeb56856",
    "registration_access_token": "64210425-2f91-4c29-b338-4b6ac53cb148",
    "registration_client_uri": "https://ce-dev4.gluu.org/oxauth/restv1/register?client_id=@!38D4.410C.1D43.8932!0001!37F2.B744!0008!28BE.B860.1C3A.5A8F",
    "client_id_issued_at": 1530729734,
    "client_secret_expires_at": 1530816134,
    "redirect_uris": [
        "https://client.example.com/cb2",
        "https://client.example.com/cb1",
        "https://client.example.com/cb",
        "https://ce-dev4.gluu.org/oxauth-rp/home.htm"
    ],
    "response_types": ["code"],
    "grant_types": [
        "refresh_token",
        "authorization_code"
    ],
    "application_type": "web",
    "contacts": [
        "javier.rojas.blum@gmail.com",
        "javier@gluu.org"
    ],
    "client_name": "oxAuth test app",
    "logo_uri": "http://www.gluu.org/wp-content/themes/gluursn/images/logo.png",
    "policy_uri": "http://www.gluu.org/policy",
    "jwks_uri": "https://ce-dev4.gluu.org/oxauth-client/test/resources/jwks.json",
    "sector_identifier_uri": "https://ce-dev4.gluu.org/oxauth/sectoridentifier/@!38D4.410C.1D43.8932!0001!37F2.B744!0012!D426.70FD",
    "subject_type": "public",
    "id_token_signed_response_alg": "RS256",
    "request_object_signing_alg": "RS256",
    "token_endpoint_auth_method": "client_secret_jwt",
    "require_auth_time": false,
    "frontchannel_logout_session_required": false,
    "scope": "permission uma_protection clientinfo email user_name sub org_name address openid test_scope1 work_phone phone profile test",
    "claims": ""
}

#######################################################
TEST: OpenID Connect Discovery
#######################################################
-------------------------------------------------------
REQUEST:
-------------------------------------------------------
GET /.well-known/webfinger?resource=acct%3Atest_user%40ce-dev4.gluu.org&rel=http%3A%2F%2Fopenid.net%2Fspecs%2Fconnect%2F1.0%2Fissuer HTTP/1.1
Host: ce-dev4.gluu.org

-------------------------------------------------------
RESPONSE:
-------------------------------------------------------
HTTP/1.1 200
Connection: Keep-Alive
Content-Length: 181
Content-Type: application/jrd+json;charset=iso-8859-1
Date: Wed, 04 Jul 2018 18:42:14 GMT
Keep-Alive: timeout=5, max=100
Server: Jetty(9.4.9.v20180320)
Strict-Transport-Security: max-age=31536000; includeSubDomains
X-Content-Type-Options: nosniff
X-Xss-Protection: 1; mode=block

{
    "subject": "acct:test_user@ce-dev4.gluu.org",
    "links": [{
        "rel": "http://openid.net/specs/connect/1.0/issuer",
        "href": "https://ce-dev4.gluu.org"
    }]
}


OpenID Connect Configuration
-------------------------------------------------------
REQUEST:
-------------------------------------------------------
GET /.well-known/openid-configuration HTTP/1.1
Host: ce-dev4.gluu.org

-------------------------------------------------------
RESPONSE:
-------------------------------------------------------
HTTP/1.1 200
Connection: Keep-Alive
Content-Length: 6342
Content-Type: application/json
Date: Wed, 04 Jul 2018 18:42:14 GMT
Keep-Alive: timeout=5, max=100
Server: Jetty(9.4.9.v20180320)
Strict-Transport-Security: max-age=31536000; includeSubDomains
X-Content-Type-Options: nosniff
X-Xss-Protection: 1; mode=block

{
    "issuer": "https://ce-dev4.gluu.org",
    "authorization_endpoint": "https://ce-dev4.gluu.org/oxauth/restv1/authorize",
    "token_endpoint": "https://ce-dev4.gluu.org/oxauth/restv1/token",
    "userinfo_endpoint": "https://ce-dev4.gluu.org/oxauth/restv1/userinfo",
    "clientinfo_endpoint": "https://ce-dev4.gluu.org/oxauth/restv1/clientinfo",
    "check_session_iframe": "https://ce-dev4.gluu.org/oxauth/opiframe",
    "end_session_endpoint": "https://ce-dev4.gluu.org/oxauth/restv1/end_session",
    "jwks_uri": "https://ce-dev4.gluu.org/oxauth/restv1/jwks",
    "registration_endpoint": "https://ce-dev4.gluu.org/oxauth/restv1/register",
    "id_generation_endpoint": "https://ce-dev4.gluu.org/oxauth/restv1/id",
    "introspection_endpoint": "https://ce-dev4.gluu.org/oxauth/restv1/introspection",
    "scopes_supported": [
        "permission",
        "clientinfo",
        "email",
        "user_name",
        "sub",
        "org_name",
        "address",
        "openid",
        "test_scope1",
        "work_phone",
        "phone",
        "profile",
        "mobile_phone",
        "test"
    ],
    "response_types_supported": [
        "id_token",
        "code",
        "id_token code token",
        "id_token code",
        "code token",
        "id_token token",
        "token"
    ],
    "grant_types_supported": [
        "implicit",
        "refresh_token",
        "urn:ietf:params:oauth:grant-type:uma-ticket",
        "client_credentials",
        "authorization_code",
        "password"
    ],
    "acr_values_supported": [
        "super_gluu",
        "u2f",
        "otp",
        "basic",
        "auth_ldap_server"
    ],
    "auth_level_mapping": {
        "-1": ["auth_ldap_server"],
        "50": ["otp"],
        "100": ["basic"],
        "10": ["u2f"],
        "15": ["super_gluu"]
    },
    "subject_types_supported": [
        "public",
        "pairwise"
    ],
    "userinfo_signing_alg_values_supported": [
        "HS256",
        "HS384",
        "HS512",
        "RS256",
        "RS384",
        "RS512",
        "ES256",
        "ES384",
        "ES512"
    ],
    "userinfo_encryption_alg_values_supported": [
        "RSA1_5",
        "RSA-OAEP",
        "A128KW",
        "A256KW"
    ],
    "userinfo_encryption_enc_values_supported": [
        "RSA1_5",
        "RSA-OAEP",
        "A128KW",
        "A256KW"
    ],
    "id_token_signing_alg_values_supported": [
        "none",
        "HS256",
        "HS384",
        "HS512",
        "RS256",
        "RS384",
        "RS512",
        "ES256",
        "ES384",
        "ES512"
    ],
    "id_token_encryption_alg_values_supported": [
        "RSA1_5",
        "RSA-OAEP",
        "A128KW",
        "A256KW"
    ],
    "id_token_encryption_enc_values_supported": [
        "A128CBC+HS256",
        "A256CBC+HS512",
        "A128GCM",
        "A256GCM"
    ],
    "request_object_signing_alg_values_supported": [
        "none",
        "HS256",
        "HS384",
        "HS512",
        "RS256",
        "RS384",
        "RS512",
        "ES256",
        "ES384",
        "ES512"
    ],
    "request_object_encryption_alg_values_supported": [
        "RSA1_5",
        "RSA-OAEP",
        "A128KW",
        "A256KW"
    ],
    "request_object_encryption_enc_values_supported": [
        "A128CBC+HS256",
        "A256CBC+HS512",
        "A128GCM",
        "A256GCM"
    ],
    "token_endpoint_auth_methods_supported": [
        "client_secret_basic",
        "client_secret_post",
        "client_secret_jwt",
        "private_key_jwt"
    ],
    "token_endpoint_auth_signing_alg_values_supported": [
        "HS256",
        "HS384",
        "HS512",
        "RS256",
        "RS384",
        "RS512",
        "ES256",
        "ES384",
        "ES512"
    ],
    "display_values_supported": [
        "page",
        "popup"
    ],
    "claim_types_supported": ["normal"],
    "claims_supported": [
        "birthdate",
        "country",
        "name",
        "email",
        "email_verified",
        "given_name",
        "gender",
        "inum",
        "family_name",
        "updated_at",
        "locale",
        "member_of",
        "middle_name",
        "nickname",
        "oxAuthAppType",
        "oxAuthIdTokenSignedResponseAlg",
        "oxAuthRedirectURI",
        "oxAuthScope",
        "phone_number_verified",
        "picture",
        "preferred_username",
        "profile",
        "zoneinfo",
        "user_name",
        "website"
    ],
    "service_documentation": "http://gluu.org/docs",
    "claims_locales_supported": ["en"],
    "ui_locales_supported": [
        "en",
        "es"
    ],
    "scope_to_claims_mapping": [
        {"permission": []},
        {"uma_protection": []},
        {"clientinfo": [
            "name",
            "inum",
            "oxAuthAppType",
            "oxAuthIdTokenSignedResponseAlg",
            "oxAuthRedirectURI",
            "oxAuthScope"
        ]},
        {"email": [
            "email_verified",
            "email"
        ]},
        {"user_name": ["user_name"]},
        {"sub": []},
        {"org_name": []},
        {"address": [
            "formatted",
            "postal_code",
            "street_address",
            "locality",
            "country",
            "region"
        ]},
        {"openid": []},
        {"test_scope1": []},
        {"work_phone": []},
        {"phone": [
            "phone_number_verified",
            "phone_number"
        ]},
        {"profile": [
            "name",
            "family_name",
            "given_name",
            "middle_name",
            "nickname",
            "preferred_username",
            "profile",
            "picture",
            "website",
            "gender",
            "birthdate",
            "zoneinfo",
            "locale",
            "updated_at"
        ]},
        {"mobile_phone": ["phone_mobile_number"]},
        {"test": ["member_of"]}
    ],
    "claims_parameter_supported": true,
    "request_parameter_supported": true,
    "request_uri_parameter_supported": true,
    "require_request_uri_registration": false,
    "op_policy_uri": "http://ox.gluu.org/doku.php?id=oxauth:policy",
    "op_tos_uri": "http://ox.gluu.org/doku.php?id=oxauth:tos",
    "frontchannel_logout_supported": true,
    "frontchannel_logout_session_supported": true
}


#######################################################
TEST: OC5:FeatureTest-Uses Symmetric ID Token Signatures HS256
#######################################################
-------------------------------------------------------
REQUEST:
-------------------------------------------------------
POST /oxauth/restv1/register HTTP/1.1
Content-Type: application/json
Accept: application/json
Host: ce-dev4.gluu.org

{
    "redirect_uris": [
        "https://ce-dev4.gluu.org/oxauth-rp/home.htm",
        "https://client.example.com/cb",
        "https://client.example.com/cb1",
        "https://client.example.com/cb2"
    ],
    "response_types": ["id_token"],
    "application_type": "web",
    "client_name": "oxAuth test app",
    "sector_identifier_uri": "https://ce-dev4.gluu.org/oxauth/sectoridentifier/@!38D4.410C.1D43.8932!0001!37F2.B744!0012!D426.70FD",
    "id_token_signed_response_alg": "HS256"
}

-------------------------------------------------------
RESPONSE:
-------------------------------------------------------
HTTP/1.1 200
Cache-Control: no-store
Connection: Keep-Alive
Content-Length: 1340
Content-Type: application/json
Date: Wed, 04 Jul 2018 18:42:14 GMT
Keep-Alive: timeout=5, max=100
Pragma: no-cache
Server: Jetty(9.4.9.v20180320)
Strict-Transport-Security: max-age=31536000; includeSubDomains
X-Content-Type-Options: nosniff
X-Xss-Protection: 1; mode=block

{
    "client_id": "@!38D4.410C.1D43.8932!0001!37F2.B744!0008!D94C.9DE3.BA55.EA3C",
    "client_secret": "fecfa3ae-5e10-47bb-a503-6d42095fea0d",
    "registration_access_token": "9eafa585-31cd-4f08-bf80-0ba0e63b71c4",
    "registration_client_uri": "https://ce-dev4.gluu.org/oxauth/restv1/register?client_id=@!38D4.410C.1D43.8932!0001!37F2.B744!0008!D94C.9DE3.BA55.EA3C",
    "client_id_issued_at": 1530729734,
    "client_secret_expires_at": 1530816134,
    "redirect_uris": [
        "https://client.example.com/cb2",
        "https://client.example.com/cb1",
        "https://client.example.com/cb",
        "https://ce-dev4.gluu.org/oxauth-rp/home.htm"
    ],
    "response_types": [
        "id_token",
        "token"
    ],
    "grant_types": ["implicit"],
    "application_type": "web",
    "client_name": "oxAuth test app",
    "sector_identifier_uri": "https://ce-dev4.gluu.org/oxauth/sectoridentifier/@!38D4.410C.1D43.8932!0001!37F2.B744!0012!D426.70FD",
    "subject_type": "pairwise",
    "id_token_signed_response_alg": "HS256",
    "token_endpoint_auth_method": "client_secret_basic",
    "require_auth_time": false,
    "frontchannel_logout_session_required": false,
    "scope": "permission uma_protection clientinfo email user_name sub org_name address openid test_scope1 work_phone phone profile test",
    "claims": ""
}

authenticateResourceOwnerAndGrantAccess: Cleaning cookies
authenticateResourceOwnerAndGrantAccess: authorizationRequestUrl:https://ce-dev4.gluu.org/oxauth/restv1/authorize?response_type=id_token&client_id=%40%2138D4.410C.1D43.8932%210001%2137F2.B744%210008%21D94C.9DE3.BA55.EA3C&scope=openid+profile+address+email&redirect_uri=https%3A%2F%2Fce-dev4.gluu.org%2Foxauth-rp%2Fhome.htm&state=e080802b-60e8-4635-9eb7-7181618f3944&nonce=11e11746-990b-49cf-b4a7-9faefc6a23e1
14:42:34.767 [main] ERROR com.gargoylesoftware.htmlunit.javascript.StrictErrorReporter - runtimeError: message=[An invalid or illegal selector was specified (selector: '*,:x' error: Invalid selector: :x).] sourceName=[https://ce-dev4.gluu.org/oxauth/js/jquery-1.12.4.min.js] line=[2] lineSource=[null] lineOffset=[0]
authenticateResourceOwnerAndGrantAccess: sessionState:5ff27eb8-c7f3-44eb-8bde-a474cf7430cf
-------------------------------------------------------
REQUEST:
-------------------------------------------------------
https://ce-dev4.gluu.org/oxauth/restv1/authorize?response_type=id_token&client_id=%40%2138D4.410C.1D43.8932%210001%2137F2.B744%210008%21D94C.9DE3.BA55.EA3C&scope=openid+profile+address+email&redirect_uri=https%3A%2F%2Fce-dev4.gluu.org%2Foxauth-rp%2Fhome.htm&state=e080802b-60e8-4635-9eb7-7181618f3944&nonce=11e11746-990b-49cf-b4a7-9faefc6a23e1

-------------------------------------------------------
RESPONSE:
-------------------------------------------------------
HTTP/1.1 302 Found
Location: https://ce-dev4.gluu.org/oxauth-rp/home.htm#scope=address+openid+profile+email&id_token=eyJ0eXAiOiJKV1QiLCJhbGciOiJIUzI1NiJ9.eyJpc3MiOiJodHRwczovL2NlLWRldjQuZ2x1dS5vcmciLCJhdWQiOiJAITM4RDQuNDEwQy4xRDQzLjg5MzIhMDAwMSEzN0YyLkI3NDQhMDAwOCFEOTRDLjlERTMuQkE1NS5FQTNDIiwiZXhwIjoxNTMwNzMzMzM1LCJpYXQiOjE1MzA3Mjk3MzUsIm5vbmNlIjoiMTFlMTE3NDYtOTkwYi00OWNmLWI0YTctOWZhZWZjNmEyM2UxIiwiYXV0aF90aW1lIjoxNTMwNzI5NzM1LCJveE9wZW5JRENvbm5lY3RWZXJzaW9uIjoib3BlbmlkY29ubmVjdC0xLjAiLCJzdWIiOiI2MUFGeFRfSjI3RDNxT0pGQlVCd2NLLTE4dzdPOHB3VUc4TFFjZVJMNVQ4In0.TYZFeWMi-4E9uhrBO7EL9fteZ8_DTeJYXZ4ZA3FFWQM&session_id=35393d9a-6146-427d-bdc6-3b640abd84e4&state=e080802b-60e8-4635-9eb7-7181618f3944&session_state=5ff27eb8-c7f3-44eb-8bde-a474cf7430cf

#######################################################
TEST: OC5:FeatureTest-Uses Symmetric ID Token Signatures HS384
#######################################################
-------------------------------------------------------
REQUEST:
-------------------------------------------------------
POST /oxauth/restv1/register HTTP/1.1
Content-Type: application/json
Accept: application/json
Host: ce-dev4.gluu.org

{
    "redirect_uris": [
        "https://ce-dev4.gluu.org/oxauth-rp/home.htm",
        "https://client.example.com/cb",
        "https://client.example.com/cb1",
        "https://client.example.com/cb2"
    ],
    "response_types": ["id_token"],
    "application_type": "web",
    "client_name": "oxAuth test app",
    "sector_identifier_uri": "https://ce-dev4.gluu.org/oxauth/sectoridentifier/@!38D4.410C.1D43.8932!0001!37F2.B744!0012!D426.70FD",
    "id_token_signed_response_alg": "HS384"
}

-------------------------------------------------------
RESPONSE:
-------------------------------------------------------
HTTP/1.1 200
Cache-Control: no-store
Connection: Keep-Alive
Content-Length: 1340
Content-Type: application/json
Date: Wed, 04 Jul 2018 18:42:15 GMT
Keep-Alive: timeout=5, max=100
Pragma: no-cache
Server: Jetty(9.4.9.v20180320)
Strict-Transport-Security: max-age=31536000; includeSubDomains
X-Content-Type-Options: nosniff
X-Xss-Protection: 1; mode=block

{
    "client_id": "@!38D4.410C.1D43.8932!0001!37F2.B744!0008!03B7.5185.CF92.6303",
    "client_secret": "2cf7fd73-8feb-4588-abae-f14f52b05e17",
    "registration_access_token": "5ad90420-8071-4abe-943b-cca661f38ae2",
    "registration_client_uri": "https://ce-dev4.gluu.org/oxauth/restv1/register?client_id=@!38D4.410C.1D43.8932!0001!37F2.B744!0008!03B7.5185.CF92.6303",
    "client_id_issued_at": 1530729735,
    "client_secret_expires_at": 1530816135,
    "redirect_uris": [
        "https://client.example.com/cb2",
        "https://client.example.com/cb1",
        "https://client.example.com/cb",
        "https://ce-dev4.gluu.org/oxauth-rp/home.htm"
    ],
    "response_types": [
        "id_token",
        "token"
    ],
    "grant_types": ["implicit"],
    "application_type": "web",
    "client_name": "oxAuth test app",
    "sector_identifier_uri": "https://ce-dev4.gluu.org/oxauth/sectoridentifier/@!38D4.410C.1D43.8932!0001!37F2.B744!0012!D426.70FD",
    "subject_type": "pairwise",
    "id_token_signed_response_alg": "HS384",
    "token_endpoint_auth_method": "client_secret_basic",
    "require_auth_time": false,
    "frontchannel_logout_session_required": false,
    "scope": "permission uma_protection clientinfo email user_name sub org_name address openid test_scope1 work_phone phone profile test",
    "claims": ""
}

authenticateResourceOwnerAndGrantAccess: Cleaning cookies
authenticateResourceOwnerAndGrantAccess: authorizationRequestUrl:https://ce-dev4.gluu.org/oxauth/restv1/authorize?response_type=id_token&client_id=%40%2138D4.410C.1D43.8932%210001%2137F2.B744%210008%2103B7.5185.CF92.6303&scope=openid+profile+address+email&redirect_uri=https%3A%2F%2Fce-dev4.gluu.org%2Foxauth-rp%2Fhome.htm&state=30a9dc1d-5c16-449c-8a98-fa5d05f9014c&nonce=7838629b-331d-42ea-a3b8-0dba928f7394
14:42:35.931 [main] ERROR com.gargoylesoftware.htmlunit.javascript.StrictErrorReporter - runtimeError: message=[An invalid or illegal selector was specified (selector: '*,:x' error: Invalid selector: :x).] sourceName=[https://ce-dev4.gluu.org/oxauth/js/jquery-1.12.4.min.js] line=[2] lineSource=[null] lineOffset=[0]
authenticateResourceOwnerAndGrantAccess: sessionState:a5798a2b-84c1-42e4-8c2c-53e0093b188f
-------------------------------------------------------
REQUEST:
-------------------------------------------------------
https://ce-dev4.gluu.org/oxauth/restv1/authorize?response_type=id_token&client_id=%40%2138D4.410C.1D43.8932%210001%2137F2.B744%210008%2103B7.5185.CF92.6303&scope=openid+profile+address+email&redirect_uri=https%3A%2F%2Fce-dev4.gluu.org%2Foxauth-rp%2Fhome.htm&state=30a9dc1d-5c16-449c-8a98-fa5d05f9014c&nonce=7838629b-331d-42ea-a3b8-0dba928f7394

-------------------------------------------------------
RESPONSE:
-------------------------------------------------------
HTTP/1.1 302 Found
Location: https://ce-dev4.gluu.org/oxauth-rp/home.htm#scope=address+openid+profile+email&id_token=eyJ0eXAiOiJKV1QiLCJhbGciOiJIUzM4NCJ9.eyJpc3MiOiJodHRwczovL2NlLWRldjQuZ2x1dS5vcmciLCJhdWQiOiJAITM4RDQuNDEwQy4xRDQzLjg5MzIhMDAwMSEzN0YyLkI3NDQhMDAwOCEwM0I3LjUxODUuQ0Y5Mi42MzAzIiwiZXhwIjoxNTMwNzMzMzM2LCJpYXQiOjE1MzA3Mjk3MzYsIm5vbmNlIjoiNzgzODYyOWItMzMxZC00MmVhLWEzYjgtMGRiYTkyOGY3Mzk0IiwiYXV0aF90aW1lIjoxNTMwNzI5NzM2LCJveE9wZW5JRENvbm5lY3RWZXJzaW9uIjoib3BlbmlkY29ubmVjdC0xLjAiLCJzdWIiOiJQbmZZRHJKa3d6ajEyaXExX3FMY1Zvb3dFM2NBS1Rja0liRFVIS1hWQTkwIn0.nIQRzb329M_WQR7nTSMt25eAlGe-mc_34s6ehZP__OqQm5gUA0BVLnnDSty1D3y9&session_id=a393eec6-b367-4d30-b16c-2c8f37654533&state=30a9dc1d-5c16-449c-8a98-fa5d05f9014c&session_state=a5798a2b-84c1-42e4-8c2c-53e0093b188f

#######################################################
TEST: OC5:FeatureTest-Uses Symmetric ID Token Signatures HS512
#######################################################
-------------------------------------------------------
REQUEST:
-------------------------------------------------------
POST /oxauth/restv1/register HTTP/1.1
Content-Type: application/json
Accept: application/json
Host: ce-dev4.gluu.org

{
    "redirect_uris": [
        "https://ce-dev4.gluu.org/oxauth-rp/home.htm",
        "https://client.example.com/cb",
        "https://client.example.com/cb1",
        "https://client.example.com/cb2"
    ],
    "response_types": ["id_token"],
    "application_type": "web",
    "client_name": "oxAuth test app",
    "sector_identifier_uri": "https://ce-dev4.gluu.org/oxauth/sectoridentifier/@!38D4.410C.1D43.8932!0001!37F2.B744!0012!D426.70FD",
    "id_token_signed_response_alg": "HS512"
}

-------------------------------------------------------
RESPONSE:
-------------------------------------------------------
HTTP/1.1 200
Cache-Control: no-store
Connection: Keep-Alive
Content-Length: 1340
Content-Type: application/json
Date: Wed, 04 Jul 2018 18:42:16 GMT
Keep-Alive: timeout=5, max=100
Pragma: no-cache
Server: Jetty(9.4.9.v20180320)
Strict-Transport-Security: max-age=31536000; includeSubDomains
X-Content-Type-Options: nosniff
X-Xss-Protection: 1; mode=block

{
    "client_id": "@!38D4.410C.1D43.8932!0001!37F2.B744!0008!C090.F4FA.BD73.3B73",
    "client_secret": "d409de40-bba8-4384-b1b2-2c6415d8f5d3",
    "registration_access_token": "e53db4d6-05c6-4965-8ef8-ef2a0ec62125",
    "registration_client_uri": "https://ce-dev4.gluu.org/oxauth/restv1/register?client_id=@!38D4.410C.1D43.8932!0001!37F2.B744!0008!C090.F4FA.BD73.3B73",
    "client_id_issued_at": 1530729737,
    "client_secret_expires_at": 1530816137,
    "redirect_uris": [
        "https://client.example.com/cb2",
        "https://client.example.com/cb1",
        "https://client.example.com/cb",
        "https://ce-dev4.gluu.org/oxauth-rp/home.htm"
    ],
    "response_types": [
        "id_token",
        "token"
    ],
    "grant_types": ["implicit"],
    "application_type": "web",
    "client_name": "oxAuth test app",
    "sector_identifier_uri": "https://ce-dev4.gluu.org/oxauth/sectoridentifier/@!38D4.410C.1D43.8932!0001!37F2.B744!0012!D426.70FD",
    "subject_type": "pairwise",
    "id_token_signed_response_alg": "HS512",
    "token_endpoint_auth_method": "client_secret_basic",
    "require_auth_time": false,
    "frontchannel_logout_session_required": false,
    "scope": "permission uma_protection clientinfo email user_name sub org_name address openid test_scope1 work_phone phone profile test",
    "claims": ""
}

authenticateResourceOwnerAndGrantAccess: Cleaning cookies
authenticateResourceOwnerAndGrantAccess: authorizationRequestUrl:https://ce-dev4.gluu.org/oxauth/restv1/authorize?response_type=id_token&client_id=%40%2138D4.410C.1D43.8932%210001%2137F2.B744%210008%21C090.F4FA.BD73.3B73&scope=openid+profile+address+email&redirect_uri=https%3A%2F%2Fce-dev4.gluu.org%2Foxauth-rp%2Fhome.htm&state=a862a37d-1a65-4a45-92f2-939ac12345ac&nonce=03fa20ad-d036-4699-acb7-1a488a2cb152
14:42:37.093 [main] ERROR com.gargoylesoftware.htmlunit.javascript.StrictErrorReporter - runtimeError: message=[An invalid or illegal selector was specified (selector: '*,:x' error: Invalid selector: :x).] sourceName=[https://ce-dev4.gluu.org/oxauth/js/jquery-1.12.4.min.js] line=[2] lineSource=[null] lineOffset=[0]
authenticateResourceOwnerAndGrantAccess: sessionState:73def47f-052c-4015-a6f3-ab2f85415962
-------------------------------------------------------
REQUEST:
-------------------------------------------------------
https://ce-dev4.gluu.org/oxauth/restv1/authorize?response_type=id_token&client_id=%40%2138D4.410C.1D43.8932%210001%2137F2.B744%210008%21C090.F4FA.BD73.3B73&scope=openid+profile+address+email&redirect_uri=https%3A%2F%2Fce-dev4.gluu.org%2Foxauth-rp%2Fhome.htm&state=a862a37d-1a65-4a45-92f2-939ac12345ac&nonce=03fa20ad-d036-4699-acb7-1a488a2cb152

-------------------------------------------------------
RESPONSE:
-------------------------------------------------------
HTTP/1.1 302 Found
Location: https://ce-dev4.gluu.org/oxauth-rp/home.htm#scope=address+openid+profile+email&id_token=eyJ0eXAiOiJKV1QiLCJhbGciOiJIUzUxMiJ9.eyJpc3MiOiJodHRwczovL2NlLWRldjQuZ2x1dS5vcmciLCJhdWQiOiJAITM4RDQuNDEwQy4xRDQzLjg5MzIhMDAwMSEzN0YyLkI3NDQhMDAwOCFDMDkwLkY0RkEuQkQ3My4zQjczIiwiZXhwIjoxNTMwNzMzMzM4LCJpYXQiOjE1MzA3Mjk3MzgsIm5vbmNlIjoiMDNmYTIwYWQtZDAzNi00Njk5LWFjYjctMWE0ODhhMmNiMTUyIiwiYXV0aF90aW1lIjoxNTMwNzI5NzM3LCJveE9wZW5JRENvbm5lY3RWZXJzaW9uIjoib3BlbmlkY29ubmVjdC0xLjAiLCJzdWIiOiJZNVZrMFhjalZLRkcwOC1mTzdSUkNyZDdCcVI1UDJkdVdGYjdVN2ZnTmhzIn0.ULGsenq90tZ80yfq8bJnyR-MU318eSPZMw8hf6-70H92z77_czBtaIXg5Lho86RMMRszSNdUzZ2ZcT_w4JgCAg&session_id=8466175a-86a1-464b-b925-7c3778ddcbe1&state=a862a37d-1a65-4a45-92f2-939ac12345ac&session_state=73def47f-052c-4015-a6f3-ab2f85415962

#######################################################
TEST: OpenID Connect Discovery
#######################################################
-------------------------------------------------------
REQUEST:
-------------------------------------------------------
GET /.well-known/webfinger?resource=acct%3Atest_user%40ce-dev4.gluu.org&rel=http%3A%2F%2Fopenid.net%2Fspecs%2Fconnect%2F1.0%2Fissuer HTTP/1.1
Host: ce-dev4.gluu.org

-------------------------------------------------------
RESPONSE:
-------------------------------------------------------
HTTP/1.1 200
Connection: Keep-Alive
Content-Length: 181
Content-Type: application/jrd+json;charset=iso-8859-1
Date: Wed, 04 Jul 2018 18:42:18 GMT
Keep-Alive: timeout=5, max=100
Server: Jetty(9.4.9.v20180320)
Strict-Transport-Security: max-age=31536000; includeSubDomains
X-Content-Type-Options: nosniff
X-Xss-Protection: 1; mode=block

{
    "subject": "acct:test_user@ce-dev4.gluu.org",
    "links": [{
        "rel": "http://openid.net/specs/connect/1.0/issuer",
        "href": "https://ce-dev4.gluu.org"
    }]
}


OpenID Connect Configuration
-------------------------------------------------------
REQUEST:
-------------------------------------------------------
GET /.well-known/openid-configuration HTTP/1.1
Host: ce-dev4.gluu.org

-------------------------------------------------------
RESPONSE:
-------------------------------------------------------
HTTP/1.1 200
Connection: Keep-Alive
Content-Length: 6342
Content-Type: application/json
Date: Wed, 04 Jul 2018 18:42:18 GMT
Keep-Alive: timeout=5, max=100
Server: Jetty(9.4.9.v20180320)
Strict-Transport-Security: max-age=31536000; includeSubDomains
X-Content-Type-Options: nosniff
X-Xss-Protection: 1; mode=block

{
    "issuer": "https://ce-dev4.gluu.org",
    "authorization_endpoint": "https://ce-dev4.gluu.org/oxauth/restv1/authorize",
    "token_endpoint": "https://ce-dev4.gluu.org/oxauth/restv1/token",
    "userinfo_endpoint": "https://ce-dev4.gluu.org/oxauth/restv1/userinfo",
    "clientinfo_endpoint": "https://ce-dev4.gluu.org/oxauth/restv1/clientinfo",
    "check_session_iframe": "https://ce-dev4.gluu.org/oxauth/opiframe",
    "end_session_endpoint": "https://ce-dev4.gluu.org/oxauth/restv1/end_session",
    "jwks_uri": "https://ce-dev4.gluu.org/oxauth/restv1/jwks",
    "registration_endpoint": "https://ce-dev4.gluu.org/oxauth/restv1/register",
    "id_generation_endpoint": "https://ce-dev4.gluu.org/oxauth/restv1/id",
    "introspection_endpoint": "https://ce-dev4.gluu.org/oxauth/restv1/introspection",
    "scopes_supported": [
        "permission",
        "clientinfo",
        "email",
        "user_name",
        "sub",
        "org_name",
        "address",
        "openid",
        "test_scope1",
        "work_phone",
        "phone",
        "profile",
        "mobile_phone",
        "test"
    ],
    "response_types_supported": [
        "id_token",
        "code",
        "id_token code token",
        "id_token code",
        "code token",
        "id_token token",
        "token"
    ],
    "grant_types_supported": [
        "implicit",
        "refresh_token",
        "urn:ietf:params:oauth:grant-type:uma-ticket",
        "client_credentials",
        "authorization_code",
        "password"
    ],
    "acr_values_supported": [
        "super_gluu",
        "u2f",
        "otp",
        "basic",
        "auth_ldap_server"
    ],
    "auth_level_mapping": {
        "-1": ["auth_ldap_server"],
        "50": ["otp"],
        "100": ["basic"],
        "10": ["u2f"],
        "15": ["super_gluu"]
    },
    "subject_types_supported": [
        "public",
        "pairwise"
    ],
    "userinfo_signing_alg_values_supported": [
        "HS256",
        "HS384",
        "HS512",
        "RS256",
        "RS384",
        "RS512",
        "ES256",
        "ES384",
        "ES512"
    ],
    "userinfo_encryption_alg_values_supported": [
        "RSA1_5",
        "RSA-OAEP",
        "A128KW",
        "A256KW"
    ],
    "userinfo_encryption_enc_values_supported": [
        "RSA1_5",
        "RSA-OAEP",
        "A128KW",
        "A256KW"
    ],
    "id_token_signing_alg_values_supported": [
        "none",
        "HS256",
        "HS384",
        "HS512",
        "RS256",
        "RS384",
        "RS512",
        "ES256",
        "ES384",
        "ES512"
    ],
    "id_token_encryption_alg_values_supported": [
        "RSA1_5",
        "RSA-OAEP",
        "A128KW",
        "A256KW"
    ],
    "id_token_encryption_enc_values_supported": [
        "A128CBC+HS256",
        "A256CBC+HS512",
        "A128GCM",
        "A256GCM"
    ],
    "request_object_signing_alg_values_supported": [
        "none",
        "HS256",
        "HS384",
        "HS512",
        "RS256",
        "RS384",
        "RS512",
        "ES256",
        "ES384",
        "ES512"
    ],
    "request_object_encryption_alg_values_supported": [
        "RSA1_5",
        "RSA-OAEP",
        "A128KW",
        "A256KW"
    ],
    "request_object_encryption_enc_values_supported": [
        "A128CBC+HS256",
        "A256CBC+HS512",
        "A128GCM",
        "A256GCM"
    ],
    "token_endpoint_auth_methods_supported": [
        "client_secret_basic",
        "client_secret_post",
        "client_secret_jwt",
        "private_key_jwt"
    ],
    "token_endpoint_auth_signing_alg_values_supported": [
        "HS256",
        "HS384",
        "HS512",
        "RS256",
        "RS384",
        "RS512",
        "ES256",
        "ES384",
        "ES512"
    ],
    "display_values_supported": [
        "page",
        "popup"
    ],
    "claim_types_supported": ["normal"],
    "claims_supported": [
        "birthdate",
        "country",
        "name",
        "email",
        "email_verified",
        "given_name",
        "gender",
        "inum",
        "family_name",
        "updated_at",
        "locale",
        "member_of",
        "middle_name",
        "nickname",
        "oxAuthAppType",
        "oxAuthIdTokenSignedResponseAlg",
        "oxAuthRedirectURI",
        "oxAuthScope",
        "phone_number_verified",
        "picture",
        "preferred_username",
        "profile",
        "zoneinfo",
        "user_name",
        "website"
    ],
    "service_documentation": "http://gluu.org/docs",
    "claims_locales_supported": ["en"],
    "ui_locales_supported": [
        "en",
        "es"
    ],
    "scope_to_claims_mapping": [
        {"permission": []},
        {"uma_protection": []},
        {"clientinfo": [
            "name",
            "inum",
            "oxAuthAppType",
            "oxAuthIdTokenSignedResponseAlg",
            "oxAuthRedirectURI",
            "oxAuthScope"
        ]},
        {"email": [
            "email_verified",
            "email"
        ]},
        {"user_name": ["user_name"]},
        {"sub": []},
        {"org_name": []},
        {"address": [
            "formatted",
            "postal_code",
            "street_address",
            "locality",
            "country",
            "region"
        ]},
        {"openid": []},
        {"test_scope1": []},
        {"work_phone": []},
        {"phone": [
            "phone_number_verified",
            "phone_number"
        ]},
        {"profile": [
            "name",
            "family_name",
            "given_name",
            "middle_name",
            "nickname",
            "preferred_username",
            "profile",
            "picture",
            "website",
            "gender",
            "birthdate",
            "zoneinfo",
            "locale",
            "updated_at"
        ]},
        {"mobile_phone": ["phone_mobile_number"]},
        {"test": ["member_of"]}
    ],
    "claims_parameter_supported": true,
    "request_parameter_supported": true,
    "request_uri_parameter_supported": true,
    "require_request_uri_registration": false,
    "op_policy_uri": "http://ox.gluu.org/doku.php?id=oxauth:policy",
    "op_tos_uri": "http://ox.gluu.org/doku.php?id=oxauth:tos",
    "frontchannel_logout_supported": true,
    "frontchannel_logout_session_supported": true
}


#######################################################
TEST: OC5:FeatureTest-Verifies Correct at hash when Implicit Flow Used
#######################################################
-------------------------------------------------------
REQUEST:
-------------------------------------------------------
POST /oxauth/restv1/register HTTP/1.1
Content-Type: application/json
Accept: application/json
Host: ce-dev4.gluu.org

{
    "redirect_uris": [
        "https://ce-dev4.gluu.org/oxauth-rp/home.htm",
        "https://client.example.com/cb",
        "https://client.example.com/cb1",
        "https://client.example.com/cb2"
    ],
    "response_types": [
        "token",
        "id_token"
    ],
    "application_type": "web",
    "client_name": "oxAuth test app",
    "sector_identifier_uri": "https://ce-dev4.gluu.org/oxauth/sectoridentifier/@!38D4.410C.1D43.8932!0001!37F2.B744!0012!D426.70FD"
}

-------------------------------------------------------
RESPONSE:
-------------------------------------------------------
HTTP/1.1 200
Cache-Control: no-store
Connection: Keep-Alive
Content-Length: 1340
Content-Type: application/json
Date: Wed, 04 Jul 2018 18:42:18 GMT
Keep-Alive: timeout=5, max=100
Pragma: no-cache
Server: Jetty(9.4.9.v20180320)
Strict-Transport-Security: max-age=31536000; includeSubDomains
X-Content-Type-Options: nosniff
X-Xss-Protection: 1; mode=block

{
    "client_id": "@!38D4.410C.1D43.8932!0001!37F2.B744!0008!8603.A01E.096B.6BDD",
    "client_secret": "15ea9e34-76fc-4f55-8751-718c91491f13",
    "registration_access_token": "38d2febf-6c1a-4e41-9df5-eda85df94a8b",
    "registration_client_uri": "https://ce-dev4.gluu.org/oxauth/restv1/register?client_id=@!38D4.410C.1D43.8932!0001!37F2.B744!0008!8603.A01E.096B.6BDD",
    "client_id_issued_at": 1530729738,
    "client_secret_expires_at": 1530816138,
    "redirect_uris": [
        "https://client.example.com/cb2",
        "https://client.example.com/cb1",
        "https://client.example.com/cb",
        "https://ce-dev4.gluu.org/oxauth-rp/home.htm"
    ],
    "response_types": [
        "id_token",
        "token"
    ],
    "grant_types": ["implicit"],
    "application_type": "web",
    "client_name": "oxAuth test app",
    "sector_identifier_uri": "https://ce-dev4.gluu.org/oxauth/sectoridentifier/@!38D4.410C.1D43.8932!0001!37F2.B744!0012!D426.70FD",
    "subject_type": "pairwise",
    "id_token_signed_response_alg": "RS256",
    "token_endpoint_auth_method": "client_secret_basic",
    "require_auth_time": false,
    "frontchannel_logout_session_required": false,
    "scope": "permission uma_protection clientinfo email user_name sub org_name address openid test_scope1 work_phone phone profile test",
    "claims": ""
}

authenticateResourceOwnerAndGrantAccess: Cleaning cookies
authenticateResourceOwnerAndGrantAccess: authorizationRequestUrl:https://ce-dev4.gluu.org/oxauth/restv1/authorize?response_type=token+id_token&client_id=%40%2138D4.410C.1D43.8932%210001%2137F2.B744%210008%218603.A01E.096B.6BDD&scope=openid+profile+address+email&redirect_uri=https%3A%2F%2Fce-dev4.gluu.org%2Foxauth-rp%2Fhome.htm&state=889bc7ce-4158-43f4-b7a1-3997c922f463&nonce=5a4b4f89-3824-4029-9c7f-b4b294512097
14:42:38.322 [main] ERROR com.gargoylesoftware.htmlunit.javascript.StrictErrorReporter - runtimeError: message=[An invalid or illegal selector was specified (selector: '*,:x' error: Invalid selector: :x).] sourceName=[https://ce-dev4.gluu.org/oxauth/js/jquery-1.12.4.min.js] line=[2] lineSource=[null] lineOffset=[0]
#######################################################
TEST: OpenID Connect Discovery
#######################################################
-------------------------------------------------------
REQUEST:
-------------------------------------------------------
GET /.well-known/webfinger?resource=acct%3Atest_user%40ce-dev4.gluu.org&rel=http%3A%2F%2Fopenid.net%2Fspecs%2Fconnect%2F1.0%2Fissuer HTTP/1.1
Host: ce-dev4.gluu.org

-------------------------------------------------------
RESPONSE:
-------------------------------------------------------
HTTP/1.1 200
Connection: Keep-Alive
Content-Length: 181
Content-Type: application/jrd+json;charset=iso-8859-1
Date: Wed, 04 Jul 2018 18:42:29 GMT
Keep-Alive: timeout=5, max=100
Server: Jetty(9.4.9.v20180320)
Strict-Transport-Security: max-age=31536000; includeSubDomains
X-Content-Type-Options: nosniff
X-Xss-Protection: 1; mode=block

{
    "subject": "acct:test_user@ce-dev4.gluu.org",
    "links": [{
        "rel": "http://openid.net/specs/connect/1.0/issuer",
        "href": "https://ce-dev4.gluu.org"
    }]
}


OpenID Connect Configuration
-------------------------------------------------------
REQUEST:
-------------------------------------------------------
GET /.well-known/openid-configuration HTTP/1.1
Host: ce-dev4.gluu.org

-------------------------------------------------------
RESPONSE:
-------------------------------------------------------
HTTP/1.1 200
Connection: Keep-Alive
Content-Length: 6342
Content-Type: application/json
Date: Wed, 04 Jul 2018 18:42:29 GMT
Keep-Alive: timeout=5, max=100
Server: Jetty(9.4.9.v20180320)
Strict-Transport-Security: max-age=31536000; includeSubDomains
X-Content-Type-Options: nosniff
X-Xss-Protection: 1; mode=block

{
    "issuer": "https://ce-dev4.gluu.org",
    "authorization_endpoint": "https://ce-dev4.gluu.org/oxauth/restv1/authorize",
    "token_endpoint": "https://ce-dev4.gluu.org/oxauth/restv1/token",
    "userinfo_endpoint": "https://ce-dev4.gluu.org/oxauth/restv1/userinfo",
    "clientinfo_endpoint": "https://ce-dev4.gluu.org/oxauth/restv1/clientinfo",
    "check_session_iframe": "https://ce-dev4.gluu.org/oxauth/opiframe",
    "end_session_endpoint": "https://ce-dev4.gluu.org/oxauth/restv1/end_session",
    "jwks_uri": "https://ce-dev4.gluu.org/oxauth/restv1/jwks",
    "registration_endpoint": "https://ce-dev4.gluu.org/oxauth/restv1/register",
    "id_generation_endpoint": "https://ce-dev4.gluu.org/oxauth/restv1/id",
    "introspection_endpoint": "https://ce-dev4.gluu.org/oxauth/restv1/introspection",
    "scopes_supported": [
        "permission",
        "clientinfo",
        "email",
        "user_name",
        "sub",
        "org_name",
        "address",
        "openid",
        "test_scope1",
        "work_phone",
        "phone",
        "profile",
        "mobile_phone",
        "test"
    ],
    "response_types_supported": [
        "id_token",
        "code",
        "id_token code token",
        "id_token code",
        "code token",
        "id_token token",
        "token"
    ],
    "grant_types_supported": [
        "implicit",
        "refresh_token",
        "urn:ietf:params:oauth:grant-type:uma-ticket",
        "client_credentials",
        "authorization_code",
        "password"
    ],
    "acr_values_supported": [
        "super_gluu",
        "u2f",
        "otp",
        "basic",
        "auth_ldap_server"
    ],
    "auth_level_mapping": {
        "-1": ["auth_ldap_server"],
        "50": ["otp"],
        "100": ["basic"],
        "10": ["u2f"],
        "15": ["super_gluu"]
    },
    "subject_types_supported": [
        "public",
        "pairwise"
    ],
    "userinfo_signing_alg_values_supported": [
        "HS256",
        "HS384",
        "HS512",
        "RS256",
        "RS384",
        "RS512",
        "ES256",
        "ES384",
        "ES512"
    ],
    "userinfo_encryption_alg_values_supported": [
        "RSA1_5",
        "RSA-OAEP",
        "A128KW",
        "A256KW"
    ],
    "userinfo_encryption_enc_values_supported": [
        "RSA1_5",
        "RSA-OAEP",
        "A128KW",
        "A256KW"
    ],
    "id_token_signing_alg_values_supported": [
        "none",
        "HS256",
        "HS384",
        "HS512",
        "RS256",
        "RS384",
        "RS512",
        "ES256",
        "ES384",
        "ES512"
    ],
    "id_token_encryption_alg_values_supported": [
        "RSA1_5",
        "RSA-OAEP",
        "A128KW",
        "A256KW"
    ],
    "id_token_encryption_enc_values_supported": [
        "A128CBC+HS256",
        "A256CBC+HS512",
        "A128GCM",
        "A256GCM"
    ],
    "request_object_signing_alg_values_supported": [
        "none",
        "HS256",
        "HS384",
        "HS512",
        "RS256",
        "RS384",
        "RS512",
        "ES256",
        "ES384",
        "ES512"
    ],
    "request_object_encryption_alg_values_supported": [
        "RSA1_5",
        "RSA-OAEP",
        "A128KW",
        "A256KW"
    ],
    "request_object_encryption_enc_values_supported": [
        "A128CBC+HS256",
        "A256CBC+HS512",
        "A128GCM",
        "A256GCM"
    ],
    "token_endpoint_auth_methods_supported": [
        "client_secret_basic",
        "client_secret_post",
        "client_secret_jwt",
        "private_key_jwt"
    ],
    "token_endpoint_auth_signing_alg_values_supported": [
        "HS256",
        "HS384",
        "HS512",
        "RS256",
        "RS384",
        "RS512",
        "ES256",
        "ES384",
        "ES512"
    ],
    "display_values_supported": [
        "page",
        "popup"
    ],
    "claim_types_supported": ["normal"],
    "claims_supported": [
        "birthdate",
        "country",
        "name",
        "email",
        "email_verified",
        "given_name",
        "gender",
        "inum",
        "family_name",
        "updated_at",
        "locale",
        "member_of",
        "middle_name",
        "nickname",
        "oxAuthAppType",
        "oxAuthIdTokenSignedResponseAlg",
        "oxAuthRedirectURI",
        "oxAuthScope",
        "phone_number_verified",
        "picture",
        "preferred_username",
        "profile",
        "zoneinfo",
        "user_name",
        "website"
    ],
    "service_documentation": "http://gluu.org/docs",
    "claims_locales_supported": ["en"],
    "ui_locales_supported": [
        "en",
        "es"
    ],
    "scope_to_claims_mapping": [
        {"permission": []},
        {"uma_protection": []},
        {"clientinfo": [
            "name",
            "inum",
            "oxAuthAppType",
            "oxAuthIdTokenSignedResponseAlg",
            "oxAuthRedirectURI",
            "oxAuthScope"
        ]},
        {"email": [
            "email_verified",
            "email"
        ]},
        {"user_name": ["user_name"]},
        {"sub": []},
        {"org_name": []},
        {"address": [
            "formatted",
            "postal_code",
            "street_address",
            "locality",
            "country",
            "region"
        ]},
        {"openid": []},
        {"test_scope1": []},
        {"work_phone": []},
        {"phone": [
            "phone_number_verified",
            "phone_number"
        ]},
        {"profile": [
            "name",
            "family_name",
            "given_name",
            "middle_name",
            "nickname",
            "preferred_username",
            "profile",
            "picture",
            "website",
            "gender",
            "birthdate",
            "zoneinfo",
            "locale",
            "updated_at"
        ]},
        {"mobile_phone": ["phone_mobile_number"]},
        {"test": ["member_of"]}
    ],
    "claims_parameter_supported": true,
    "request_parameter_supported": true,
    "request_uri_parameter_supported": true,
    "require_request_uri_registration": false,
    "op_policy_uri": "http://ox.gluu.org/doku.php?id=oxauth:policy",
    "op_tos_uri": "http://ox.gluu.org/doku.php?id=oxauth:tos",
    "frontchannel_logout_supported": true,
    "frontchannel_logout_session_supported": true
}


#######################################################
TEST: OC5:FeatureTest-Verifies Correct c hash when Code Flow Used
#######################################################
-------------------------------------------------------
REQUEST:
-------------------------------------------------------
POST /oxauth/restv1/register HTTP/1.1
Content-Type: application/json
Accept: application/json
Host: ce-dev4.gluu.org

{
    "redirect_uris": [
        "https://ce-dev4.gluu.org/oxauth-rp/home.htm",
        "https://client.example.com/cb",
        "https://client.example.com/cb1",
        "https://client.example.com/cb2"
    ],
    "response_types": [
        "code",
        "id_token"
    ],
    "application_type": "web",
    "client_name": "oxAuth test app",
    "sector_identifier_uri": "https://ce-dev4.gluu.org/oxauth/sectoridentifier/@!38D4.410C.1D43.8932!0001!37F2.B744!0012!D426.70FD"
}

-------------------------------------------------------
RESPONSE:
-------------------------------------------------------
HTTP/1.1 200
Cache-Control: no-store
Connection: Keep-Alive
Content-Length: 1425
Content-Type: application/json
Date: Wed, 04 Jul 2018 18:42:29 GMT
Keep-Alive: timeout=5, max=100
Pragma: no-cache
Server: Jetty(9.4.9.v20180320)
Strict-Transport-Security: max-age=31536000; includeSubDomains
X-Content-Type-Options: nosniff
X-Xss-Protection: 1; mode=block

{
    "client_id": "@!38D4.410C.1D43.8932!0001!37F2.B744!0008!385B.AB37.CE22.2DCB",
    "client_secret": "830edc0c-12e3-475e-817c-2e352e2cfb0a",
    "registration_access_token": "87126d1f-0488-4783-9f05-35c2af64bbf8",
    "registration_client_uri": "https://ce-dev4.gluu.org/oxauth/restv1/register?client_id=@!38D4.410C.1D43.8932!0001!37F2.B744!0008!385B.AB37.CE22.2DCB",
    "client_id_issued_at": 1530729749,
    "client_secret_expires_at": 1530816149,
    "redirect_uris": [
        "https://client.example.com/cb2",
        "https://client.example.com/cb1",
        "https://client.example.com/cb",
        "https://ce-dev4.gluu.org/oxauth-rp/home.htm"
    ],
    "response_types": [
        "id_token",
        "code",
        "token"
    ],
    "grant_types": [
        "refresh_token",
        "implicit",
        "authorization_code"
    ],
    "application_type": "web",
    "client_name": "oxAuth test app",
    "sector_identifier_uri": "https://ce-dev4.gluu.org/oxauth/sectoridentifier/@!38D4.410C.1D43.8932!0001!37F2.B744!0012!D426.70FD",
    "subject_type": "pairwise",
    "id_token_signed_response_alg": "RS256",
    "token_endpoint_auth_method": "client_secret_basic",
    "require_auth_time": false,
    "frontchannel_logout_session_required": false,
    "scope": "permission uma_protection clientinfo email user_name sub org_name address openid test_scope1 work_phone phone profile test",
    "claims": ""
}

authenticateResourceOwnerAndGrantAccess: Cleaning cookies
authenticateResourceOwnerAndGrantAccess: authorizationRequestUrl:https://ce-dev4.gluu.org/oxauth/restv1/authorize?response_type=code+id_token&client_id=%40%2138D4.410C.1D43.8932%210001%2137F2.B744%210008%21385B.AB37.CE22.2DCB&scope=openid+profile+address+email&redirect_uri=https%3A%2F%2Fce-dev4.gluu.org%2Foxauth-rp%2Fhome.htm&state=365ce616-b553-4003-b170-8f51fcb26c3b&nonce=f41aefd7-6616-4c85-a6cb-a2ccd528981b
14:42:49.360 [main] ERROR com.gargoylesoftware.htmlunit.javascript.StrictErrorReporter - runtimeError: message=[An invalid or illegal selector was specified (selector: '*,:x' error: Invalid selector: :x).] sourceName=[https://ce-dev4.gluu.org/oxauth/js/jquery-1.12.4.min.js] line=[2] lineSource=[null] lineOffset=[0]
authenticateResourceOwnerAndGrantAccess: sessionState:cd1e8111-7be1-435d-9025-7edd3bea8afe
-------------------------------------------------------
REQUEST:
-------------------------------------------------------
https://ce-dev4.gluu.org/oxauth/restv1/authorize?response_type=code+id_token&client_id=%40%2138D4.410C.1D43.8932%210001%2137F2.B744%210008%21385B.AB37.CE22.2DCB&scope=openid+profile+address+email&redirect_uri=https%3A%2F%2Fce-dev4.gluu.org%2Foxauth-rp%2Fhome.htm&state=365ce616-b553-4003-b170-8f51fcb26c3b&nonce=f41aefd7-6616-4c85-a6cb-a2ccd528981b

-------------------------------------------------------
RESPONSE:
-------------------------------------------------------
HTTP/1.1 302 Found
Location: https://ce-dev4.gluu.org/oxauth-rp/home.htm#code=cdcd3233-2225-41b3-9f4c-e6e65bffd755&scope=address+openid+profile+email&id_token=eyJraWQiOiI4NzE2OGJjMS1lNTU4LTQxNjktOGRkMS05ZmJkNDUxZGU1ZDciLCJ0eXAiOiJKV1QiLCJhbGciOiJSUzI1NiJ9.eyJpc3MiOiJodHRwczovL2NlLWRldjQuZ2x1dS5vcmciLCJhdWQiOiJAITM4RDQuNDEwQy4xRDQzLjg5MzIhMDAwMSEzN0YyLkI3NDQhMDAwOCEzODVCLkFCMzcuQ0UyMi4yRENCIiwiZXhwIjoxNTMwNzMzMzUwLCJpYXQiOjE1MzA3Mjk3NTAsIm5vbmNlIjoiZjQxYWVmZDctNjYxNi00Yzg1LWE2Y2ItYTJjY2Q1Mjg5ODFiIiwiYXV0aF90aW1lIjoxNTMwNzI5NzUwLCJjX2hhc2giOiJHeWZDa1FRT3NyZ19Vb1BWeG1Cd2h3Iiwib3hPcGVuSURDb25uZWN0VmVyc2lvbiI6Im9wZW5pZGNvbm5lY3QtMS4wIiwic3ViIjoiYmJ4Q0l6aDl6c2d1Skc5Yk42ZEpiN0lQMGRlWFBJem5sY3Nsd2M0YS1zOCJ9.YaA_RMz_SC8b1a1IIMzobb34IkmkkB-GL_uSUl8dy8APt8lsAIGb5TGDsbLmYgcplMetn21FYU7Dwn54Xd_1BZRfijx-gNZzHA_eQao8jObSjj-hppXjh12Ua9zeaVc0r9I2ccI0vUAS9otIhLYClzSWhTlbczV36QvS3Btmp9Kq6nRtiNY0DH2rZKC313NcRglocJYxf3zovDXxKxabaULyUfM7IWrnjsaSoW4WX1c_xnrzA3k9FHLwjHYVHejv_WP0svpMdv18Uekfdz5lEmJ80akG8vzBzQ5I2D4YX_XhizrXTHb3QGI4v9GpR5PybuIFC5HhPKTewtAMmuPiIg&session_id=031a673a-6fae-4051-a25b-b2f9622d87a4&state=365ce616-b553-4003-b170-8f51fcb26c3b&session_state=cd1e8111-7be1-435d-9025-7edd3bea8afe

Tests run: 680, Failures: 19, Errors: 0, Skipped: 1, Time elapsed: 745.007 sec <<< FAILURE! - in TestSuite
authorizationRequestObjectWithMultivaluedClaimAlgA128KWEncA128GCM(org.xdi.oxauth.ws.rs.MultivaluedClaims)  Time elapsed: 1.132 sec  <<< FAILURE!
java.lang.AssertionError: expected [true] but found [false]
	at org.testng.Assert.fail(Assert.java:93)
	at org.testng.Assert.failNotEquals(Assert.java:512)
	at org.testng.Assert.assertTrue(Assert.java:41)
	at org.testng.Assert.assertTrue(Assert.java:51)
	at org.xdi.oxauth.ws.rs.MultivaluedClaims.authorizationRequestObjectWithMultivaluedClaimAlgA128KWEncA128GCM(MultivaluedClaims.java:2470)
	at sun.reflect.NativeMethodAccessorImpl.invoke0(Native Method)
	at sun.reflect.NativeMethodAccessorImpl.invoke(NativeMethodAccessorImpl.java:62)
	at sun.reflect.DelegatingMethodAccessorImpl.invoke(DelegatingMethodAccessorImpl.java:43)
	at java.lang.reflect.Method.invoke(Method.java:498)
	at org.testng.internal.MethodInvocationHelper.invokeMethod(MethodInvocationHelper.java:108)
	at org.testng.internal.Invoker.invokeMethod(Invoker.java:661)
	at org.testng.internal.Invoker.invokeTestMethod(Invoker.java:869)
	at org.testng.internal.Invoker.invokeTestMethods(Invoker.java:1193)
	at org.testng.internal.TestMethodWorker.invokeTestMethods(TestMethodWorker.java:126)
	at org.testng.internal.TestMethodWorker.run(TestMethodWorker.java:109)
	at org.testng.TestRunner.privateRun(TestRunner.java:744)
	at org.testng.TestRunner.run(TestRunner.java:602)
	at org.testng.SuiteRunner.runTest(SuiteRunner.java:380)
	at org.testng.SuiteRunner.runSequentially(SuiteRunner.java:375)
	at org.testng.SuiteRunner.privateRun(SuiteRunner.java:340)
	at org.testng.SuiteRunner.run(SuiteRunner.java:289)
	at org.testng.SuiteRunnerWorker.runSuite(SuiteRunnerWorker.java:52)
	at org.testng.SuiteRunnerWorker.run(SuiteRunnerWorker.java:86)
	at org.testng.TestNG.runSuitesSequentially(TestNG.java:1301)
	at org.testng.TestNG.runSuitesLocally(TestNG.java:1226)
	at org.testng.TestNG.runSuites(TestNG.java:1144)
	at org.testng.TestNG.run(TestNG.java:1115)
	at org.apache.maven.surefire.testng.TestNGExecutor.run(TestNGExecutor.java:281)
	at org.apache.maven.surefire.testng.TestNGXmlTestSuite.execute(TestNGXmlTestSuite.java:75)
	at org.apache.maven.surefire.testng.TestNGProvider.invoke(TestNGProvider.java:121)
	at org.apache.maven.surefire.booter.ForkedBooter.invokeProviderInSameClassLoader(ForkedBooter.java:290)
	at org.apache.maven.surefire.booter.ForkedBooter.runSuitesInProcess(ForkedBooter.java:242)
	at org.apache.maven.surefire.booter.ForkedBooter.main(ForkedBooter.java:121)

authorizationRequestObjectWithMultivaluedClaimAlgA256KWEncA256GCM(org.xdi.oxauth.ws.rs.MultivaluedClaims)  Time elapsed: 1.025 sec  <<< FAILURE!
java.lang.AssertionError: expected [true] but found [false]
	at org.testng.Assert.fail(Assert.java:93)
	at org.testng.Assert.failNotEquals(Assert.java:512)
	at org.testng.Assert.assertTrue(Assert.java:41)
	at org.testng.Assert.assertTrue(Assert.java:51)
	at org.xdi.oxauth.ws.rs.MultivaluedClaims.authorizationRequestObjectWithMultivaluedClaimAlgA256KWEncA256GCM(MultivaluedClaims.java:2568)
	at sun.reflect.NativeMethodAccessorImpl.invoke0(Native Method)
	at sun.reflect.NativeMethodAccessorImpl.invoke(NativeMethodAccessorImpl.java:62)
	at sun.reflect.DelegatingMethodAccessorImpl.invoke(DelegatingMethodAccessorImpl.java:43)
	at java.lang.reflect.Method.invoke(Method.java:498)
	at org.testng.internal.MethodInvocationHelper.invokeMethod(MethodInvocationHelper.java:108)
	at org.testng.internal.Invoker.invokeMethod(Invoker.java:661)
	at org.testng.internal.Invoker.invokeTestMethod(Invoker.java:869)
	at org.testng.internal.Invoker.invokeTestMethods(Invoker.java:1193)
	at org.testng.internal.TestMethodWorker.invokeTestMethods(TestMethodWorker.java:126)
	at org.testng.internal.TestMethodWorker.run(TestMethodWorker.java:109)
	at org.testng.TestRunner.privateRun(TestRunner.java:744)
	at org.testng.TestRunner.run(TestRunner.java:602)
	at org.testng.SuiteRunner.runTest(SuiteRunner.java:380)
	at org.testng.SuiteRunner.runSequentially(SuiteRunner.java:375)
	at org.testng.SuiteRunner.privateRun(SuiteRunner.java:340)
	at org.testng.SuiteRunner.run(SuiteRunner.java:289)
	at org.testng.SuiteRunnerWorker.runSuite(SuiteRunnerWorker.java:52)
	at org.testng.SuiteRunnerWorker.run(SuiteRunnerWorker.java:86)
	at org.testng.TestNG.runSuitesSequentially(TestNG.java:1301)
	at org.testng.TestNG.runSuitesLocally(TestNG.java:1226)
	at org.testng.TestNG.runSuites(TestNG.java:1144)
	at org.testng.TestNG.run(TestNG.java:1115)
	at org.apache.maven.surefire.testng.TestNGExecutor.run(TestNGExecutor.java:281)
	at org.apache.maven.surefire.testng.TestNGXmlTestSuite.execute(TestNGXmlTestSuite.java:75)
	at org.apache.maven.surefire.testng.TestNGProvider.invoke(TestNGProvider.java:121)
	at org.apache.maven.surefire.booter.ForkedBooter.invokeProviderInSameClassLoader(ForkedBooter.java:290)
	at org.apache.maven.surefire.booter.ForkedBooter.runSuitesInProcess(ForkedBooter.java:242)
	at org.apache.maven.surefire.booter.ForkedBooter.main(ForkedBooter.java:121)

authorizationRequestObjectWithMultivaluedClaimAlgRSA15EncA128CBCPLUSHS256(org.xdi.oxauth.ws.rs.MultivaluedClaims)  Time elapsed: 1.323 sec  <<< FAILURE!
java.lang.AssertionError: expected [true] but found [false]
	at org.testng.Assert.fail(Assert.java:93)
	at org.testng.Assert.failNotEquals(Assert.java:512)
	at org.testng.Assert.assertTrue(Assert.java:41)
	at org.testng.Assert.assertTrue(Assert.java:51)
	at org.xdi.oxauth.ws.rs.MultivaluedClaims.authorizationRequestObjectWithMultivaluedClaimAlgRSA15EncA128CBCPLUSHS256(MultivaluedClaims.java:2678)
	at sun.reflect.NativeMethodAccessorImpl.invoke0(Native Method)
	at sun.reflect.NativeMethodAccessorImpl.invoke(NativeMethodAccessorImpl.java:62)
	at sun.reflect.DelegatingMethodAccessorImpl.invoke(DelegatingMethodAccessorImpl.java:43)
	at java.lang.reflect.Method.invoke(Method.java:498)
	at org.testng.internal.MethodInvocationHelper.invokeMethod(MethodInvocationHelper.java:108)
	at org.testng.internal.Invoker.invokeMethod(Invoker.java:661)
	at org.testng.internal.Invoker.invokeTestMethod(Invoker.java:869)
	at org.testng.internal.Invoker.invokeTestMethods(Invoker.java:1193)
	at org.testng.internal.TestMethodWorker.invokeTestMethods(TestMethodWorker.java:126)
	at org.testng.internal.TestMethodWorker.run(TestMethodWorker.java:109)
	at org.testng.TestRunner.privateRun(TestRunner.java:744)
	at org.testng.TestRunner.run(TestRunner.java:602)
	at org.testng.SuiteRunner.runTest(SuiteRunner.java:380)
	at org.testng.SuiteRunner.runSequentially(SuiteRunner.java:375)
	at org.testng.SuiteRunner.privateRun(SuiteRunner.java:340)
	at org.testng.SuiteRunner.run(SuiteRunner.java:289)
	at org.testng.SuiteRunnerWorker.runSuite(SuiteRunnerWorker.java:52)
	at org.testng.SuiteRunnerWorker.run(SuiteRunnerWorker.java:86)
	at org.testng.TestNG.runSuitesSequentially(TestNG.java:1301)
	at org.testng.TestNG.runSuitesLocally(TestNG.java:1226)
	at org.testng.TestNG.runSuites(TestNG.java:1144)
	at org.testng.TestNG.run(TestNG.java:1115)
	at org.apache.maven.surefire.testng.TestNGExecutor.run(TestNGExecutor.java:281)
	at org.apache.maven.surefire.testng.TestNGXmlTestSuite.execute(TestNGXmlTestSuite.java:75)
	at org.apache.maven.surefire.testng.TestNGProvider.invoke(TestNGProvider.java:121)
	at org.apache.maven.surefire.booter.ForkedBooter.invokeProviderInSameClassLoader(ForkedBooter.java:290)
	at org.apache.maven.surefire.booter.ForkedBooter.runSuitesInProcess(ForkedBooter.java:242)
	at org.apache.maven.surefire.booter.ForkedBooter.main(ForkedBooter.java:121)

authorizationRequestObjectWithMultivaluedClaimAlgRSA15EncA256CBCPLUSHS512(org.xdi.oxauth.ws.rs.MultivaluedClaims)  Time elapsed: 1.291 sec  <<< FAILURE!
java.lang.AssertionError: expected [true] but found [false]
	at org.testng.Assert.fail(Assert.java:93)
	at org.testng.Assert.failNotEquals(Assert.java:512)
	at org.testng.Assert.assertTrue(Assert.java:41)
	at org.testng.Assert.assertTrue(Assert.java:51)
	at org.xdi.oxauth.ws.rs.MultivaluedClaims.authorizationRequestObjectWithMultivaluedClaimAlgRSA15EncA256CBCPLUSHS512(MultivaluedClaims.java:2788)
	at sun.reflect.NativeMethodAccessorImpl.invoke0(Native Method)
	at sun.reflect.NativeMethodAccessorImpl.invoke(NativeMethodAccessorImpl.java:62)
	at sun.reflect.DelegatingMethodAccessorImpl.invoke(DelegatingMethodAccessorImpl.java:43)
	at java.lang.reflect.Method.invoke(Method.java:498)
	at org.testng.internal.MethodInvocationHelper.invokeMethod(MethodInvocationHelper.java:108)
	at org.testng.internal.Invoker.invokeMethod(Invoker.java:661)
	at org.testng.internal.Invoker.invokeTestMethod(Invoker.java:869)
	at org.testng.internal.Invoker.invokeTestMethods(Invoker.java:1193)
	at org.testng.internal.TestMethodWorker.invokeTestMethods(TestMethodWorker.java:126)
	at org.testng.internal.TestMethodWorker.run(TestMethodWorker.java:109)
	at org.testng.TestRunner.privateRun(TestRunner.java:744)
	at org.testng.TestRunner.run(TestRunner.java:602)
	at org.testng.SuiteRunner.runTest(SuiteRunner.java:380)
	at org.testng.SuiteRunner.runSequentially(SuiteRunner.java:375)
	at org.testng.SuiteRunner.privateRun(SuiteRunner.java:340)
	at org.testng.SuiteRunner.run(SuiteRunner.java:289)
	at org.testng.SuiteRunnerWorker.runSuite(SuiteRunnerWorker.java:52)
	at org.testng.SuiteRunnerWorker.run(SuiteRunnerWorker.java:86)
	at org.testng.TestNG.runSuitesSequentially(TestNG.java:1301)
	at org.testng.TestNG.runSuitesLocally(TestNG.java:1226)
	at org.testng.TestNG.runSuites(TestNG.java:1144)
	at org.testng.TestNG.run(TestNG.java:1115)
	at org.apache.maven.surefire.testng.TestNGExecutor.run(TestNGExecutor.java:281)
	at org.apache.maven.surefire.testng.TestNGXmlTestSuite.execute(TestNGXmlTestSuite.java:75)
	at org.apache.maven.surefire.testng.TestNGProvider.invoke(TestNGProvider.java:121)
	at org.apache.maven.surefire.booter.ForkedBooter.invokeProviderInSameClassLoader(ForkedBooter.java:290)
	at org.apache.maven.surefire.booter.ForkedBooter.runSuitesInProcess(ForkedBooter.java:242)
	at org.apache.maven.surefire.booter.ForkedBooter.main(ForkedBooter.java:121)

authorizationRequestObjectWithMultivaluedClaimAlgRSAOAEPEncA256GCM(org.xdi.oxauth.ws.rs.MultivaluedClaims)  Time elapsed: 1.337 sec  <<< FAILURE!
java.lang.AssertionError: expected [true] but found [false]
	at org.testng.Assert.fail(Assert.java:93)
	at org.testng.Assert.failNotEquals(Assert.java:512)
	at org.testng.Assert.assertTrue(Assert.java:41)
	at org.testng.Assert.assertTrue(Assert.java:51)
	at org.xdi.oxauth.ws.rs.MultivaluedClaims.authorizationRequestObjectWithMultivaluedClaimAlgRSAOAEPEncA256GCM(MultivaluedClaims.java:2898)
	at sun.reflect.NativeMethodAccessorImpl.invoke0(Native Method)
	at sun.reflect.NativeMethodAccessorImpl.invoke(NativeMethodAccessorImpl.java:62)
	at sun.reflect.DelegatingMethodAccessorImpl.invoke(DelegatingMethodAccessorImpl.java:43)
	at java.lang.reflect.Method.invoke(Method.java:498)
	at org.testng.internal.MethodInvocationHelper.invokeMethod(MethodInvocationHelper.java:108)
	at org.testng.internal.Invoker.invokeMethod(Invoker.java:661)
	at org.testng.internal.Invoker.invokeTestMethod(Invoker.java:869)
	at org.testng.internal.Invoker.invokeTestMethods(Invoker.java:1193)
	at org.testng.internal.TestMethodWorker.invokeTestMethods(TestMethodWorker.java:126)
	at org.testng.internal.TestMethodWorker.run(TestMethodWorker.java:109)
	at org.testng.TestRunner.privateRun(TestRunner.java:744)
	at org.testng.TestRunner.run(TestRunner.java:602)
	at org.testng.SuiteRunner.runTest(SuiteRunner.java:380)
	at org.testng.SuiteRunner.runSequentially(SuiteRunner.java:375)
	at org.testng.SuiteRunner.privateRun(SuiteRunner.java:340)
	at org.testng.SuiteRunner.run(SuiteRunner.java:289)
	at org.testng.SuiteRunnerWorker.runSuite(SuiteRunnerWorker.java:52)
	at org.testng.SuiteRunnerWorker.run(SuiteRunnerWorker.java:86)
	at org.testng.TestNG.runSuitesSequentially(TestNG.java:1301)
	at org.testng.TestNG.runSuitesLocally(TestNG.java:1226)
	at org.testng.TestNG.runSuites(TestNG.java:1144)
	at org.testng.TestNG.run(TestNG.java:1115)
	at org.apache.maven.surefire.testng.TestNGExecutor.run(TestNGExecutor.java:281)
	at org.apache.maven.surefire.testng.TestNGXmlTestSuite.execute(TestNGXmlTestSuite.java:75)
	at org.apache.maven.surefire.testng.TestNGProvider.invoke(TestNGProvider.java:121)
	at org.apache.maven.surefire.booter.ForkedBooter.invokeProviderInSameClassLoader(ForkedBooter.java:290)
	at org.apache.maven.surefire.booter.ForkedBooter.runSuitesInProcess(ForkedBooter.java:242)
	at org.apache.maven.surefire.booter.ForkedBooter.main(ForkedBooter.java:121)

authorizationRequestObjectWithMultivaluedClaimES256(org.xdi.oxauth.ws.rs.MultivaluedClaims)  Time elapsed: 1.266 sec  <<< FAILURE!
java.lang.AssertionError: expected [true] but found [false]
	at org.testng.Assert.fail(Assert.java:93)
	at org.testng.Assert.failNotEquals(Assert.java:512)
	at org.testng.Assert.assertTrue(Assert.java:41)
	at org.testng.Assert.assertTrue(Assert.java:51)
	at org.xdi.oxauth.ws.rs.MultivaluedClaims.authorizationRequestObjectWithMultivaluedClaimES256(MultivaluedClaims.java:2159)
	at sun.reflect.NativeMethodAccessorImpl.invoke0(Native Method)
	at sun.reflect.NativeMethodAccessorImpl.invoke(NativeMethodAccessorImpl.java:62)
	at sun.reflect.DelegatingMethodAccessorImpl.invoke(DelegatingMethodAccessorImpl.java:43)
	at java.lang.reflect.Method.invoke(Method.java:498)
	at org.testng.internal.MethodInvocationHelper.invokeMethod(MethodInvocationHelper.java:108)
	at org.testng.internal.Invoker.invokeMethod(Invoker.java:661)
	at org.testng.internal.Invoker.invokeTestMethod(Invoker.java:869)
	at org.testng.internal.Invoker.invokeTestMethods(Invoker.java:1193)
	at org.testng.internal.TestMethodWorker.invokeTestMethods(TestMethodWorker.java:126)
	at org.testng.internal.TestMethodWorker.run(TestMethodWorker.java:109)
	at org.testng.TestRunner.privateRun(TestRunner.java:744)
	at org.testng.TestRunner.run(TestRunner.java:602)
	at org.testng.SuiteRunner.runTest(SuiteRunner.java:380)
	at org.testng.SuiteRunner.runSequentially(SuiteRunner.java:375)
	at org.testng.SuiteRunner.privateRun(SuiteRunner.java:340)
	at org.testng.SuiteRunner.run(SuiteRunner.java:289)
	at org.testng.SuiteRunnerWorker.runSuite(SuiteRunnerWorker.java:52)
	at org.testng.SuiteRunnerWorker.run(SuiteRunnerWorker.java:86)
	at org.testng.TestNG.runSuitesSequentially(TestNG.java:1301)
	at org.testng.TestNG.runSuitesLocally(TestNG.java:1226)
	at org.testng.TestNG.runSuites(TestNG.java:1144)
	at org.testng.TestNG.run(TestNG.java:1115)
	at org.apache.maven.surefire.testng.TestNGExecutor.run(TestNGExecutor.java:281)
	at org.apache.maven.surefire.testng.TestNGXmlTestSuite.execute(TestNGXmlTestSuite.java:75)
	at org.apache.maven.surefire.testng.TestNGProvider.invoke(TestNGProvider.java:121)
	at org.apache.maven.surefire.booter.ForkedBooter.invokeProviderInSameClassLoader(ForkedBooter.java:290)
	at org.apache.maven.surefire.booter.ForkedBooter.runSuitesInProcess(ForkedBooter.java:242)
	at org.apache.maven.surefire.booter.ForkedBooter.main(ForkedBooter.java:121)

authorizationRequestObjectWithMultivaluedClaimES384(org.xdi.oxauth.ws.rs.MultivaluedClaims)  Time elapsed: 1.25 sec  <<< FAILURE!
java.lang.AssertionError: expected [true] but found [false]
	at org.testng.Assert.fail(Assert.java:93)
	at org.testng.Assert.failNotEquals(Assert.java:512)
	at org.testng.Assert.assertTrue(Assert.java:41)
	at org.testng.Assert.assertTrue(Assert.java:51)
	at org.xdi.oxauth.ws.rs.MultivaluedClaims.authorizationRequestObjectWithMultivaluedClaimES384(MultivaluedClaims.java:2262)
	at sun.reflect.NativeMethodAccessorImpl.invoke0(Native Method)
	at sun.reflect.NativeMethodAccessorImpl.invoke(NativeMethodAccessorImpl.java:62)
	at sun.reflect.DelegatingMethodAccessorImpl.invoke(DelegatingMethodAccessorImpl.java:43)
	at java.lang.reflect.Method.invoke(Method.java:498)
	at org.testng.internal.MethodInvocationHelper.invokeMethod(MethodInvocationHelper.java:108)
	at org.testng.internal.Invoker.invokeMethod(Invoker.java:661)
	at org.testng.internal.Invoker.invokeTestMethod(Invoker.java:869)
	at org.testng.internal.Invoker.invokeTestMethods(Invoker.java:1193)
	at org.testng.internal.TestMethodWorker.invokeTestMethods(TestMethodWorker.java:126)
	at org.testng.internal.TestMethodWorker.run(TestMethodWorker.java:109)
	at org.testng.TestRunner.privateRun(TestRunner.java:744)
	at org.testng.TestRunner.run(TestRunner.java:602)
	at org.testng.SuiteRunner.runTest(SuiteRunner.java:380)
	at org.testng.SuiteRunner.runSequentially(SuiteRunner.java:375)
	at org.testng.SuiteRunner.privateRun(SuiteRunner.java:340)
	at org.testng.SuiteRunner.run(SuiteRunner.java:289)
	at org.testng.SuiteRunnerWorker.runSuite(SuiteRunnerWorker.java:52)
	at org.testng.SuiteRunnerWorker.run(SuiteRunnerWorker.java:86)
	at org.testng.TestNG.runSuitesSequentially(TestNG.java:1301)
	at org.testng.TestNG.runSuitesLocally(TestNG.java:1226)
	at org.testng.TestNG.runSuites(TestNG.java:1144)
	at org.testng.TestNG.run(TestNG.java:1115)
	at org.apache.maven.surefire.testng.TestNGExecutor.run(TestNGExecutor.java:281)
	at org.apache.maven.surefire.testng.TestNGXmlTestSuite.execute(TestNGXmlTestSuite.java:75)
	at org.apache.maven.surefire.testng.TestNGProvider.invoke(TestNGProvider.java:121)
	at org.apache.maven.surefire.booter.ForkedBooter.invokeProviderInSameClassLoader(ForkedBooter.java:290)
	at org.apache.maven.surefire.booter.ForkedBooter.runSuitesInProcess(ForkedBooter.java:242)
	at org.apache.maven.surefire.booter.ForkedBooter.main(ForkedBooter.java:121)

authorizationRequestObjectWithMultivaluedClaimES512(org.xdi.oxauth.ws.rs.MultivaluedClaims)  Time elapsed: 1.233 sec  <<< FAILURE!
java.lang.AssertionError: expected [true] but found [false]
	at org.testng.Assert.fail(Assert.java:93)
	at org.testng.Assert.failNotEquals(Assert.java:512)
	at org.testng.Assert.assertTrue(Assert.java:41)
	at org.testng.Assert.assertTrue(Assert.java:51)
	at org.xdi.oxauth.ws.rs.MultivaluedClaims.authorizationRequestObjectWithMultivaluedClaimES512(MultivaluedClaims.java:2365)
	at sun.reflect.NativeMethodAccessorImpl.invoke0(Native Method)
	at sun.reflect.NativeMethodAccessorImpl.invoke(NativeMethodAccessorImpl.java:62)
	at sun.reflect.DelegatingMethodAccessorImpl.invoke(DelegatingMethodAccessorImpl.java:43)
	at java.lang.reflect.Method.invoke(Method.java:498)
	at org.testng.internal.MethodInvocationHelper.invokeMethod(MethodInvocationHelper.java:108)
	at org.testng.internal.Invoker.invokeMethod(Invoker.java:661)
	at org.testng.internal.Invoker.invokeTestMethod(Invoker.java:869)
	at org.testng.internal.Invoker.invokeTestMethods(Invoker.java:1193)
	at org.testng.internal.TestMethodWorker.invokeTestMethods(TestMethodWorker.java:126)
	at org.testng.internal.TestMethodWorker.run(TestMethodWorker.java:109)
	at org.testng.TestRunner.privateRun(TestRunner.java:744)
	at org.testng.TestRunner.run(TestRunner.java:602)
	at org.testng.SuiteRunner.runTest(SuiteRunner.java:380)
	at org.testng.SuiteRunner.runSequentially(SuiteRunner.java:375)
	at org.testng.SuiteRunner.privateRun(SuiteRunner.java:340)
	at org.testng.SuiteRunner.run(SuiteRunner.java:289)
	at org.testng.SuiteRunnerWorker.runSuite(SuiteRunnerWorker.java:52)
	at org.testng.SuiteRunnerWorker.run(SuiteRunnerWorker.java:86)
	at org.testng.TestNG.runSuitesSequentially(TestNG.java:1301)
	at org.testng.TestNG.runSuitesLocally(TestNG.java:1226)
	at org.testng.TestNG.runSuites(TestNG.java:1144)
	at org.testng.TestNG.run(TestNG.java:1115)
	at org.apache.maven.surefire.testng.TestNGExecutor.run(TestNGExecutor.java:281)
	at org.apache.maven.surefire.testng.TestNGXmlTestSuite.execute(TestNGXmlTestSuite.java:75)
	at org.apache.maven.surefire.testng.TestNGProvider.invoke(TestNGProvider.java:121)
	at org.apache.maven.surefire.booter.ForkedBooter.invokeProviderInSameClassLoader(ForkedBooter.java:290)
	at org.apache.maven.surefire.booter.ForkedBooter.runSuitesInProcess(ForkedBooter.java:242)
	at org.apache.maven.surefire.booter.ForkedBooter.main(ForkedBooter.java:121)

authorizationRequestObjectWithMultivaluedClaimHS256(org.xdi.oxauth.ws.rs.MultivaluedClaims)  Time elapsed: 1.188 sec  <<< FAILURE!
java.lang.AssertionError: expected [true] but found [false]
	at org.testng.Assert.fail(Assert.java:93)
	at org.testng.Assert.failNotEquals(Assert.java:512)
	at org.testng.Assert.assertTrue(Assert.java:41)
	at org.testng.Assert.assertTrue(Assert.java:51)
	at org.xdi.oxauth.ws.rs.MultivaluedClaims.authorizationRequestObjectWithMultivaluedClaimHS256(MultivaluedClaims.java:1557)
	at sun.reflect.NativeMethodAccessorImpl.invoke0(Native Method)
	at sun.reflect.NativeMethodAccessorImpl.invoke(NativeMethodAccessorImpl.java:62)
	at sun.reflect.DelegatingMethodAccessorImpl.invoke(DelegatingMethodAccessorImpl.java:43)
	at java.lang.reflect.Method.invoke(Method.java:498)
	at org.testng.internal.MethodInvocationHelper.invokeMethod(MethodInvocationHelper.java:108)
	at org.testng.internal.Invoker.invokeMethod(Invoker.java:661)
	at org.testng.internal.Invoker.invokeTestMethod(Invoker.java:869)
	at org.testng.internal.Invoker.invokeTestMethods(Invoker.java:1193)
	at org.testng.internal.TestMethodWorker.invokeTestMethods(TestMethodWorker.java:126)
	at org.testng.internal.TestMethodWorker.run(TestMethodWorker.java:109)
	at org.testng.TestRunner.privateRun(TestRunner.java:744)
	at org.testng.TestRunner.run(TestRunner.java:602)
	at org.testng.SuiteRunner.runTest(SuiteRunner.java:380)
	at org.testng.SuiteRunner.runSequentially(SuiteRunner.java:375)
	at org.testng.SuiteRunner.privateRun(SuiteRunner.java:340)
	at org.testng.SuiteRunner.run(SuiteRunner.java:289)
	at org.testng.SuiteRunnerWorker.runSuite(SuiteRunnerWorker.java:52)
	at org.testng.SuiteRunnerWorker.run(SuiteRunnerWorker.java:86)
	at org.testng.TestNG.runSuitesSequentially(TestNG.java:1301)
	at org.testng.TestNG.runSuitesLocally(TestNG.java:1226)
	at org.testng.TestNG.runSuites(TestNG.java:1144)
	at org.testng.TestNG.run(TestNG.java:1115)
	at org.apache.maven.surefire.testng.TestNGExecutor.run(TestNGExecutor.java:281)
	at org.apache.maven.surefire.testng.TestNGXmlTestSuite.execute(TestNGXmlTestSuite.java:75)
	at org.apache.maven.surefire.testng.TestNGProvider.invoke(TestNGProvider.java:121)
	at org.apache.maven.surefire.booter.ForkedBooter.invokeProviderInSameClassLoader(ForkedBooter.java:290)
	at org.apache.maven.surefire.booter.ForkedBooter.runSuitesInProcess(ForkedBooter.java:242)
	at org.apache.maven.surefire.booter.ForkedBooter.main(ForkedBooter.java:121)

authorizationRequestObjectWithMultivaluedClaimHS384(org.xdi.oxauth.ws.rs.MultivaluedClaims)  Time elapsed: 1.098 sec  <<< FAILURE!
java.lang.AssertionError: expected [true] but found [false]
	at org.testng.Assert.fail(Assert.java:93)
	at org.testng.Assert.failNotEquals(Assert.java:512)
	at org.testng.Assert.assertTrue(Assert.java:41)
	at org.testng.Assert.assertTrue(Assert.java:51)
	at org.xdi.oxauth.ws.rs.MultivaluedClaims.authorizationRequestObjectWithMultivaluedClaimHS384(MultivaluedClaims.java:1654)
	at sun.reflect.NativeMethodAccessorImpl.invoke0(Native Method)
	at sun.reflect.NativeMethodAccessorImpl.invoke(NativeMethodAccessorImpl.java:62)
	at sun.reflect.DelegatingMethodAccessorImpl.invoke(DelegatingMethodAccessorImpl.java:43)
	at java.lang.reflect.Method.invoke(Method.java:498)
	at org.testng.internal.MethodInvocationHelper.invokeMethod(MethodInvocationHelper.java:108)
	at org.testng.internal.Invoker.invokeMethod(Invoker.java:661)
	at org.testng.internal.Invoker.invokeTestMethod(Invoker.java:869)
	at org.testng.internal.Invoker.invokeTestMethods(Invoker.java:1193)
	at org.testng.internal.TestMethodWorker.invokeTestMethods(TestMethodWorker.java:126)
	at org.testng.internal.TestMethodWorker.run(TestMethodWorker.java:109)
	at org.testng.TestRunner.privateRun(TestRunner.java:744)
	at org.testng.TestRunner.run(TestRunner.java:602)
	at org.testng.SuiteRunner.runTest(SuiteRunner.java:380)
	at org.testng.SuiteRunner.runSequentially(SuiteRunner.java:375)
	at org.testng.SuiteRunner.privateRun(SuiteRunner.java:340)
	at org.testng.SuiteRunner.run(SuiteRunner.java:289)
	at org.testng.SuiteRunnerWorker.runSuite(SuiteRunnerWorker.java:52)
	at org.testng.SuiteRunnerWorker.run(SuiteRunnerWorker.java:86)
	at org.testng.TestNG.runSuitesSequentially(TestNG.java:1301)
	at org.testng.TestNG.runSuitesLocally(TestNG.java:1226)
	at org.testng.TestNG.runSuites(TestNG.java:1144)
	at org.testng.TestNG.run(TestNG.java:1115)
	at org.apache.maven.surefire.testng.TestNGExecutor.run(TestNGExecutor.java:281)
	at org.apache.maven.surefire.testng.TestNGXmlTestSuite.execute(TestNGXmlTestSuite.java:75)
	at org.apache.maven.surefire.testng.TestNGProvider.invoke(TestNGProvider.java:121)
	at org.apache.maven.surefire.booter.ForkedBooter.invokeProviderInSameClassLoader(ForkedBooter.java:290)
	at org.apache.maven.surefire.booter.ForkedBooter.runSuitesInProcess(ForkedBooter.java:242)
	at org.apache.maven.surefire.booter.ForkedBooter.main(ForkedBooter.java:121)

authorizationRequestObjectWithMultivaluedClaimHS512(org.xdi.oxauth.ws.rs.MultivaluedClaims)  Time elapsed: 1.083 sec  <<< FAILURE!
java.lang.AssertionError: expected [true] but found [false]
	at org.testng.Assert.fail(Assert.java:93)
	at org.testng.Assert.failNotEquals(Assert.java:512)
	at org.testng.Assert.assertTrue(Assert.java:41)
	at org.testng.Assert.assertTrue(Assert.java:51)
	at org.xdi.oxauth.ws.rs.MultivaluedClaims.authorizationRequestObjectWithMultivaluedClaimHS512(MultivaluedClaims.java:1751)
	at sun.reflect.NativeMethodAccessorImpl.invoke0(Native Method)
	at sun.reflect.NativeMethodAccessorImpl.invoke(NativeMethodAccessorImpl.java:62)
	at sun.reflect.DelegatingMethodAccessorImpl.invoke(DelegatingMethodAccessorImpl.java:43)
	at java.lang.reflect.Method.invoke(Method.java:498)
	at org.testng.internal.MethodInvocationHelper.invokeMethod(MethodInvocationHelper.java:108)
	at org.testng.internal.Invoker.invokeMethod(Invoker.java:661)
	at org.testng.internal.Invoker.invokeTestMethod(Invoker.java:869)
	at org.testng.internal.Invoker.invokeTestMethods(Invoker.java:1193)
	at org.testng.internal.TestMethodWorker.invokeTestMethods(TestMethodWorker.java:126)
	at org.testng.internal.TestMethodWorker.run(TestMethodWorker.java:109)
	at org.testng.TestRunner.privateRun(TestRunner.java:744)
	at org.testng.TestRunner.run(TestRunner.java:602)
	at org.testng.SuiteRunner.runTest(SuiteRunner.java:380)
	at org.testng.SuiteRunner.runSequentially(SuiteRunner.java:375)
	at org.testng.SuiteRunner.privateRun(SuiteRunner.java:340)
	at org.testng.SuiteRunner.run(SuiteRunner.java:289)
	at org.testng.SuiteRunnerWorker.runSuite(SuiteRunnerWorker.java:52)
	at org.testng.SuiteRunnerWorker.run(SuiteRunnerWorker.java:86)
	at org.testng.TestNG.runSuitesSequentially(TestNG.java:1301)
	at org.testng.TestNG.runSuitesLocally(TestNG.java:1226)
	at org.testng.TestNG.runSuites(TestNG.java:1144)
	at org.testng.TestNG.run(TestNG.java:1115)
	at org.apache.maven.surefire.testng.TestNGExecutor.run(TestNGExecutor.java:281)
	at org.apache.maven.surefire.testng.TestNGXmlTestSuite.execute(TestNGXmlTestSuite.java:75)
	at org.apache.maven.surefire.testng.TestNGProvider.invoke(TestNGProvider.java:121)
	at org.apache.maven.surefire.booter.ForkedBooter.invokeProviderInSameClassLoader(ForkedBooter.java:290)
	at org.apache.maven.surefire.booter.ForkedBooter.runSuitesInProcess(ForkedBooter.java:242)
	at org.apache.maven.surefire.booter.ForkedBooter.main(ForkedBooter.java:121)

authorizationRequestObjectWithMultivaluedClaimNone(org.xdi.oxauth.ws.rs.MultivaluedClaims)  Time elapsed: 1.097 sec  <<< FAILURE!
java.lang.AssertionError: expected [true] but found [false]
	at org.testng.Assert.fail(Assert.java:93)
	at org.testng.Assert.failNotEquals(Assert.java:512)
	at org.testng.Assert.assertTrue(Assert.java:41)
	at org.testng.Assert.assertTrue(Assert.java:51)
	at org.xdi.oxauth.ws.rs.MultivaluedClaims.authorizationRequestObjectWithMultivaluedClaimNone(MultivaluedClaims.java:1461)
	at sun.reflect.NativeMethodAccessorImpl.invoke0(Native Method)
	at sun.reflect.NativeMethodAccessorImpl.invoke(NativeMethodAccessorImpl.java:62)
	at sun.reflect.DelegatingMethodAccessorImpl.invoke(DelegatingMethodAccessorImpl.java:43)
	at java.lang.reflect.Method.invoke(Method.java:498)
	at org.testng.internal.MethodInvocationHelper.invokeMethod(MethodInvocationHelper.java:108)
	at org.testng.internal.Invoker.invokeMethod(Invoker.java:661)
	at org.testng.internal.Invoker.invokeTestMethod(Invoker.java:869)
	at org.testng.internal.Invoker.invokeTestMethods(Invoker.java:1193)
	at org.testng.internal.TestMethodWorker.invokeTestMethods(TestMethodWorker.java:126)
	at org.testng.internal.TestMethodWorker.run(TestMethodWorker.java:109)
	at org.testng.TestRunner.privateRun(TestRunner.java:744)
	at org.testng.TestRunner.run(TestRunner.java:602)
	at org.testng.SuiteRunner.runTest(SuiteRunner.java:380)
	at org.testng.SuiteRunner.runSequentially(SuiteRunner.java:375)
	at org.testng.SuiteRunner.privateRun(SuiteRunner.java:340)
	at org.testng.SuiteRunner.run(SuiteRunner.java:289)
	at org.testng.SuiteRunnerWorker.runSuite(SuiteRunnerWorker.java:52)
	at org.testng.SuiteRunnerWorker.run(SuiteRunnerWorker.java:86)
	at org.testng.TestNG.runSuitesSequentially(TestNG.java:1301)
	at org.testng.TestNG.runSuitesLocally(TestNG.java:1226)
	at org.testng.TestNG.runSuites(TestNG.java:1144)
	at org.testng.TestNG.run(TestNG.java:1115)
	at org.apache.maven.surefire.testng.TestNGExecutor.run(TestNGExecutor.java:281)
	at org.apache.maven.surefire.testng.TestNGXmlTestSuite.execute(TestNGXmlTestSuite.java:75)
	at org.apache.maven.surefire.testng.TestNGProvider.invoke(TestNGProvider.java:121)
	at org.apache.maven.surefire.booter.ForkedBooter.invokeProviderInSameClassLoader(ForkedBooter.java:290)
	at org.apache.maven.surefire.booter.ForkedBooter.runSuitesInProcess(ForkedBooter.java:242)
	at org.apache.maven.surefire.booter.ForkedBooter.main(ForkedBooter.java:121)

authorizationRequestObjectWithMultivaluedClaimRS256(org.xdi.oxauth.ws.rs.MultivaluedClaims)  Time elapsed: 1.286 sec  <<< FAILURE!
java.lang.AssertionError: expected [true] but found [false]
	at org.testng.Assert.fail(Assert.java:93)
	at org.testng.Assert.failNotEquals(Assert.java:512)
	at org.testng.Assert.assertTrue(Assert.java:41)
	at org.testng.Assert.assertTrue(Assert.java:51)
	at org.xdi.oxauth.ws.rs.MultivaluedClaims.authorizationRequestObjectWithMultivaluedClaimRS256(MultivaluedClaims.java:1850)
	at sun.reflect.NativeMethodAccessorImpl.invoke0(Native Method)
	at sun.reflect.NativeMethodAccessorImpl.invoke(NativeMethodAccessorImpl.java:62)
	at sun.reflect.DelegatingMethodAccessorImpl.invoke(DelegatingMethodAccessorImpl.java:43)
	at java.lang.reflect.Method.invoke(Method.java:498)
	at org.testng.internal.MethodInvocationHelper.invokeMethod(MethodInvocationHelper.java:108)
	at org.testng.internal.Invoker.invokeMethod(Invoker.java:661)
	at org.testng.internal.Invoker.invokeTestMethod(Invoker.java:869)
	at org.testng.internal.Invoker.invokeTestMethods(Invoker.java:1193)
	at org.testng.internal.TestMethodWorker.invokeTestMethods(TestMethodWorker.java:126)
	at org.testng.internal.TestMethodWorker.run(TestMethodWorker.java:109)
	at org.testng.TestRunner.privateRun(TestRunner.java:744)
	at org.testng.TestRunner.run(TestRunner.java:602)
	at org.testng.SuiteRunner.runTest(SuiteRunner.java:380)
	at org.testng.SuiteRunner.runSequentially(SuiteRunner.java:375)
	at org.testng.SuiteRunner.privateRun(SuiteRunner.java:340)
	at org.testng.SuiteRunner.run(SuiteRunner.java:289)
	at org.testng.SuiteRunnerWorker.runSuite(SuiteRunnerWorker.java:52)
	at org.testng.SuiteRunnerWorker.run(SuiteRunnerWorker.java:86)
	at org.testng.TestNG.runSuitesSequentially(TestNG.java:1301)
	at org.testng.TestNG.runSuitesLocally(TestNG.java:1226)
	at org.testng.TestNG.runSuites(TestNG.java:1144)
	at org.testng.TestNG.run(TestNG.java:1115)
	at org.apache.maven.surefire.testng.TestNGExecutor.run(TestNGExecutor.java:281)
	at org.apache.maven.surefire.testng.TestNGXmlTestSuite.execute(TestNGXmlTestSuite.java:75)
	at org.apache.maven.surefire.testng.TestNGProvider.invoke(TestNGProvider.java:121)
	at org.apache.maven.surefire.booter.ForkedBooter.invokeProviderInSameClassLoader(ForkedBooter.java:290)
	at org.apache.maven.surefire.booter.ForkedBooter.runSuitesInProcess(ForkedBooter.java:242)
	at org.apache.maven.surefire.booter.ForkedBooter.main(ForkedBooter.java:121)

authorizationRequestObjectWithMultivaluedClaimRS384(org.xdi.oxauth.ws.rs.MultivaluedClaims)  Time elapsed: 1.336 sec  <<< FAILURE!
java.lang.AssertionError: expected [true] but found [false]
	at org.testng.Assert.fail(Assert.java:93)
	at org.testng.Assert.failNotEquals(Assert.java:512)
	at org.testng.Assert.assertTrue(Assert.java:41)
	at org.testng.Assert.assertTrue(Assert.java:51)
	at org.xdi.oxauth.ws.rs.MultivaluedClaims.authorizationRequestObjectWithMultivaluedClaimRS384(MultivaluedClaims.java:1953)
	at sun.reflect.NativeMethodAccessorImpl.invoke0(Native Method)
	at sun.reflect.NativeMethodAccessorImpl.invoke(NativeMethodAccessorImpl.java:62)
	at sun.reflect.DelegatingMethodAccessorImpl.invoke(DelegatingMethodAccessorImpl.java:43)
	at java.lang.reflect.Method.invoke(Method.java:498)
	at org.testng.internal.MethodInvocationHelper.invokeMethod(MethodInvocationHelper.java:108)
	at org.testng.internal.Invoker.invokeMethod(Invoker.java:661)
	at org.testng.internal.Invoker.invokeTestMethod(Invoker.java:869)
	at org.testng.internal.Invoker.invokeTestMethods(Invoker.java:1193)
	at org.testng.internal.TestMethodWorker.invokeTestMethods(TestMethodWorker.java:126)
	at org.testng.internal.TestMethodWorker.run(TestMethodWorker.java:109)
	at org.testng.TestRunner.privateRun(TestRunner.java:744)
	at org.testng.TestRunner.run(TestRunner.java:602)
	at org.testng.SuiteRunner.runTest(SuiteRunner.java:380)
	at org.testng.SuiteRunner.runSequentially(SuiteRunner.java:375)
	at org.testng.SuiteRunner.privateRun(SuiteRunner.java:340)
	at org.testng.SuiteRunner.run(SuiteRunner.java:289)
	at org.testng.SuiteRunnerWorker.runSuite(SuiteRunnerWorker.java:52)
	at org.testng.SuiteRunnerWorker.run(SuiteRunnerWorker.java:86)
	at org.testng.TestNG.runSuitesSequentially(TestNG.java:1301)
	at org.testng.TestNG.runSuitesLocally(TestNG.java:1226)
	at org.testng.TestNG.runSuites(TestNG.java:1144)
	at org.testng.TestNG.run(TestNG.java:1115)
	at org.apache.maven.surefire.testng.TestNGExecutor.run(TestNGExecutor.java:281)
	at org.apache.maven.surefire.testng.TestNGXmlTestSuite.execute(TestNGXmlTestSuite.java:75)
	at org.apache.maven.surefire.testng.TestNGProvider.invoke(TestNGProvider.java:121)
	at org.apache.maven.surefire.booter.ForkedBooter.invokeProviderInSameClassLoader(ForkedBooter.java:290)
	at org.apache.maven.surefire.booter.ForkedBooter.runSuitesInProcess(ForkedBooter.java:242)
	at org.apache.maven.surefire.booter.ForkedBooter.main(ForkedBooter.java:121)

authorizationRequestObjectWithMultivaluedClaimRS512(org.xdi.oxauth.ws.rs.MultivaluedClaims)  Time elapsed: 1.257 sec  <<< FAILURE!
java.lang.AssertionError: expected [true] but found [false]
	at org.testng.Assert.fail(Assert.java:93)
	at org.testng.Assert.failNotEquals(Assert.java:512)
	at org.testng.Assert.assertTrue(Assert.java:41)
	at org.testng.Assert.assertTrue(Assert.java:51)
	at org.xdi.oxauth.ws.rs.MultivaluedClaims.authorizationRequestObjectWithMultivaluedClaimRS512(MultivaluedClaims.java:2056)
	at sun.reflect.NativeMethodAccessorImpl.invoke0(Native Method)
	at sun.reflect.NativeMethodAccessorImpl.invoke(NativeMethodAccessorImpl.java:62)
	at sun.reflect.DelegatingMethodAccessorImpl.invoke(DelegatingMethodAccessorImpl.java:43)
	at java.lang.reflect.Method.invoke(Method.java:498)
	at org.testng.internal.MethodInvocationHelper.invokeMethod(MethodInvocationHelper.java:108)
	at org.testng.internal.Invoker.invokeMethod(Invoker.java:661)
	at org.testng.internal.Invoker.invokeTestMethod(Invoker.java:869)
	at org.testng.internal.Invoker.invokeTestMethods(Invoker.java:1193)
	at org.testng.internal.TestMethodWorker.invokeTestMethods(TestMethodWorker.java:126)
	at org.testng.internal.TestMethodWorker.run(TestMethodWorker.java:109)
	at org.testng.TestRunner.privateRun(TestRunner.java:744)
	at org.testng.TestRunner.run(TestRunner.java:602)
	at org.testng.SuiteRunner.runTest(SuiteRunner.java:380)
	at org.testng.SuiteRunner.runSequentially(SuiteRunner.java:375)
	at org.testng.SuiteRunner.privateRun(SuiteRunner.java:340)
	at org.testng.SuiteRunner.run(SuiteRunner.java:289)
	at org.testng.SuiteRunnerWorker.runSuite(SuiteRunnerWorker.java:52)
	at org.testng.SuiteRunnerWorker.run(SuiteRunnerWorker.java:86)
	at org.testng.TestNG.runSuitesSequentially(TestNG.java:1301)
	at org.testng.TestNG.runSuitesLocally(TestNG.java:1226)
	at org.testng.TestNG.runSuites(TestNG.java:1144)
	at org.testng.TestNG.run(TestNG.java:1115)
	at org.apache.maven.surefire.testng.TestNGExecutor.run(TestNGExecutor.java:281)
	at org.apache.maven.surefire.testng.TestNGXmlTestSuite.execute(TestNGXmlTestSuite.java:75)
	at org.apache.maven.surefire.testng.TestNGProvider.invoke(TestNGProvider.java:121)
	at org.apache.maven.surefire.booter.ForkedBooter.invokeProviderInSameClassLoader(ForkedBooter.java:290)
	at org.apache.maven.surefire.booter.ForkedBooter.runSuitesInProcess(ForkedBooter.java:242)
	at org.apache.maven.surefire.booter.ForkedBooter.main(ForkedBooter.java:121)

persistentClientAuthorizations(org.xdi.oxauth.ws.rs.PersistClientAuthorizationsHttpTest)  Time elapsed: 11.127 sec  <<< FAILURE!
org.openqa.selenium.TimeoutException: 
Timed out after 10 seconds waiting for presence of element located by: By.id: authorizeForm:allowButton
Build info: version: '2.53.1', revision: 'a36b8b1cd5757287168e54b817830adce9b0158d', time: '2016-06-30 19:26:09'
System info: host: 'ox.gluu.org', ip: '162.243.99.240', os.name: 'Linux', os.arch: 'amd64', os.version: '3.10.0-229.20.1.el7.x86_64', java.version: '1.8.0_121'
Driver info: org.openqa.selenium.htmlunit.HtmlUnitDriver
	at org.openqa.selenium.support.ui.WebDriverWait.timeoutException(WebDriverWait.java:80)
	at org.openqa.selenium.support.ui.FluentWait.until(FluentWait.java:261)
	at org.xdi.oxauth.BaseTest.acceptAuthorization(BaseTest.java:363)
	at org.xdi.oxauth.BaseTest.authenticateResourceOwnerAndGrantAccess(BaseTest.java:290)
	at org.xdi.oxauth.BaseTest.authenticateResourceOwnerAndGrantAccess(BaseTest.java:271)
	at org.xdi.oxauth.BaseTest.authenticateResourceOwnerAndGrantAccess(BaseTest.java:261)
	at org.xdi.oxauth.BaseTest.authenticateResourceOwnerAndGrantAccess(BaseTest.java:252)
	at org.xdi.oxauth.ws.rs.PersistClientAuthorizationsHttpTest.persistentClientAuthorizations(PersistClientAuthorizationsHttpTest.java:75)
	at sun.reflect.NativeMethodAccessorImpl.invoke0(Native Method)
	at sun.reflect.NativeMethodAccessorImpl.invoke(NativeMethodAccessorImpl.java:62)
	at sun.reflect.DelegatingMethodAccessorImpl.invoke(DelegatingMethodAccessorImpl.java:43)
	at java.lang.reflect.Method.invoke(Method.java:498)
	at org.testng.internal.MethodInvocationHelper.invokeMethod(MethodInvocationHelper.java:108)
	at org.testng.internal.Invoker.invokeMethod(Invoker.java:661)
	at org.testng.internal.Invoker.invokeTestMethod(Invoker.java:869)
	at org.testng.internal.Invoker.invokeTestMethods(Invoker.java:1193)
	at org.testng.internal.TestMethodWorker.invokeTestMethods(TestMethodWorker.java:126)
	at org.testng.internal.TestMethodWorker.run(TestMethodWorker.java:109)
	at org.testng.TestRunner.privateRun(TestRunner.java:744)
	at org.testng.TestRunner.run(TestRunner.java:602)
	at org.testng.SuiteRunner.runTest(SuiteRunner.java:380)
	at org.testng.SuiteRunner.runSequentially(SuiteRunner.java:375)
	at org.testng.SuiteRunner.privateRun(SuiteRunner.java:340)
	at org.testng.SuiteRunner.run(SuiteRunner.java:289)
	at org.testng.SuiteRunnerWorker.runSuite(SuiteRunnerWorker.java:52)
	at org.testng.SuiteRunnerWorker.run(SuiteRunnerWorker.java:86)
	at org.testng.TestNG.runSuitesSequentially(TestNG.java:1301)
	at org.testng.TestNG.runSuitesLocally(TestNG.java:1226)
	at org.testng.TestNG.runSuites(TestNG.java:1144)
	at org.testng.TestNG.run(TestNG.java:1115)
	at org.apache.maven.surefire.testng.TestNGExecutor.run(TestNGExecutor.java:281)
	at org.apache.maven.surefire.testng.TestNGXmlTestSuite.execute(TestNGXmlTestSuite.java:75)
	at org.apache.maven.surefire.testng.TestNGProvider.invoke(TestNGProvider.java:121)
	at org.apache.maven.surefire.booter.ForkedBooter.invokeProviderInSameClassLoader(ForkedBooter.java:290)
	at org.apache.maven.surefire.booter.ForkedBooter.runSuitesInProcess(ForkedBooter.java:242)
	at org.apache.maven.surefire.booter.ForkedBooter.main(ForkedBooter.java:121)
Caused by: org.openqa.selenium.NoSuchElementException: Unable to locate element with ID: authorizeForm:allowButton
For documentation on this error, please visit: http://seleniumhq.org/exceptions/no_such_element.html
Build info: version: '2.53.1', revision: 'a36b8b1cd5757287168e54b817830adce9b0158d', time: '2016-06-30 19:26:09'
System info: host: 'ox.gluu.org', ip: '162.243.99.240', os.name: 'Linux', os.arch: 'amd64', os.version: '3.10.0-229.20.1.el7.x86_64', java.version: '1.8.0_121'
Driver info: driver.version: HtmlUnitDriver
	at org.openqa.selenium.htmlunit.HtmlUnitDriver.findElementById(HtmlUnitDriver.java:1008)
	at org.openqa.selenium.By$ById.findElement(By.java:218)
	at org.openqa.selenium.htmlunit.HtmlUnitDriver$5.call(HtmlUnitDriver.java:1707)
	at org.openqa.selenium.htmlunit.HtmlUnitDriver$5.call(HtmlUnitDriver.java:1703)
	at org.openqa.selenium.htmlunit.HtmlUnitDriver.implicitlyWaitFor(HtmlUnitDriver.java:1357)
	at org.openqa.selenium.htmlunit.HtmlUnitDriver.findElement(HtmlUnitDriver.java:1703)
	at org.openqa.selenium.htmlunit.HtmlUnitDriver.findElement(HtmlUnitDriver.java:595)
	at org.openqa.selenium.support.ui.ExpectedConditions.findElement(ExpectedConditions.java:899)
	at org.openqa.selenium.support.ui.ExpectedConditions.access$000(ExpectedConditions.java:41)
	at org.openqa.selenium.support.ui.ExpectedConditions$6.apply(ExpectedConditions.java:181)
	at org.openqa.selenium.support.ui.ExpectedConditions$6.apply(ExpectedConditions.java:178)
	at org.openqa.selenium.support.ui.FluentWait.until(FluentWait.java:238)
	... 34 more

successfulRptRequest(org.xdi.oxauth.ws.rs.uma.AccessProtectedResourceFlowHttpTest)  Time elapsed: 0.011 sec  <<< FAILURE!
org.jboss.resteasy.client.ClientResponseFailure: RESTEASY003150: Error status 400 Bad Request returned
	at org.jboss.resteasy.client.core.BaseClientResponse.createResponseFailure(BaseClientResponse.java:581)
	at org.jboss.resteasy.client.core.BaseClientResponse.createResponseFailure(BaseClientResponse.java:572)
	at org.jboss.resteasy.client.core.BaseClientResponse.checkFailureStatus(BaseClientResponse.java:566)
	at org.jboss.resteasy.client.core.extractors.BodyEntityExtractor.extractEntity(BodyEntityExtractor.java:39)
	at org.jboss.resteasy.client.core.ClientInvoker.invoke(ClientInvoker.java:128)
	at org.jboss.resteasy.client.core.ClientProxy.invoke(ClientProxy.java:89)
	at com.sun.proxy.$Proxy62.requestRpt(Unknown Source)
	at org.xdi.oxauth.ws.rs.uma.AccessProtectedResourceFlowHttpTest.successfulRptRequest(AccessProtectedResourceFlowHttpTest.java:161)
	at sun.reflect.NativeMethodAccessorImpl.invoke0(Native Method)
	at sun.reflect.NativeMethodAccessorImpl.invoke(NativeMethodAccessorImpl.java:62)
	at sun.reflect.DelegatingMethodAccessorImpl.invoke(DelegatingMethodAccessorImpl.java:43)
	at java.lang.reflect.Method.invoke(Method.java:498)
	at org.testng.internal.MethodInvocationHelper.invokeMethod(MethodInvocationHelper.java:108)
	at org.testng.internal.Invoker.invokeMethod(Invoker.java:661)
	at org.testng.internal.Invoker.invokeTestMethod(Invoker.java:869)
	at org.testng.internal.Invoker.invokeTestMethods(Invoker.java:1193)
	at org.testng.internal.TestMethodWorker.invokeTestMethods(TestMethodWorker.java:126)
	at org.testng.internal.TestMethodWorker.run(TestMethodWorker.java:109)
	at org.testng.TestRunner.privateRun(TestRunner.java:744)
	at org.testng.TestRunner.run(TestRunner.java:602)
	at org.testng.SuiteRunner.runTest(SuiteRunner.java:380)
	at org.testng.SuiteRunner.runSequentially(SuiteRunner.java:375)
	at org.testng.SuiteRunner.privateRun(SuiteRunner.java:340)
	at org.testng.SuiteRunner.run(SuiteRunner.java:289)
	at org.testng.SuiteRunnerWorker.runSuite(SuiteRunnerWorker.java:52)
	at org.testng.SuiteRunnerWorker.run(SuiteRunnerWorker.java:86)
	at org.testng.TestNG.runSuitesSequentially(TestNG.java:1301)
	at org.testng.TestNG.runSuitesLocally(TestNG.java:1226)
	at org.testng.TestNG.runSuites(TestNG.java:1144)
	at org.testng.TestNG.run(TestNG.java:1115)
	at org.apache.maven.surefire.testng.TestNGExecutor.run(TestNGExecutor.java:281)
	at org.apache.maven.surefire.testng.TestNGXmlTestSuite.execute(TestNGXmlTestSuite.java:75)
	at org.apache.maven.surefire.testng.TestNGProvider.invoke(TestNGProvider.java:121)
	at org.apache.maven.surefire.booter.ForkedBooter.invokeProviderInSameClassLoader(ForkedBooter.java:290)
	at org.apache.maven.surefire.booter.ForkedBooter.runSuitesInProcess(ForkedBooter.java:242)
	at org.apache.maven.surefire.booter.ForkedBooter.main(ForkedBooter.java:121)

supportsReturningClaimsInIdToken(org.xdi.oxauth.interop.SupportsReturningClaimsInIdToken)  Time elapsed: 1.263 sec  <<< FAILURE!
java.lang.AssertionError: expected object to not be null
	at org.testng.Assert.fail(Assert.java:93)
	at org.testng.Assert.assertNotNull(Assert.java:422)
	at org.testng.Assert.assertNotNull(Assert.java:407)
	at org.xdi.oxauth.interop.SupportsReturningClaimsInIdToken.supportsReturningClaimsInIdToken(SupportsReturningClaimsInIdToken.java:114)
	at sun.reflect.NativeMethodAccessorImpl.invoke0(Native Method)
	at sun.reflect.NativeMethodAccessorImpl.invoke(NativeMethodAccessorImpl.java:62)
	at sun.reflect.DelegatingMethodAccessorImpl.invoke(DelegatingMethodAccessorImpl.java:43)
	at java.lang.reflect.Method.invoke(Method.java:498)
	at org.testng.internal.MethodInvocationHelper.invokeMethod(MethodInvocationHelper.java:108)
	at org.testng.internal.Invoker.invokeMethod(Invoker.java:661)
	at org.testng.internal.Invoker.invokeTestMethod(Invoker.java:869)
	at org.testng.internal.Invoker.invokeTestMethods(Invoker.java:1193)
	at org.testng.internal.TestMethodWorker.invokeTestMethods(TestMethodWorker.java:126)
	at org.testng.internal.TestMethodWorker.run(TestMethodWorker.java:109)
	at org.testng.TestRunner.privateRun(TestRunner.java:744)
	at org.testng.TestRunner.run(TestRunner.java:602)
	at org.testng.SuiteRunner.runTest(SuiteRunner.java:380)
	at org.testng.SuiteRunner.runSequentially(SuiteRunner.java:375)
	at org.testng.SuiteRunner.privateRun(SuiteRunner.java:340)
	at org.testng.SuiteRunner.run(SuiteRunner.java:289)
	at org.testng.SuiteRunnerWorker.runSuite(SuiteRunnerWorker.java:52)
	at org.testng.SuiteRunnerWorker.run(SuiteRunnerWorker.java:86)
	at org.testng.TestNG.runSuitesSequentially(TestNG.java:1301)
	at org.testng.TestNG.runSuitesLocally(TestNG.java:1226)
	at org.testng.TestNG.runSuites(TestNG.java:1144)
	at org.testng.TestNG.run(TestNG.java:1115)
	at org.apache.maven.surefire.testng.TestNGExecutor.run(TestNGExecutor.java:281)
	at org.apache.maven.surefire.testng.TestNGXmlTestSuite.execute(TestNGXmlTestSuite.java:75)
	at org.apache.maven.surefire.testng.TestNGProvider.invoke(TestNGProvider.java:121)
	at org.apache.maven.surefire.booter.ForkedBooter.invokeProviderInSameClassLoader(ForkedBooter.java:290)
	at org.apache.maven.surefire.booter.ForkedBooter.runSuitesInProcess(ForkedBooter.java:242)
	at org.apache.maven.surefire.booter.ForkedBooter.main(ForkedBooter.java:121)

verifiesCorrectAtHashWhenImplicitFlowUsed(org.xdi.oxauth.interop.VerifiesCorrectAtHashWhenImplicitFlowUsed)  Time elapsed: 10.948 sec  <<< FAILURE!
org.openqa.selenium.TimeoutException: 
Timed out after 10 seconds waiting for presence of element located by: By.id: authorizeForm:allowButton
Build info: version: '2.53.1', revision: 'a36b8b1cd5757287168e54b817830adce9b0158d', time: '2016-06-30 19:26:09'
System info: host: 'ox.gluu.org', ip: '162.243.99.240', os.name: 'Linux', os.arch: 'amd64', os.version: '3.10.0-229.20.1.el7.x86_64', java.version: '1.8.0_121'
Driver info: org.openqa.selenium.htmlunit.HtmlUnitDriver
	at org.openqa.selenium.support.ui.WebDriverWait.timeoutException(WebDriverWait.java:80)
	at org.openqa.selenium.support.ui.FluentWait.until(FluentWait.java:261)
	at org.xdi.oxauth.BaseTest.acceptAuthorization(BaseTest.java:363)
	at org.xdi.oxauth.BaseTest.authenticateResourceOwnerAndGrantAccess(BaseTest.java:290)
	at org.xdi.oxauth.BaseTest.authenticateResourceOwnerAndGrantAccess(BaseTest.java:271)
	at org.xdi.oxauth.BaseTest.authenticateResourceOwnerAndGrantAccess(BaseTest.java:261)
	at org.xdi.oxauth.BaseTest.authenticateResourceOwnerAndGrantAccess(BaseTest.java:252)
	at org.xdi.oxauth.interop.VerifiesCorrectAtHashWhenImplicitFlowUsed.verifiesCorrectAtHashWhenImplicitFlowUsed(VerifiesCorrectAtHashWhenImplicitFlowUsed.java:76)
	at sun.reflect.NativeMethodAccessorImpl.invoke0(Native Method)
	at sun.reflect.NativeMethodAccessorImpl.invoke(NativeMethodAccessorImpl.java:62)
	at sun.reflect.DelegatingMethodAccessorImpl.invoke(DelegatingMethodAccessorImpl.java:43)
	at java.lang.reflect.Method.invoke(Method.java:498)
	at org.testng.internal.MethodInvocationHelper.invokeMethod(MethodInvocationHelper.java:108)
	at org.testng.internal.Invoker.invokeMethod(Invoker.java:661)
	at org.testng.internal.Invoker.invokeTestMethod(Invoker.java:869)
	at org.testng.internal.Invoker.invokeTestMethods(Invoker.java:1193)
	at org.testng.internal.TestMethodWorker.invokeTestMethods(TestMethodWorker.java:126)
	at org.testng.internal.TestMethodWorker.run(TestMethodWorker.java:109)
	at org.testng.TestRunner.privateRun(TestRunner.java:744)
	at org.testng.TestRunner.run(TestRunner.java:602)
	at org.testng.SuiteRunner.runTest(SuiteRunner.java:380)
	at org.testng.SuiteRunner.runSequentially(SuiteRunner.java:375)
	at org.testng.SuiteRunner.privateRun(SuiteRunner.java:340)
	at org.testng.SuiteRunner.run(SuiteRunner.java:289)
	at org.testng.SuiteRunnerWorker.runSuite(SuiteRunnerWorker.java:52)
	at org.testng.SuiteRunnerWorker.run(SuiteRunnerWorker.java:86)
	at org.testng.TestNG.runSuitesSequentially(TestNG.java:1301)
	at org.testng.TestNG.runSuitesLocally(TestNG.java:1226)
	at org.testng.TestNG.runSuites(TestNG.java:1144)
	at org.testng.TestNG.run(TestNG.java:1115)
	at org.apache.maven.surefire.testng.TestNGExecutor.run(TestNGExecutor.java:281)
	at org.apache.maven.surefire.testng.TestNGXmlTestSuite.execute(TestNGXmlTestSuite.java:75)
	at org.apache.maven.surefire.testng.TestNGProvider.invoke(TestNGProvider.java:121)
	at org.apache.maven.surefire.booter.ForkedBooter.invokeProviderInSameClassLoader(ForkedBooter.java:290)
	at org.apache.maven.surefire.booter.ForkedBooter.runSuitesInProcess(ForkedBooter.java:242)
	at org.apache.maven.surefire.booter.ForkedBooter.main(ForkedBooter.java:121)
Caused by: org.openqa.selenium.NoSuchElementException: Unable to locate element by id for com.gargoylesoftware.htmlunit.TextPage@5273f98c
For documentation on this error, please visit: http://seleniumhq.org/exceptions/no_such_element.html
Build info: version: '2.53.1', revision: 'a36b8b1cd5757287168e54b817830adce9b0158d', time: '2016-06-30 19:26:09'
System info: host: 'ox.gluu.org', ip: '162.243.99.240', os.name: 'Linux', os.arch: 'amd64', os.version: '3.10.0-229.20.1.el7.x86_64', java.version: '1.8.0_121'
Driver info: driver.version: HtmlUnitDriver
	at org.openqa.selenium.htmlunit.HtmlUnitDriver.findElementById(HtmlUnitDriver.java:1001)
	at org.openqa.selenium.By$ById.findElement(By.java:218)
	at org.openqa.selenium.htmlunit.HtmlUnitDriver$5.call(HtmlUnitDriver.java:1707)
	at org.openqa.selenium.htmlunit.HtmlUnitDriver$5.call(HtmlUnitDriver.java:1703)
	at org.openqa.selenium.htmlunit.HtmlUnitDriver.implicitlyWaitFor(HtmlUnitDriver.java:1357)
	at org.openqa.selenium.htmlunit.HtmlUnitDriver.findElement(HtmlUnitDriver.java:1703)
	at org.openqa.selenium.htmlunit.HtmlUnitDriver.findElement(HtmlUnitDriver.java:595)
	at org.openqa.selenium.support.ui.ExpectedConditions.findElement(ExpectedConditions.java:899)
	at org.openqa.selenium.support.ui.ExpectedConditions.access$000(ExpectedConditions.java:41)
	at org.openqa.selenium.support.ui.ExpectedConditions$6.apply(ExpectedConditions.java:181)
	at org.openqa.selenium.support.ui.ExpectedConditions$6.apply(ExpectedConditions.java:178)
	at org.openqa.selenium.support.ui.FluentWait.until(FluentWait.java:238)
	... 34 more


Results :

Failed tests: 
  SupportsReturningClaimsInIdToken.supportsReturningClaimsInIdToken:114 expected object to not be null
  VerifiesCorrectAtHashWhenImplicitFlowUsed.verifiesCorrectAtHashWhenImplicitFlowUsed:76->BaseTest.authenticateResourceOwnerAndGrantAccess:252->BaseTest.authenticateResourceOwnerAndGrantAccess:261->BaseTest.authenticateResourceOwnerAndGrantAccess:271->BaseTest.authenticateResourceOwnerAndGrantAccess:290->BaseTest.acceptAuthorization:363 » Timeout
  MultivaluedClaims.authorizationRequestObjectWithMultivaluedClaimAlgA128KWEncA128GCM:2470 expected [true] but found [false]
  MultivaluedClaims.authorizationRequestObjectWithMultivaluedClaimAlgA256KWEncA256GCM:2568 expected [true] but found [false]
  MultivaluedClaims.authorizationRequestObjectWithMultivaluedClaimAlgRSA15EncA128CBCPLUSHS256:2678 expected [true] but found [false]
  MultivaluedClaims.authorizationRequestObjectWithMultivaluedClaimAlgRSA15EncA256CBCPLUSHS512:2788 expected [true] but found [false]
  MultivaluedClaims.authorizationRequestObjectWithMultivaluedClaimAlgRSAOAEPEncA256GCM:2898 expected [true] but found [false]
  MultivaluedClaims.authorizationRequestObjectWithMultivaluedClaimES256:2159 expected [true] but found [false]
  MultivaluedClaims.authorizationRequestObjectWithMultivaluedClaimES384:2262 expected [true] but found [false]
  MultivaluedClaims.authorizationRequestObjectWithMultivaluedClaimES512:2365 expected [true] but found [false]
  MultivaluedClaims.authorizationRequestObjectWithMultivaluedClaimHS256:1557 expected [true] but found [false]
  MultivaluedClaims.authorizationRequestObjectWithMultivaluedClaimHS384:1654 expected [true] but found [false]
  MultivaluedClaims.authorizationRequestObjectWithMultivaluedClaimHS512:1751 expected [true] but found [false]
  MultivaluedClaims.authorizationRequestObjectWithMultivaluedClaimNone:1461 expected [true] but found [false]
  MultivaluedClaims.authorizationRequestObjectWithMultivaluedClaimRS256:1850 expected [true] but found [false]
  MultivaluedClaims.authorizationRequestObjectWithMultivaluedClaimRS384:1953 expected [true] but found [false]
  MultivaluedClaims.authorizationRequestObjectWithMultivaluedClaimRS512:2056 expected [true] but found [false]
  PersistClientAuthorizationsHttpTest.persistentClientAuthorizations:75->BaseTest.authenticateResourceOwnerAndGrantAccess:252->BaseTest.authenticateResourceOwnerAndGrantAccess:261->BaseTest.authenticateResourceOwnerAndGrantAccess:271->BaseTest.authenticateResourceOwnerAndGrantAccess:290->BaseTest.acceptAuthorization:363 » Timeout
  AccessProtectedResourceFlowHttpTest.successfulRptRequest:161 » ClientResponseFailure

Tests run: 680, Failures: 19, Errors: 0, Skipped: 1

[INFO] ------------------------------------------------------------------------
[INFO] Reactor Summary:
[INFO] 
[INFO] oxAuth ............................................. SUCCESS [  3.136 s]
[INFO] oxAuth Model ....................................... SUCCESS [ 40.455 s]
[INFO] oxAuth Client ...................................... FAILURE [12:36 min]
[INFO] oxauth-static ...................................... SKIPPED
[INFO] oxAuth RP .......................................... SKIPPED
[INFO] oxAuth RP Demo ..................................... SKIPPED
[INFO] oxAuth Server ...................................... SKIPPED
[INFO] ------------------------------------------------------------------------
[INFO] BUILD FAILURE
[INFO] ------------------------------------------------------------------------
[INFO] Total time: 13:21 min
[INFO] Finished at: 2018-07-04T14:42:51-04:00
[INFO] Final Memory: 69M/448M
[INFO] ------------------------------------------------------------------------
[ERROR] Failed to execute goal org.apache.maven.plugins:maven-surefire-plugin:2.19.1:test (default-test) on project oxauth-client: There are test failures.
[ERROR] 
[ERROR] Please refer to /home/tomcat/.jenkins/jobs/oxAuth/workspace/Client/target/surefire-reports for the individual test results.
[ERROR] -> [Help 1]
[ERROR] 
[ERROR] To see the full stack trace of the errors, re-run Maven with the -e switch.
[ERROR] Re-run Maven using the -X switch to enable full debug logging.
[ERROR] 
[ERROR] For more information about the errors and possible solutions, please read the following articles:
[ERROR] [Help 1] http://cwiki.apache.org/confluence/display/MAVEN/MojoFailureException
[ERROR] 
[ERROR] After correcting the problems, you can resume the build with the command
[ERROR]   mvn <goals> -rf :oxauth-client
Build step 'Invoke top-level Maven targets' marked build as failure
[FINDBUGS] Skipping publisher since build result is FAILURE
Publishing Javadoc
TestNG Reports Processing: START
Looking for TestNG results report in workspace using pattern: **/testng-results.xml
Saving reports...
Processing '/home/tomcat/.jenkins/jobs/oxAuth/builds/3297/testng/testng-results-1.xml'
Processing '/home/tomcat/.jenkins/jobs/oxAuth/builds/3297/testng/testng-results.xml'
2.765648% of tests failed, which exceeded threshold of 0%. Marking build as UNSTABLE
TestNG Reports Processing: FINISH
Sending e-mails to: support@gluu.org
Finished: FAILURE