FailedConsole Output

Skipping 7,883 KB.. Full Log
9W_G0jYdvRuTyQ8YniOmeoqdThbHwLO9YVKqkrfdnSFSdbdaYPZ4bahEp_05Y032vtU2QXwXEvxpQrGDLTycd5OXNuteIsNKLUFVghlU7YpkVANTgEIJAY09Kwt5YAnXYmk2VyuLSIuXCnsRAlwfegw4sRjVX2G-6RNpj1B2NE0_BJXaRxjG9PBPAUmVwisV1DIYc11-jdFp-Zv7OpOoMG6x6kjBWkigTVTEnpxDWqV26Ya4a72ueOtBg_nX5I0Y-OCHx5hqeE45Ufub87EiOfMz_-_QMK37bLYI0gFQz6YmJZLJqYksr856KiEqL_iihA&session_id=dbae6b64-54f8-448a-8762-8172782021fc&state=029442c2-1bd5-4202-8bee-1719711405f2&session_state=be144047-c169-4796-98a8-6d91ed11054b

#######################################################
TEST: OpenID Connect Discovery
#######################################################
-------------------------------------------------------
REQUEST:
-------------------------------------------------------
GET /.well-known/webfinger?resource=acct%3Atest_user%40ce-dev4.gluu.org&rel=http%3A%2F%2Fopenid.net%2Fspecs%2Fconnect%2F1.0%2Fissuer HTTP/1.1
Host: ce-dev4.gluu.org

-------------------------------------------------------
RESPONSE:
-------------------------------------------------------
HTTP/1.1 200
Connection: Keep-Alive
Content-Length: 181
Content-Type: application/jrd+json;charset=iso-8859-1
Date: Wed, 04 Jul 2018 14:53:30 GMT
Keep-Alive: timeout=5, max=100
Server: Jetty(9.4.9.v20180320)
Strict-Transport-Security: max-age=31536000; includeSubDomains
X-Content-Type-Options: nosniff
X-Xss-Protection: 1; mode=block

{
    "subject": "acct:test_user@ce-dev4.gluu.org",
    "links": [{
        "rel": "http://openid.net/specs/connect/1.0/issuer",
        "href": "https://ce-dev4.gluu.org"
    }]
}


OpenID Connect Configuration
-------------------------------------------------------
REQUEST:
-------------------------------------------------------
GET /.well-known/openid-configuration HTTP/1.1
Host: ce-dev4.gluu.org

-------------------------------------------------------
RESPONSE:
-------------------------------------------------------
HTTP/1.1 200
Connection: Keep-Alive
Content-Length: 6342
Content-Type: application/json
Date: Wed, 04 Jul 2018 14:53:30 GMT
Keep-Alive: timeout=5, max=100
Server: Jetty(9.4.9.v20180320)
Strict-Transport-Security: max-age=31536000; includeSubDomains
X-Content-Type-Options: nosniff
X-Xss-Protection: 1; mode=block

{
    "issuer": "https://ce-dev4.gluu.org",
    "authorization_endpoint": "https://ce-dev4.gluu.org/oxauth/restv1/authorize",
    "token_endpoint": "https://ce-dev4.gluu.org/oxauth/restv1/token",
    "userinfo_endpoint": "https://ce-dev4.gluu.org/oxauth/restv1/userinfo",
    "clientinfo_endpoint": "https://ce-dev4.gluu.org/oxauth/restv1/clientinfo",
    "check_session_iframe": "https://ce-dev4.gluu.org/oxauth/opiframe",
    "end_session_endpoint": "https://ce-dev4.gluu.org/oxauth/restv1/end_session",
    "jwks_uri": "https://ce-dev4.gluu.org/oxauth/restv1/jwks",
    "registration_endpoint": "https://ce-dev4.gluu.org/oxauth/restv1/register",
    "id_generation_endpoint": "https://ce-dev4.gluu.org/oxauth/restv1/id",
    "introspection_endpoint": "https://ce-dev4.gluu.org/oxauth/restv1/introspection",
    "scopes_supported": [
        "permission",
        "clientinfo",
        "email",
        "user_name",
        "sub",
        "org_name",
        "address",
        "openid",
        "test_scope1",
        "work_phone",
        "phone",
        "profile",
        "mobile_phone",
        "test"
    ],
    "response_types_supported": [
        "code id_token",
        "token code id_token",
        "token code",
        "token",
        "code",
        "token id_token",
        "id_token"
    ],
    "grant_types_supported": [
        "urn:ietf:params:oauth:grant-type:uma-ticket",
        "client_credentials",
        "refresh_token",
        "implicit",
        "authorization_code",
        "password"
    ],
    "acr_values_supported": [
        "super_gluu",
        "u2f",
        "otp",
        "basic",
        "auth_ldap_server"
    ],
    "auth_level_mapping": {
        "-1": ["auth_ldap_server"],
        "50": ["otp"],
        "100": ["basic"],
        "10": ["u2f"],
        "15": ["super_gluu"]
    },
    "subject_types_supported": [
        "public",
        "pairwise"
    ],
    "userinfo_signing_alg_values_supported": [
        "HS256",
        "HS384",
        "HS512",
        "RS256",
        "RS384",
        "RS512",
        "ES256",
        "ES384",
        "ES512"
    ],
    "userinfo_encryption_alg_values_supported": [
        "RSA1_5",
        "RSA-OAEP",
        "A128KW",
        "A256KW"
    ],
    "userinfo_encryption_enc_values_supported": [
        "RSA1_5",
        "RSA-OAEP",
        "A128KW",
        "A256KW"
    ],
    "id_token_signing_alg_values_supported": [
        "none",
        "HS256",
        "HS384",
        "HS512",
        "RS256",
        "RS384",
        "RS512",
        "ES256",
        "ES384",
        "ES512"
    ],
    "id_token_encryption_alg_values_supported": [
        "RSA1_5",
        "RSA-OAEP",
        "A128KW",
        "A256KW"
    ],
    "id_token_encryption_enc_values_supported": [
        "A128CBC+HS256",
        "A256CBC+HS512",
        "A128GCM",
        "A256GCM"
    ],
    "request_object_signing_alg_values_supported": [
        "none",
        "HS256",
        "HS384",
        "HS512",
        "RS256",
        "RS384",
        "RS512",
        "ES256",
        "ES384",
        "ES512"
    ],
    "request_object_encryption_alg_values_supported": [
        "RSA1_5",
        "RSA-OAEP",
        "A128KW",
        "A256KW"
    ],
    "request_object_encryption_enc_values_supported": [
        "A128CBC+HS256",
        "A256CBC+HS512",
        "A128GCM",
        "A256GCM"
    ],
    "token_endpoint_auth_methods_supported": [
        "client_secret_basic",
        "client_secret_post",
        "client_secret_jwt",
        "private_key_jwt"
    ],
    "token_endpoint_auth_signing_alg_values_supported": [
        "HS256",
        "HS384",
        "HS512",
        "RS256",
        "RS384",
        "RS512",
        "ES256",
        "ES384",
        "ES512"
    ],
    "display_values_supported": [
        "page",
        "popup"
    ],
    "claim_types_supported": ["normal"],
    "claims_supported": [
        "birthdate",
        "country",
        "name",
        "email",
        "email_verified",
        "given_name",
        "gender",
        "inum",
        "family_name",
        "updated_at",
        "locale",
        "member_of",
        "middle_name",
        "nickname",
        "oxAuthAppType",
        "oxAuthIdTokenSignedResponseAlg",
        "oxAuthRedirectURI",
        "oxAuthScope",
        "phone_number_verified",
        "picture",
        "preferred_username",
        "profile",
        "zoneinfo",
        "user_name",
        "website"
    ],
    "service_documentation": "http://gluu.org/docs",
    "claims_locales_supported": ["en"],
    "ui_locales_supported": [
        "en",
        "es"
    ],
    "scope_to_claims_mapping": [
        {"permission": []},
        {"uma_protection": []},
        {"clientinfo": [
            "name",
            "inum",
            "oxAuthAppType",
            "oxAuthIdTokenSignedResponseAlg",
            "oxAuthRedirectURI",
            "oxAuthScope"
        ]},
        {"email": [
            "email_verified",
            "email"
        ]},
        {"user_name": ["user_name"]},
        {"sub": []},
        {"org_name": []},
        {"address": [
            "formatted",
            "postal_code",
            "street_address",
            "locality",
            "country",
            "region"
        ]},
        {"openid": []},
        {"test_scope1": []},
        {"work_phone": []},
        {"phone": [
            "phone_number_verified",
            "phone_number"
        ]},
        {"profile": [
            "name",
            "family_name",
            "given_name",
            "middle_name",
            "nickname",
            "preferred_username",
            "profile",
            "picture",
            "website",
            "gender",
            "birthdate",
            "zoneinfo",
            "locale",
            "updated_at"
        ]},
        {"mobile_phone": ["phone_mobile_number"]},
        {"test": ["member_of"]}
    ],
    "claims_parameter_supported": true,
    "request_parameter_supported": true,
    "request_uri_parameter_supported": true,
    "require_request_uri_registration": false,
    "op_policy_uri": "http://ox.gluu.org/doku.php?id=oxauth:policy",
    "op_tos_uri": "http://ox.gluu.org/doku.php?id=oxauth:tos",
    "frontchannel_logout_supported": true,
    "frontchannel_logout_session_supported": true
}


#######################################################
TEST: OC5:FeatureTest-Uses Discovery
#######################################################
#######################################################
TEST: OpenID Connect Discovery
#######################################################
-------------------------------------------------------
REQUEST:
-------------------------------------------------------
GET /.well-known/webfinger?resource=acct%3Atest_user%40ce-dev4.gluu.org&rel=http%3A%2F%2Fopenid.net%2Fspecs%2Fconnect%2F1.0%2Fissuer HTTP/1.1
Host: ce-dev4.gluu.org

-------------------------------------------------------
RESPONSE:
-------------------------------------------------------
HTTP/1.1 200
Connection: Keep-Alive
Content-Length: 181
Content-Type: application/jrd+json;charset=iso-8859-1
Date: Wed, 04 Jul 2018 14:53:30 GMT
Keep-Alive: timeout=5, max=100
Server: Jetty(9.4.9.v20180320)
Strict-Transport-Security: max-age=31536000; includeSubDomains
X-Content-Type-Options: nosniff
X-Xss-Protection: 1; mode=block

{
    "subject": "acct:test_user@ce-dev4.gluu.org",
    "links": [{
        "rel": "http://openid.net/specs/connect/1.0/issuer",
        "href": "https://ce-dev4.gluu.org"
    }]
}


OpenID Connect Configuration
-------------------------------------------------------
REQUEST:
-------------------------------------------------------
GET /.well-known/openid-configuration HTTP/1.1
Host: ce-dev4.gluu.org

-------------------------------------------------------
RESPONSE:
-------------------------------------------------------
HTTP/1.1 200
Connection: Keep-Alive
Content-Length: 6342
Content-Type: application/json
Date: Wed, 04 Jul 2018 14:53:30 GMT
Keep-Alive: timeout=5, max=100
Server: Jetty(9.4.9.v20180320)
Strict-Transport-Security: max-age=31536000; includeSubDomains
X-Content-Type-Options: nosniff
X-Xss-Protection: 1; mode=block

{
    "issuer": "https://ce-dev4.gluu.org",
    "authorization_endpoint": "https://ce-dev4.gluu.org/oxauth/restv1/authorize",
    "token_endpoint": "https://ce-dev4.gluu.org/oxauth/restv1/token",
    "userinfo_endpoint": "https://ce-dev4.gluu.org/oxauth/restv1/userinfo",
    "clientinfo_endpoint": "https://ce-dev4.gluu.org/oxauth/restv1/clientinfo",
    "check_session_iframe": "https://ce-dev4.gluu.org/oxauth/opiframe",
    "end_session_endpoint": "https://ce-dev4.gluu.org/oxauth/restv1/end_session",
    "jwks_uri": "https://ce-dev4.gluu.org/oxauth/restv1/jwks",
    "registration_endpoint": "https://ce-dev4.gluu.org/oxauth/restv1/register",
    "id_generation_endpoint": "https://ce-dev4.gluu.org/oxauth/restv1/id",
    "introspection_endpoint": "https://ce-dev4.gluu.org/oxauth/restv1/introspection",
    "scopes_supported": [
        "permission",
        "clientinfo",
        "email",
        "user_name",
        "sub",
        "org_name",
        "address",
        "openid",
        "test_scope1",
        "work_phone",
        "phone",
        "profile",
        "mobile_phone",
        "test"
    ],
    "response_types_supported": [
        "code id_token",
        "token code id_token",
        "token code",
        "token",
        "code",
        "token id_token",
        "id_token"
    ],
    "grant_types_supported": [
        "urn:ietf:params:oauth:grant-type:uma-ticket",
        "client_credentials",
        "refresh_token",
        "implicit",
        "authorization_code",
        "password"
    ],
    "acr_values_supported": [
        "super_gluu",
        "u2f",
        "otp",
        "basic",
        "auth_ldap_server"
    ],
    "auth_level_mapping": {
        "-1": ["auth_ldap_server"],
        "50": ["otp"],
        "100": ["basic"],
        "10": ["u2f"],
        "15": ["super_gluu"]
    },
    "subject_types_supported": [
        "public",
        "pairwise"
    ],
    "userinfo_signing_alg_values_supported": [
        "HS256",
        "HS384",
        "HS512",
        "RS256",
        "RS384",
        "RS512",
        "ES256",
        "ES384",
        "ES512"
    ],
    "userinfo_encryption_alg_values_supported": [
        "RSA1_5",
        "RSA-OAEP",
        "A128KW",
        "A256KW"
    ],
    "userinfo_encryption_enc_values_supported": [
        "RSA1_5",
        "RSA-OAEP",
        "A128KW",
        "A256KW"
    ],
    "id_token_signing_alg_values_supported": [
        "none",
        "HS256",
        "HS384",
        "HS512",
        "RS256",
        "RS384",
        "RS512",
        "ES256",
        "ES384",
        "ES512"
    ],
    "id_token_encryption_alg_values_supported": [
        "RSA1_5",
        "RSA-OAEP",
        "A128KW",
        "A256KW"
    ],
    "id_token_encryption_enc_values_supported": [
        "A128CBC+HS256",
        "A256CBC+HS512",
        "A128GCM",
        "A256GCM"
    ],
    "request_object_signing_alg_values_supported": [
        "none",
        "HS256",
        "HS384",
        "HS512",
        "RS256",
        "RS384",
        "RS512",
        "ES256",
        "ES384",
        "ES512"
    ],
    "request_object_encryption_alg_values_supported": [
        "RSA1_5",
        "RSA-OAEP",
        "A128KW",
        "A256KW"
    ],
    "request_object_encryption_enc_values_supported": [
        "A128CBC+HS256",
        "A256CBC+HS512",
        "A128GCM",
        "A256GCM"
    ],
    "token_endpoint_auth_methods_supported": [
        "client_secret_basic",
        "client_secret_post",
        "client_secret_jwt",
        "private_key_jwt"
    ],
    "token_endpoint_auth_signing_alg_values_supported": [
        "HS256",
        "HS384",
        "HS512",
        "RS256",
        "RS384",
        "RS512",
        "ES256",
        "ES384",
        "ES512"
    ],
    "display_values_supported": [
        "page",
        "popup"
    ],
    "claim_types_supported": ["normal"],
    "claims_supported": [
        "birthdate",
        "country",
        "name",
        "email",
        "email_verified",
        "given_name",
        "gender",
        "inum",
        "family_name",
        "updated_at",
        "locale",
        "member_of",
        "middle_name",
        "nickname",
        "oxAuthAppType",
        "oxAuthIdTokenSignedResponseAlg",
        "oxAuthRedirectURI",
        "oxAuthScope",
        "phone_number_verified",
        "picture",
        "preferred_username",
        "profile",
        "zoneinfo",
        "user_name",
        "website"
    ],
    "service_documentation": "http://gluu.org/docs",
    "claims_locales_supported": ["en"],
    "ui_locales_supported": [
        "en",
        "es"
    ],
    "scope_to_claims_mapping": [
        {"permission": []},
        {"uma_protection": []},
        {"clientinfo": [
            "name",
            "inum",
            "oxAuthAppType",
            "oxAuthIdTokenSignedResponseAlg",
            "oxAuthRedirectURI",
            "oxAuthScope"
        ]},
        {"email": [
            "email_verified",
            "email"
        ]},
        {"user_name": ["user_name"]},
        {"sub": []},
        {"org_name": []},
        {"address": [
            "formatted",
            "postal_code",
            "street_address",
            "locality",
            "country",
            "region"
        ]},
        {"openid": []},
        {"test_scope1": []},
        {"work_phone": []},
        {"phone": [
            "phone_number_verified",
            "phone_number"
        ]},
        {"profile": [
            "name",
            "family_name",
            "given_name",
            "middle_name",
            "nickname",
            "preferred_username",
            "profile",
            "picture",
            "website",
            "gender",
            "birthdate",
            "zoneinfo",
            "locale",
            "updated_at"
        ]},
        {"mobile_phone": ["phone_mobile_number"]},
        {"test": ["member_of"]}
    ],
    "claims_parameter_supported": true,
    "request_parameter_supported": true,
    "request_uri_parameter_supported": true,
    "require_request_uri_registration": false,
    "op_policy_uri": "http://ox.gluu.org/doku.php?id=oxauth:policy",
    "op_tos_uri": "http://ox.gluu.org/doku.php?id=oxauth:tos",
    "frontchannel_logout_supported": true,
    "frontchannel_logout_session_supported": true
}


#######################################################
TEST: OC5:FeatureTest-Uses Dynamic Registration
#######################################################
-------------------------------------------------------
REQUEST:
-------------------------------------------------------
POST /oxauth/restv1/register HTTP/1.1
Content-Type: application/json
Accept: application/json
Host: ce-dev4.gluu.org

{
    "redirect_uris": [
        "https://ce-dev4.gluu.org/oxauth-rp/home.htm",
        "https://client.example.com/cb",
        "https://client.example.com/cb1",
        "https://client.example.com/cb2"
    ],
    "application_type": "web",
    "contacts": [
        "javier@gluu.org",
        "javier.rojas.blum@gmail.com"
    ],
    "client_name": "oxAuth test app",
    "logo_uri": "http://www.gluu.org/wp-content/themes/gluursn/images/logo.png",
    "policy_uri": "http://www.gluu.org/policy",
    "jwks_uri": "https://ce-dev4.gluu.org/oxauth-client/test/resources/jwks.json",
    "sector_identifier_uri": "https://ce-dev4.gluu.org/oxauth/sectoridentifier/@!38D4.410C.1D43.8932!0001!37F2.B744!0012!D426.70FD",
    "subject_type": "public",
    "request_object_signing_alg": "RS256",
    "token_endpoint_auth_method": "client_secret_jwt"
}

-------------------------------------------------------
RESPONSE:
-------------------------------------------------------
HTTP/1.1 200
Cache-Control: no-store
Connection: Keep-Alive
Content-Length: 1695
Content-Type: application/json
Date: Wed, 04 Jul 2018 14:53:30 GMT
Keep-Alive: timeout=5, max=100
Pragma: no-cache
Server: Jetty(9.4.9.v20180320)
Strict-Transport-Security: max-age=31536000; includeSubDomains
X-Content-Type-Options: nosniff
X-Xss-Protection: 1; mode=block

{
    "client_id": "@!38D4.410C.1D43.8932!0001!37F2.B744!0008!37E8.8261.2950.1AB1",
    "client_secret": "952ca489-4a6f-46de-b475-838d034e73af",
    "registration_access_token": "d10ef3e5-28c8-4236-bf31-7c34d965cf44",
    "registration_client_uri": "https://ce-dev4.gluu.org/oxauth/restv1/register?client_id=@!38D4.410C.1D43.8932!0001!37F2.B744!0008!37E8.8261.2950.1AB1",
    "client_id_issued_at": 1530716010,
    "client_secret_expires_at": 1530802410,
    "redirect_uris": [
        "https://client.example.com/cb2",
        "https://client.example.com/cb1",
        "https://client.example.com/cb",
        "https://ce-dev4.gluu.org/oxauth-rp/home.htm"
    ],
    "response_types": ["code"],
    "grant_types": [
        "refresh_token",
        "authorization_code"
    ],
    "application_type": "web",
    "contacts": [
        "javier.rojas.blum@gmail.com",
        "javier@gluu.org"
    ],
    "client_name": "oxAuth test app",
    "logo_uri": "http://www.gluu.org/wp-content/themes/gluursn/images/logo.png",
    "policy_uri": "http://www.gluu.org/policy",
    "jwks_uri": "https://ce-dev4.gluu.org/oxauth-client/test/resources/jwks.json",
    "sector_identifier_uri": "https://ce-dev4.gluu.org/oxauth/sectoridentifier/@!38D4.410C.1D43.8932!0001!37F2.B744!0012!D426.70FD",
    "subject_type": "public",
    "id_token_signed_response_alg": "RS256",
    "request_object_signing_alg": "RS256",
    "token_endpoint_auth_method": "client_secret_jwt",
    "require_auth_time": false,
    "frontchannel_logout_session_required": false,
    "scope": "permission uma_protection clientinfo email user_name sub org_name address openid test_scope1 work_phone phone profile test",
    "claims": ""
}

#######################################################
TEST: OpenID Connect Discovery
#######################################################
-------------------------------------------------------
REQUEST:
-------------------------------------------------------
GET /.well-known/webfinger?resource=acct%3Atest_user%40ce-dev4.gluu.org&rel=http%3A%2F%2Fopenid.net%2Fspecs%2Fconnect%2F1.0%2Fissuer HTTP/1.1
Host: ce-dev4.gluu.org

-------------------------------------------------------
RESPONSE:
-------------------------------------------------------
HTTP/1.1 200
Connection: Keep-Alive
Content-Length: 181
Content-Type: application/jrd+json;charset=iso-8859-1
Date: Wed, 04 Jul 2018 14:53:30 GMT
Keep-Alive: timeout=5, max=100
Server: Jetty(9.4.9.v20180320)
Strict-Transport-Security: max-age=31536000; includeSubDomains
X-Content-Type-Options: nosniff
X-Xss-Protection: 1; mode=block

{
    "subject": "acct:test_user@ce-dev4.gluu.org",
    "links": [{
        "rel": "http://openid.net/specs/connect/1.0/issuer",
        "href": "https://ce-dev4.gluu.org"
    }]
}


OpenID Connect Configuration
-------------------------------------------------------
REQUEST:
-------------------------------------------------------
GET /.well-known/openid-configuration HTTP/1.1
Host: ce-dev4.gluu.org

-------------------------------------------------------
RESPONSE:
-------------------------------------------------------
HTTP/1.1 200
Connection: Keep-Alive
Content-Length: 6342
Content-Type: application/json
Date: Wed, 04 Jul 2018 14:53:30 GMT
Keep-Alive: timeout=5, max=100
Server: Jetty(9.4.9.v20180320)
Strict-Transport-Security: max-age=31536000; includeSubDomains
X-Content-Type-Options: nosniff
X-Xss-Protection: 1; mode=block

{
    "issuer": "https://ce-dev4.gluu.org",
    "authorization_endpoint": "https://ce-dev4.gluu.org/oxauth/restv1/authorize",
    "token_endpoint": "https://ce-dev4.gluu.org/oxauth/restv1/token",
    "userinfo_endpoint": "https://ce-dev4.gluu.org/oxauth/restv1/userinfo",
    "clientinfo_endpoint": "https://ce-dev4.gluu.org/oxauth/restv1/clientinfo",
    "check_session_iframe": "https://ce-dev4.gluu.org/oxauth/opiframe",
    "end_session_endpoint": "https://ce-dev4.gluu.org/oxauth/restv1/end_session",
    "jwks_uri": "https://ce-dev4.gluu.org/oxauth/restv1/jwks",
    "registration_endpoint": "https://ce-dev4.gluu.org/oxauth/restv1/register",
    "id_generation_endpoint": "https://ce-dev4.gluu.org/oxauth/restv1/id",
    "introspection_endpoint": "https://ce-dev4.gluu.org/oxauth/restv1/introspection",
    "scopes_supported": [
        "permission",
        "clientinfo",
        "email",
        "user_name",
        "sub",
        "org_name",
        "address",
        "openid",
        "test_scope1",
        "work_phone",
        "phone",
        "profile",
        "mobile_phone",
        "test"
    ],
    "response_types_supported": [
        "code id_token",
        "token code id_token",
        "token code",
        "token",
        "code",
        "token id_token",
        "id_token"
    ],
    "grant_types_supported": [
        "urn:ietf:params:oauth:grant-type:uma-ticket",
        "client_credentials",
        "refresh_token",
        "implicit",
        "authorization_code",
        "password"
    ],
    "acr_values_supported": [
        "super_gluu",
        "u2f",
        "otp",
        "basic",
        "auth_ldap_server"
    ],
    "auth_level_mapping": {
        "-1": ["auth_ldap_server"],
        "50": ["otp"],
        "100": ["basic"],
        "10": ["u2f"],
        "15": ["super_gluu"]
    },
    "subject_types_supported": [
        "public",
        "pairwise"
    ],
    "userinfo_signing_alg_values_supported": [
        "HS256",
        "HS384",
        "HS512",
        "RS256",
        "RS384",
        "RS512",
        "ES256",
        "ES384",
        "ES512"
    ],
    "userinfo_encryption_alg_values_supported": [
        "RSA1_5",
        "RSA-OAEP",
        "A128KW",
        "A256KW"
    ],
    "userinfo_encryption_enc_values_supported": [
        "RSA1_5",
        "RSA-OAEP",
        "A128KW",
        "A256KW"
    ],
    "id_token_signing_alg_values_supported": [
        "none",
        "HS256",
        "HS384",
        "HS512",
        "RS256",
        "RS384",
        "RS512",
        "ES256",
        "ES384",
        "ES512"
    ],
    "id_token_encryption_alg_values_supported": [
        "RSA1_5",
        "RSA-OAEP",
        "A128KW",
        "A256KW"
    ],
    "id_token_encryption_enc_values_supported": [
        "A128CBC+HS256",
        "A256CBC+HS512",
        "A128GCM",
        "A256GCM"
    ],
    "request_object_signing_alg_values_supported": [
        "none",
        "HS256",
        "HS384",
        "HS512",
        "RS256",
        "RS384",
        "RS512",
        "ES256",
        "ES384",
        "ES512"
    ],
    "request_object_encryption_alg_values_supported": [
        "RSA1_5",
        "RSA-OAEP",
        "A128KW",
        "A256KW"
    ],
    "request_object_encryption_enc_values_supported": [
        "A128CBC+HS256",
        "A256CBC+HS512",
        "A128GCM",
        "A256GCM"
    ],
    "token_endpoint_auth_methods_supported": [
        "client_secret_basic",
        "client_secret_post",
        "client_secret_jwt",
        "private_key_jwt"
    ],
    "token_endpoint_auth_signing_alg_values_supported": [
        "HS256",
        "HS384",
        "HS512",
        "RS256",
        "RS384",
        "RS512",
        "ES256",
        "ES384",
        "ES512"
    ],
    "display_values_supported": [
        "page",
        "popup"
    ],
    "claim_types_supported": ["normal"],
    "claims_supported": [
        "birthdate",
        "country",
        "name",
        "email",
        "email_verified",
        "given_name",
        "gender",
        "inum",
        "family_name",
        "updated_at",
        "locale",
        "member_of",
        "middle_name",
        "nickname",
        "oxAuthAppType",
        "oxAuthIdTokenSignedResponseAlg",
        "oxAuthRedirectURI",
        "oxAuthScope",
        "phone_number_verified",
        "picture",
        "preferred_username",
        "profile",
        "zoneinfo",
        "user_name",
        "website"
    ],
    "service_documentation": "http://gluu.org/docs",
    "claims_locales_supported": ["en"],
    "ui_locales_supported": [
        "en",
        "es"
    ],
    "scope_to_claims_mapping": [
        {"permission": []},
        {"uma_protection": []},
        {"clientinfo": [
            "name",
            "inum",
            "oxAuthAppType",
            "oxAuthIdTokenSignedResponseAlg",
            "oxAuthRedirectURI",
            "oxAuthScope"
        ]},
        {"email": [
            "email_verified",
            "email"
        ]},
        {"user_name": ["user_name"]},
        {"sub": []},
        {"org_name": []},
        {"address": [
            "formatted",
            "postal_code",
            "street_address",
            "locality",
            "country",
            "region"
        ]},
        {"openid": []},
        {"test_scope1": []},
        {"work_phone": []},
        {"phone": [
            "phone_number_verified",
            "phone_number"
        ]},
        {"profile": [
            "name",
            "family_name",
            "given_name",
            "middle_name",
            "nickname",
            "preferred_username",
            "profile",
            "picture",
            "website",
            "gender",
            "birthdate",
            "zoneinfo",
            "locale",
            "updated_at"
        ]},
        {"mobile_phone": ["phone_mobile_number"]},
        {"test": ["member_of"]}
    ],
    "claims_parameter_supported": true,
    "request_parameter_supported": true,
    "request_uri_parameter_supported": true,
    "require_request_uri_registration": false,
    "op_policy_uri": "http://ox.gluu.org/doku.php?id=oxauth:policy",
    "op_tos_uri": "http://ox.gluu.org/doku.php?id=oxauth:tos",
    "frontchannel_logout_supported": true,
    "frontchannel_logout_session_supported": true
}


#######################################################
TEST: OC5:FeatureTest-Uses Symmetric ID Token Signatures HS256
#######################################################
-------------------------------------------------------
REQUEST:
-------------------------------------------------------
POST /oxauth/restv1/register HTTP/1.1
Content-Type: application/json
Accept: application/json
Host: ce-dev4.gluu.org

{
    "redirect_uris": [
        "https://ce-dev4.gluu.org/oxauth-rp/home.htm",
        "https://client.example.com/cb",
        "https://client.example.com/cb1",
        "https://client.example.com/cb2"
    ],
    "response_types": ["id_token"],
    "application_type": "web",
    "client_name": "oxAuth test app",
    "sector_identifier_uri": "https://ce-dev4.gluu.org/oxauth/sectoridentifier/@!38D4.410C.1D43.8932!0001!37F2.B744!0012!D426.70FD",
    "id_token_signed_response_alg": "HS256"
}

-------------------------------------------------------
RESPONSE:
-------------------------------------------------------
HTTP/1.1 200
Cache-Control: no-store
Connection: Keep-Alive
Content-Length: 1340
Content-Type: application/json
Date: Wed, 04 Jul 2018 14:53:30 GMT
Keep-Alive: timeout=5, max=100
Pragma: no-cache
Server: Jetty(9.4.9.v20180320)
Strict-Transport-Security: max-age=31536000; includeSubDomains
X-Content-Type-Options: nosniff
X-Xss-Protection: 1; mode=block

{
    "client_id": "@!38D4.410C.1D43.8932!0001!37F2.B744!0008!A9E2.3D7C.EB32.E9C5",
    "client_secret": "f730ce70-9a7c-4a6b-a40e-be879c99653e",
    "registration_access_token": "373c5d53-48ff-4ee0-9784-a352924dbac9",
    "registration_client_uri": "https://ce-dev4.gluu.org/oxauth/restv1/register?client_id=@!38D4.410C.1D43.8932!0001!37F2.B744!0008!A9E2.3D7C.EB32.E9C5",
    "client_id_issued_at": 1530716010,
    "client_secret_expires_at": 1530802410,
    "redirect_uris": [
        "https://client.example.com/cb2",
        "https://client.example.com/cb1",
        "https://client.example.com/cb",
        "https://ce-dev4.gluu.org/oxauth-rp/home.htm"
    ],
    "response_types": [
        "token",
        "id_token"
    ],
    "grant_types": ["implicit"],
    "application_type": "web",
    "client_name": "oxAuth test app",
    "sector_identifier_uri": "https://ce-dev4.gluu.org/oxauth/sectoridentifier/@!38D4.410C.1D43.8932!0001!37F2.B744!0012!D426.70FD",
    "subject_type": "pairwise",
    "id_token_signed_response_alg": "HS256",
    "token_endpoint_auth_method": "client_secret_basic",
    "require_auth_time": false,
    "frontchannel_logout_session_required": false,
    "scope": "permission uma_protection clientinfo email user_name sub org_name address openid test_scope1 work_phone phone profile test",
    "claims": ""
}

authenticateResourceOwnerAndGrantAccess: Cleaning cookies
authenticateResourceOwnerAndGrantAccess: authorizationRequestUrl:https://ce-dev4.gluu.org/oxauth/restv1/authorize?response_type=id_token&client_id=%40%2138D4.410C.1D43.8932%210001%2137F2.B744%210008%21A9E2.3D7C.EB32.E9C5&scope=openid+profile+address+email&redirect_uri=https%3A%2F%2Fce-dev4.gluu.org%2Foxauth-rp%2Fhome.htm&state=038e24af-6c9b-4296-93ae-cb93a8708152&nonce=b9f3b424-e12d-46d8-8ea7-dc5ed48b2e42
10:53:50.368 [main] ERROR com.gargoylesoftware.htmlunit.javascript.StrictErrorReporter - runtimeError: message=[An invalid or illegal selector was specified (selector: '*,:x' error: Invalid selector: :x).] sourceName=[https://ce-dev4.gluu.org/oxauth/js/jquery-1.12.4.min.js] line=[2] lineSource=[null] lineOffset=[0]
10:53:50.398 [main] ERROR com.gargoylesoftware.htmlunit.html.HtmlPage - Error loading JavaScript from [https://ce-dev4.gluu.org/oxauth/js/platform.js].
java.io.IOException: Unable to download JavaScript from 'https://ce-dev4.gluu.org/oxauth/js/platform.js' (status 404).
	at com.gargoylesoftware.htmlunit.html.HtmlPage.loadJavaScriptFromUrl(HtmlPage.java:1055) ~[htmlunit-2.20.jar:2.20]
	at com.gargoylesoftware.htmlunit.html.HtmlPage.loadExternalJavaScriptFile(HtmlPage.java:982) [htmlunit-2.20.jar:2.20]
	at com.gargoylesoftware.htmlunit.html.HtmlScript.executeScriptIfNeeded(HtmlScript.java:352) [htmlunit-2.20.jar:2.20]
	at com.gargoylesoftware.htmlunit.html.HtmlScript$2.execute(HtmlScript.java:238) [htmlunit-2.20.jar:2.20]
	at com.gargoylesoftware.htmlunit.html.HtmlScript.onAllChildrenAddedToPage(HtmlScript.java:257) [htmlunit-2.20.jar:2.20]
	at com.gargoylesoftware.htmlunit.html.HTMLParser$HtmlUnitDOMBuilder.endElement(HTMLParser.java:747) [htmlunit-2.20.jar:2.20]
	at org.apache.xerces.parsers.AbstractSAXParser.endElement(Unknown Source) [xercesImpl-2.11.0.jar:?]
	at com.gargoylesoftware.htmlunit.html.HTMLParser$HtmlUnitDOMBuilder.endElement(HTMLParser.java:704) [htmlunit-2.20.jar:2.20]
	at org.cyberneko.html.HTMLTagBalancer.callEndElement(HTMLTagBalancer.java:1170) [nekohtml-1.9.22.jar:1.9.22]
	at org.cyberneko.html.HTMLTagBalancer.endElement(HTMLTagBalancer.java:1072) [nekohtml-1.9.22.jar:1.9.22]
	at org.cyberneko.html.filters.DefaultFilter.endElement(DefaultFilter.java:206) [nekohtml-1.9.22.jar:?]
	at org.cyberneko.html.filters.NamespaceBinder.endElement(NamespaceBinder.java:330) [nekohtml-1.9.22.jar:?]
	at org.cyberneko.html.HTMLScanner$ContentScanner.scanEndElement(HTMLScanner.java:3126) [nekohtml-1.9.22.jar:1.9.22]
	at org.cyberneko.html.HTMLScanner$ContentScanner.scan(HTMLScanner.java:2093) [nekohtml-1.9.22.jar:1.9.22]
	at org.cyberneko.html.HTMLScanner.scanDocument(HTMLScanner.java:920) [nekohtml-1.9.22.jar:1.9.22]
	at org.cyberneko.html.HTMLConfiguration.parse(HTMLConfiguration.java:499) [nekohtml-1.9.22.jar:1.9.22]
	at org.cyberneko.html.HTMLConfiguration.parse(HTMLConfiguration.java:452) [nekohtml-1.9.22.jar:1.9.22]
	at org.apache.xerces.parsers.XMLParser.parse(Unknown Source) [xercesImpl-2.11.0.jar:?]
	at com.gargoylesoftware.htmlunit.html.HTMLParser$HtmlUnitDOMBuilder.parse(HTMLParser.java:924) [htmlunit-2.20.jar:2.20]
	at com.gargoylesoftware.htmlunit.html.HTMLParser.parse(HTMLParser.java:238) [htmlunit-2.20.jar:2.20]
	at com.gargoylesoftware.htmlunit.html.HTMLParser.parseHtml(HTMLParser.java:184) [htmlunit-2.20.jar:2.20]
	at com.gargoylesoftware.htmlunit.DefaultPageCreator.createHtmlPage(DefaultPageCreator.java:269) [htmlunit-2.20.jar:2.20]
	at com.gargoylesoftware.htmlunit.DefaultPageCreator.createPage(DefaultPageCreator.java:157) [htmlunit-2.20.jar:2.20]
	at com.gargoylesoftware.htmlunit.WebClient.loadWebResponseInto(WebClient.java:477) [htmlunit-2.20.jar:2.20]
	at com.gargoylesoftware.htmlunit.WebClient.getPage(WebClient.java:351) [htmlunit-2.20.jar:2.20]
	at com.gargoylesoftware.htmlunit.WebClient.getPage(WebClient.java:416) [htmlunit-2.20.jar:2.20]
	at org.openqa.selenium.htmlunit.HtmlUnitDriver.get(HtmlUnitDriver.java:528) [htmlunit-driver-2.21.jar:?]
	at org.openqa.selenium.htmlunit.HtmlUnitDriver.get(HtmlUnitDriver.java:517) [htmlunit-driver-2.21.jar:?]
	at org.openqa.selenium.htmlunit.HtmlUnitDriver$HtmlUnitNavigation.to(HtmlUnitDriver.java:1421) [htmlunit-driver-2.21.jar:?]
	at org.xdi.oxauth.BaseTest.processAuthentication(BaseTest.java:337) [test-classes/:?]
	at org.xdi.oxauth.BaseTest.authenticateResourceOwnerAndGrantAccess(BaseTest.java:283) [test-classes/:?]
	at org.xdi.oxauth.BaseTest.authenticateResourceOwnerAndGrantAccess(BaseTest.java:271) [test-classes/:?]
	at org.xdi.oxauth.BaseTest.authenticateResourceOwnerAndGrantAccess(BaseTest.java:261) [test-classes/:?]
	at org.xdi.oxauth.BaseTest.authenticateResourceOwnerAndGrantAccess(BaseTest.java:252) [test-classes/:?]
	at org.xdi.oxauth.interop.UsesSymmetricIdTokenSignatures.usesSymmetricIdTokenSignaturesHS256(UsesSymmetricIdTokenSignatures.java:72) [test-classes/:?]
	at sun.reflect.NativeMethodAccessorImpl.invoke0(Native Method) ~[?:1.8.0_121]
	at sun.reflect.NativeMethodAccessorImpl.invoke(NativeMethodAccessorImpl.java:62) ~[?:1.8.0_121]
	at sun.reflect.DelegatingMethodAccessorImpl.invoke(DelegatingMethodAccessorImpl.java:43) ~[?:1.8.0_121]
	at java.lang.reflect.Method.invoke(Method.java:498) ~[?:1.8.0_121]
	at org.testng.internal.MethodInvocationHelper.invokeMethod(MethodInvocationHelper.java:108) [testng-6.11.jar:?]
	at org.testng.internal.Invoker.invokeMethod(Invoker.java:661) [testng-6.11.jar:?]
	at org.testng.internal.Invoker.invokeTestMethod(Invoker.java:869) [testng-6.11.jar:?]
	at org.testng.internal.Invoker.invokeTestMethods(Invoker.java:1193) [testng-6.11.jar:?]
	at org.testng.internal.TestMethodWorker.invokeTestMethods(TestMethodWorker.java:126) [testng-6.11.jar:?]
	at org.testng.internal.TestMethodWorker.run(TestMethodWorker.java:109) [testng-6.11.jar:?]
	at org.testng.TestRunner.privateRun(TestRunner.java:744) [testng-6.11.jar:?]
	at org.testng.TestRunner.run(TestRunner.java:602) [testng-6.11.jar:?]
	at org.testng.SuiteRunner.runTest(SuiteRunner.java:380) [testng-6.11.jar:?]
	at org.testng.SuiteRunner.runSequentially(SuiteRunner.java:375) [testng-6.11.jar:?]
	at org.testng.SuiteRunner.privateRun(SuiteRunner.java:340) [testng-6.11.jar:?]
	at org.testng.SuiteRunner.run(SuiteRunner.java:289) [testng-6.11.jar:?]
	at org.testng.SuiteRunnerWorker.runSuite(SuiteRunnerWorker.java:52) [testng-6.11.jar:?]
	at org.testng.SuiteRunnerWorker.run(SuiteRunnerWorker.java:86) [testng-6.11.jar:?]
	at org.testng.TestNG.runSuitesSequentially(TestNG.java:1301) [testng-6.11.jar:?]
	at org.testng.TestNG.runSuitesLocally(TestNG.java:1226) [testng-6.11.jar:?]
	at org.testng.TestNG.runSuites(TestNG.java:1144) [testng-6.11.jar:?]
	at org.testng.TestNG.run(TestNG.java:1115) [testng-6.11.jar:?]
	at org.apache.maven.surefire.testng.TestNGExecutor.run(TestNGExecutor.java:281) [surefire-testng-2.19.1.jar:2.19.1]
	at org.apache.maven.surefire.testng.TestNGXmlTestSuite.execute(TestNGXmlTestSuite.java:75) [surefire-testng-2.19.1.jar:2.19.1]
	at org.apache.maven.surefire.testng.TestNGProvider.invoke(TestNGProvider.java:121) [surefire-testng-2.19.1.jar:2.19.1]
	at org.apache.maven.surefire.booter.ForkedBooter.invokeProviderInSameClassLoader(ForkedBooter.java:290) [surefire-booter-2.19.1.jar:2.19.1]
	at org.apache.maven.surefire.booter.ForkedBooter.runSuitesInProcess(ForkedBooter.java:242) [surefire-booter-2.19.1.jar:2.19.1]
	at org.apache.maven.surefire.booter.ForkedBooter.main(ForkedBooter.java:121) [surefire-booter-2.19.1.jar:2.19.1]
authenticateResourceOwnerAndGrantAccess: sessionState:370c8395-51e6-4671-8234-97d75d0feb04
-------------------------------------------------------
REQUEST:
-------------------------------------------------------
https://ce-dev4.gluu.org/oxauth/restv1/authorize?response_type=id_token&client_id=%40%2138D4.410C.1D43.8932%210001%2137F2.B744%210008%21A9E2.3D7C.EB32.E9C5&scope=openid+profile+address+email&redirect_uri=https%3A%2F%2Fce-dev4.gluu.org%2Foxauth-rp%2Fhome.htm&state=038e24af-6c9b-4296-93ae-cb93a8708152&nonce=b9f3b424-e12d-46d8-8ea7-dc5ed48b2e42

-------------------------------------------------------
RESPONSE:
-------------------------------------------------------
HTTP/1.1 302 Found
Location: https://ce-dev4.gluu.org/oxauth-rp/home.htm#scope=address+openid+profile+email&id_token=eyJ0eXAiOiJKV1QiLCJhbGciOiJIUzI1NiJ9.eyJpc3MiOiJodHRwczovL2NlLWRldjQuZ2x1dS5vcmciLCJhdWQiOiJAITM4RDQuNDEwQy4xRDQzLjg5MzIhMDAwMSEzN0YyLkI3NDQhMDAwOCFBOUUyLjNEN0MuRUIzMi5FOUM1IiwiZXhwIjoxNTMwNzE5NjExLCJpYXQiOjE1MzA3MTYwMTEsIm5vbmNlIjoiYjlmM2I0MjQtZTEyZC00NmQ4LThlYTctZGM1ZWQ0OGIyZTQyIiwiYXV0aF90aW1lIjoxNTMwNzE2MDExLCJveE9wZW5JRENvbm5lY3RWZXJzaW9uIjoib3BlbmlkY29ubmVjdC0xLjAiLCJzdWIiOiJDUXF2VXpJRVgwWjlQZkpyWVV2dFlWOW9xTkE2RHNIeERFOTZxckZRc0IwIn0.Pr8IqPpw8ts6xvOOkRvhGHW3osG__HEyhXUBOPeealA&session_id=07be8f72-9c21-4b52-907f-f0bead241ed8&state=038e24af-6c9b-4296-93ae-cb93a8708152&session_state=370c8395-51e6-4671-8234-97d75d0feb04

#######################################################
TEST: OC5:FeatureTest-Uses Symmetric ID Token Signatures HS384
#######################################################
-------------------------------------------------------
REQUEST:
-------------------------------------------------------
POST /oxauth/restv1/register HTTP/1.1
Content-Type: application/json
Accept: application/json
Host: ce-dev4.gluu.org

{
    "redirect_uris": [
        "https://ce-dev4.gluu.org/oxauth-rp/home.htm",
        "https://client.example.com/cb",
        "https://client.example.com/cb1",
        "https://client.example.com/cb2"
    ],
    "response_types": ["id_token"],
    "application_type": "web",
    "client_name": "oxAuth test app",
    "sector_identifier_uri": "https://ce-dev4.gluu.org/oxauth/sectoridentifier/@!38D4.410C.1D43.8932!0001!37F2.B744!0012!D426.70FD",
    "id_token_signed_response_alg": "HS384"
}

-------------------------------------------------------
RESPONSE:
-------------------------------------------------------
HTTP/1.1 200
Cache-Control: no-store
Connection: Keep-Alive
Content-Length: 1340
Content-Type: application/json
Date: Wed, 04 Jul 2018 14:53:31 GMT
Keep-Alive: timeout=5, max=100
Pragma: no-cache
Server: Jetty(9.4.9.v20180320)
Strict-Transport-Security: max-age=31536000; includeSubDomains
X-Content-Type-Options: nosniff
X-Xss-Protection: 1; mode=block

{
    "client_id": "@!38D4.410C.1D43.8932!0001!37F2.B744!0008!67E4.AF59.948D.FF7C",
    "client_secret": "6904a323-469b-4c43-98cb-12fa83720cfd",
    "registration_access_token": "5359c3c4-bfe4-4ac3-a132-c12cdc4f265b",
    "registration_client_uri": "https://ce-dev4.gluu.org/oxauth/restv1/register?client_id=@!38D4.410C.1D43.8932!0001!37F2.B744!0008!67E4.AF59.948D.FF7C",
    "client_id_issued_at": 1530716011,
    "client_secret_expires_at": 1530802411,
    "redirect_uris": [
        "https://client.example.com/cb2",
        "https://client.example.com/cb1",
        "https://client.example.com/cb",
        "https://ce-dev4.gluu.org/oxauth-rp/home.htm"
    ],
    "response_types": [
        "token",
        "id_token"
    ],
    "grant_types": ["implicit"],
    "application_type": "web",
    "client_name": "oxAuth test app",
    "sector_identifier_uri": "https://ce-dev4.gluu.org/oxauth/sectoridentifier/@!38D4.410C.1D43.8932!0001!37F2.B744!0012!D426.70FD",
    "subject_type": "pairwise",
    "id_token_signed_response_alg": "HS384",
    "token_endpoint_auth_method": "client_secret_basic",
    "require_auth_time": false,
    "frontchannel_logout_session_required": false,
    "scope": "permission uma_protection clientinfo email user_name sub org_name address openid test_scope1 work_phone phone profile test",
    "claims": ""
}

authenticateResourceOwnerAndGrantAccess: Cleaning cookies
authenticateResourceOwnerAndGrantAccess: authorizationRequestUrl:https://ce-dev4.gluu.org/oxauth/restv1/authorize?response_type=id_token&client_id=%40%2138D4.410C.1D43.8932%210001%2137F2.B744%210008%2167E4.AF59.948D.FF7C&scope=openid+profile+address+email&redirect_uri=https%3A%2F%2Fce-dev4.gluu.org%2Foxauth-rp%2Fhome.htm&state=efdb0ea8-c3ec-4d88-abd3-7bbe20310c17&nonce=d2f3c78d-4455-4340-9811-a2c1cdd16164
10:53:51.750 [main] ERROR com.gargoylesoftware.htmlunit.javascript.StrictErrorReporter - runtimeError: message=[An invalid or illegal selector was specified (selector: '*,:x' error: Invalid selector: :x).] sourceName=[https://ce-dev4.gluu.org/oxauth/js/jquery-1.12.4.min.js] line=[2] lineSource=[null] lineOffset=[0]
10:53:51.782 [main] ERROR com.gargoylesoftware.htmlunit.html.HtmlPage - Error loading JavaScript from [https://ce-dev4.gluu.org/oxauth/js/platform.js].
java.io.IOException: Unable to download JavaScript from 'https://ce-dev4.gluu.org/oxauth/js/platform.js' (status 404).
	at com.gargoylesoftware.htmlunit.html.HtmlPage.loadJavaScriptFromUrl(HtmlPage.java:1055) ~[htmlunit-2.20.jar:2.20]
	at com.gargoylesoftware.htmlunit.html.HtmlPage.loadExternalJavaScriptFile(HtmlPage.java:982) [htmlunit-2.20.jar:2.20]
	at com.gargoylesoftware.htmlunit.html.HtmlScript.executeScriptIfNeeded(HtmlScript.java:352) [htmlunit-2.20.jar:2.20]
	at com.gargoylesoftware.htmlunit.html.HtmlScript$2.execute(HtmlScript.java:238) [htmlunit-2.20.jar:2.20]
	at com.gargoylesoftware.htmlunit.html.HtmlScript.onAllChildrenAddedToPage(HtmlScript.java:257) [htmlunit-2.20.jar:2.20]
	at com.gargoylesoftware.htmlunit.html.HTMLParser$HtmlUnitDOMBuilder.endElement(HTMLParser.java:747) [htmlunit-2.20.jar:2.20]
	at org.apache.xerces.parsers.AbstractSAXParser.endElement(Unknown Source) [xercesImpl-2.11.0.jar:?]
	at com.gargoylesoftware.htmlunit.html.HTMLParser$HtmlUnitDOMBuilder.endElement(HTMLParser.java:704) [htmlunit-2.20.jar:2.20]
	at org.cyberneko.html.HTMLTagBalancer.callEndElement(HTMLTagBalancer.java:1170) [nekohtml-1.9.22.jar:1.9.22]
	at org.cyberneko.html.HTMLTagBalancer.endElement(HTMLTagBalancer.java:1072) [nekohtml-1.9.22.jar:1.9.22]
	at org.cyberneko.html.filters.DefaultFilter.endElement(DefaultFilter.java:206) [nekohtml-1.9.22.jar:?]
	at org.cyberneko.html.filters.NamespaceBinder.endElement(NamespaceBinder.java:330) [nekohtml-1.9.22.jar:?]
	at org.cyberneko.html.HTMLScanner$ContentScanner.scanEndElement(HTMLScanner.java:3126) [nekohtml-1.9.22.jar:1.9.22]
	at org.cyberneko.html.HTMLScanner$ContentScanner.scan(HTMLScanner.java:2093) [nekohtml-1.9.22.jar:1.9.22]
	at org.cyberneko.html.HTMLScanner.scanDocument(HTMLScanner.java:920) [nekohtml-1.9.22.jar:1.9.22]
	at org.cyberneko.html.HTMLConfiguration.parse(HTMLConfiguration.java:499) [nekohtml-1.9.22.jar:1.9.22]
	at org.cyberneko.html.HTMLConfiguration.parse(HTMLConfiguration.java:452) [nekohtml-1.9.22.jar:1.9.22]
	at org.apache.xerces.parsers.XMLParser.parse(Unknown Source) [xercesImpl-2.11.0.jar:?]
	at com.gargoylesoftware.htmlunit.html.HTMLParser$HtmlUnitDOMBuilder.parse(HTMLParser.java:924) [htmlunit-2.20.jar:2.20]
	at com.gargoylesoftware.htmlunit.html.HTMLParser.parse(HTMLParser.java:238) [htmlunit-2.20.jar:2.20]
	at com.gargoylesoftware.htmlunit.html.HTMLParser.parseHtml(HTMLParser.java:184) [htmlunit-2.20.jar:2.20]
	at com.gargoylesoftware.htmlunit.DefaultPageCreator.createHtmlPage(DefaultPageCreator.java:269) [htmlunit-2.20.jar:2.20]
	at com.gargoylesoftware.htmlunit.DefaultPageCreator.createPage(DefaultPageCreator.java:157) [htmlunit-2.20.jar:2.20]
	at com.gargoylesoftware.htmlunit.WebClient.loadWebResponseInto(WebClient.java:477) [htmlunit-2.20.jar:2.20]
	at com.gargoylesoftware.htmlunit.WebClient.getPage(WebClient.java:351) [htmlunit-2.20.jar:2.20]
	at com.gargoylesoftware.htmlunit.WebClient.getPage(WebClient.java:416) [htmlunit-2.20.jar:2.20]
	at org.openqa.selenium.htmlunit.HtmlUnitDriver.get(HtmlUnitDriver.java:528) [htmlunit-driver-2.21.jar:?]
	at org.openqa.selenium.htmlunit.HtmlUnitDriver.get(HtmlUnitDriver.java:517) [htmlunit-driver-2.21.jar:?]
	at org.openqa.selenium.htmlunit.HtmlUnitDriver$HtmlUnitNavigation.to(HtmlUnitDriver.java:1421) [htmlunit-driver-2.21.jar:?]
	at org.xdi.oxauth.BaseTest.processAuthentication(BaseTest.java:337) [test-classes/:?]
	at org.xdi.oxauth.BaseTest.authenticateResourceOwnerAndGrantAccess(BaseTest.java:283) [test-classes/:?]
	at org.xdi.oxauth.BaseTest.authenticateResourceOwnerAndGrantAccess(BaseTest.java:271) [test-classes/:?]
	at org.xdi.oxauth.BaseTest.authenticateResourceOwnerAndGrantAccess(BaseTest.java:261) [test-classes/:?]
	at org.xdi.oxauth.BaseTest.authenticateResourceOwnerAndGrantAccess(BaseTest.java:252) [test-classes/:?]
	at org.xdi.oxauth.interop.UsesSymmetricIdTokenSignatures.usesSymmetricIdTokenSignaturesHS384(UsesSymmetricIdTokenSignatures.java:125) [test-classes/:?]
	at sun.reflect.NativeMethodAccessorImpl.invoke0(Native Method) ~[?:1.8.0_121]
	at sun.reflect.NativeMethodAccessorImpl.invoke(NativeMethodAccessorImpl.java:62) ~[?:1.8.0_121]
	at sun.reflect.DelegatingMethodAccessorImpl.invoke(DelegatingMethodAccessorImpl.java:43) ~[?:1.8.0_121]
	at java.lang.reflect.Method.invoke(Method.java:498) ~[?:1.8.0_121]
	at org.testng.internal.MethodInvocationHelper.invokeMethod(MethodInvocationHelper.java:108) [testng-6.11.jar:?]
	at org.testng.internal.Invoker.invokeMethod(Invoker.java:661) [testng-6.11.jar:?]
	at org.testng.internal.Invoker.invokeTestMethod(Invoker.java:869) [testng-6.11.jar:?]
	at org.testng.internal.Invoker.invokeTestMethods(Invoker.java:1193) [testng-6.11.jar:?]
	at org.testng.internal.TestMethodWorker.invokeTestMethods(TestMethodWorker.java:126) [testng-6.11.jar:?]
	at org.testng.internal.TestMethodWorker.run(TestMethodWorker.java:109) [testng-6.11.jar:?]
	at org.testng.TestRunner.privateRun(TestRunner.java:744) [testng-6.11.jar:?]
	at org.testng.TestRunner.run(TestRunner.java:602) [testng-6.11.jar:?]
	at org.testng.SuiteRunner.runTest(SuiteRunner.java:380) [testng-6.11.jar:?]
	at org.testng.SuiteRunner.runSequentially(SuiteRunner.java:375) [testng-6.11.jar:?]
	at org.testng.SuiteRunner.privateRun(SuiteRunner.java:340) [testng-6.11.jar:?]
	at org.testng.SuiteRunner.run(SuiteRunner.java:289) [testng-6.11.jar:?]
	at org.testng.SuiteRunnerWorker.runSuite(SuiteRunnerWorker.java:52) [testng-6.11.jar:?]
	at org.testng.SuiteRunnerWorker.run(SuiteRunnerWorker.java:86) [testng-6.11.jar:?]
	at org.testng.TestNG.runSuitesSequentially(TestNG.java:1301) [testng-6.11.jar:?]
	at org.testng.TestNG.runSuitesLocally(TestNG.java:1226) [testng-6.11.jar:?]
	at org.testng.TestNG.runSuites(TestNG.java:1144) [testng-6.11.jar:?]
	at org.testng.TestNG.run(TestNG.java:1115) [testng-6.11.jar:?]
	at org.apache.maven.surefire.testng.TestNGExecutor.run(TestNGExecutor.java:281) [surefire-testng-2.19.1.jar:2.19.1]
	at org.apache.maven.surefire.testng.TestNGXmlTestSuite.execute(TestNGXmlTestSuite.java:75) [surefire-testng-2.19.1.jar:2.19.1]
	at org.apache.maven.surefire.testng.TestNGProvider.invoke(TestNGProvider.java:121) [surefire-testng-2.19.1.jar:2.19.1]
	at org.apache.maven.surefire.booter.ForkedBooter.invokeProviderInSameClassLoader(ForkedBooter.java:290) [surefire-booter-2.19.1.jar:2.19.1]
	at org.apache.maven.surefire.booter.ForkedBooter.runSuitesInProcess(ForkedBooter.java:242) [surefire-booter-2.19.1.jar:2.19.1]
	at org.apache.maven.surefire.booter.ForkedBooter.main(ForkedBooter.java:121) [surefire-booter-2.19.1.jar:2.19.1]
authenticateResourceOwnerAndGrantAccess: sessionState:feef777c-40ef-47e4-ab40-4e6e562614b1
-------------------------------------------------------
REQUEST:
-------------------------------------------------------
https://ce-dev4.gluu.org/oxauth/restv1/authorize?response_type=id_token&client_id=%40%2138D4.410C.1D43.8932%210001%2137F2.B744%210008%2167E4.AF59.948D.FF7C&scope=openid+profile+address+email&redirect_uri=https%3A%2F%2Fce-dev4.gluu.org%2Foxauth-rp%2Fhome.htm&state=efdb0ea8-c3ec-4d88-abd3-7bbe20310c17&nonce=d2f3c78d-4455-4340-9811-a2c1cdd16164

-------------------------------------------------------
RESPONSE:
-------------------------------------------------------
HTTP/1.1 302 Found
Location: https://ce-dev4.gluu.org/oxauth-rp/home.htm#scope=address+openid+profile+email&id_token=eyJ0eXAiOiJKV1QiLCJhbGciOiJIUzM4NCJ9.eyJpc3MiOiJodHRwczovL2NlLWRldjQuZ2x1dS5vcmciLCJhdWQiOiJAITM4RDQuNDEwQy4xRDQzLjg5MzIhMDAwMSEzN0YyLkI3NDQhMDAwOCE2N0U0LkFGNTkuOTQ4RC5GRjdDIiwiZXhwIjoxNTMwNzE5NjEzLCJpYXQiOjE1MzA3MTYwMTMsIm5vbmNlIjoiZDJmM2M3OGQtNDQ1NS00MzQwLTk4MTEtYTJjMWNkZDE2MTY0IiwiYXV0aF90aW1lIjoxNTMwNzE2MDEzLCJveE9wZW5JRENvbm5lY3RWZXJzaW9uIjoib3BlbmlkY29ubmVjdC0xLjAiLCJzdWIiOiJTRUlUZ1dwVDdsSF91aUNUWTdJUURQNlc5VUIzRFJNODVyMU1lWGlVS2hzIn0.3x9a4mn4HSWeNDx_n7W97xzT2qu4i8l8ZITx362083L2UIDU3mIgELhj4eQcQk7-&session_id=2b266a11-1980-4d3c-ad68-677b9862cc33&state=efdb0ea8-c3ec-4d88-abd3-7bbe20310c17&session_state=feef777c-40ef-47e4-ab40-4e6e562614b1

#######################################################
TEST: OC5:FeatureTest-Uses Symmetric ID Token Signatures HS512
#######################################################
-------------------------------------------------------
REQUEST:
-------------------------------------------------------
POST /oxauth/restv1/register HTTP/1.1
Content-Type: application/json
Accept: application/json
Host: ce-dev4.gluu.org

{
    "redirect_uris": [
        "https://ce-dev4.gluu.org/oxauth-rp/home.htm",
        "https://client.example.com/cb",
        "https://client.example.com/cb1",
        "https://client.example.com/cb2"
    ],
    "response_types": ["id_token"],
    "application_type": "web",
    "client_name": "oxAuth test app",
    "sector_identifier_uri": "https://ce-dev4.gluu.org/oxauth/sectoridentifier/@!38D4.410C.1D43.8932!0001!37F2.B744!0012!D426.70FD",
    "id_token_signed_response_alg": "HS512"
}

-------------------------------------------------------
RESPONSE:
-------------------------------------------------------
HTTP/1.1 200
Cache-Control: no-store
Connection: Keep-Alive
Content-Length: 1340
Content-Type: application/json
Date: Wed, 04 Jul 2018 14:53:33 GMT
Keep-Alive: timeout=5, max=100
Pragma: no-cache
Server: Jetty(9.4.9.v20180320)
Strict-Transport-Security: max-age=31536000; includeSubDomains
X-Content-Type-Options: nosniff
X-Xss-Protection: 1; mode=block

{
    "client_id": "@!38D4.410C.1D43.8932!0001!37F2.B744!0008!A06E.ACC3.8F23.03D6",
    "client_secret": "73c0c794-c6e3-4a09-bfff-a5f768ab1507",
    "registration_access_token": "7557b4fc-507d-45f7-b2be-af705f4afdd7",
    "registration_client_uri": "https://ce-dev4.gluu.org/oxauth/restv1/register?client_id=@!38D4.410C.1D43.8932!0001!37F2.B744!0008!A06E.ACC3.8F23.03D6",
    "client_id_issued_at": 1530716013,
    "client_secret_expires_at": 1530802413,
    "redirect_uris": [
        "https://client.example.com/cb2",
        "https://client.example.com/cb1",
        "https://client.example.com/cb",
        "https://ce-dev4.gluu.org/oxauth-rp/home.htm"
    ],
    "response_types": [
        "token",
        "id_token"
    ],
    "grant_types": ["implicit"],
    "application_type": "web",
    "client_name": "oxAuth test app",
    "sector_identifier_uri": "https://ce-dev4.gluu.org/oxauth/sectoridentifier/@!38D4.410C.1D43.8932!0001!37F2.B744!0012!D426.70FD",
    "subject_type": "pairwise",
    "id_token_signed_response_alg": "HS512",
    "token_endpoint_auth_method": "client_secret_basic",
    "require_auth_time": false,
    "frontchannel_logout_session_required": false,
    "scope": "permission uma_protection clientinfo email user_name sub org_name address openid test_scope1 work_phone phone profile test",
    "claims": ""
}

authenticateResourceOwnerAndGrantAccess: Cleaning cookies
authenticateResourceOwnerAndGrantAccess: authorizationRequestUrl:https://ce-dev4.gluu.org/oxauth/restv1/authorize?response_type=id_token&client_id=%40%2138D4.410C.1D43.8932%210001%2137F2.B744%210008%21A06E.ACC3.8F23.03D6&scope=openid+profile+address+email&redirect_uri=https%3A%2F%2Fce-dev4.gluu.org%2Foxauth-rp%2Fhome.htm&state=b1a931f6-7417-4e1a-a118-1b900e5cba1d&nonce=171d5764-12a0-4ebe-9ac0-7da3fe64441e
10:53:53.360 [main] ERROR com.gargoylesoftware.htmlunit.javascript.StrictErrorReporter - runtimeError: message=[An invalid or illegal selector was specified (selector: '*,:x' error: Invalid selector: :x).] sourceName=[https://ce-dev4.gluu.org/oxauth/js/jquery-1.12.4.min.js] line=[2] lineSource=[null] lineOffset=[0]
10:53:53.396 [main] ERROR com.gargoylesoftware.htmlunit.html.HtmlPage - Error loading JavaScript from [https://ce-dev4.gluu.org/oxauth/js/platform.js].
java.io.IOException: Unable to download JavaScript from 'https://ce-dev4.gluu.org/oxauth/js/platform.js' (status 404).
	at com.gargoylesoftware.htmlunit.html.HtmlPage.loadJavaScriptFromUrl(HtmlPage.java:1055) ~[htmlunit-2.20.jar:2.20]
	at com.gargoylesoftware.htmlunit.html.HtmlPage.loadExternalJavaScriptFile(HtmlPage.java:982) [htmlunit-2.20.jar:2.20]
	at com.gargoylesoftware.htmlunit.html.HtmlScript.executeScriptIfNeeded(HtmlScript.java:352) [htmlunit-2.20.jar:2.20]
	at com.gargoylesoftware.htmlunit.html.HtmlScript$2.execute(HtmlScript.java:238) [htmlunit-2.20.jar:2.20]
	at com.gargoylesoftware.htmlunit.html.HtmlScript.onAllChildrenAddedToPage(HtmlScript.java:257) [htmlunit-2.20.jar:2.20]
	at com.gargoylesoftware.htmlunit.html.HTMLParser$HtmlUnitDOMBuilder.endElement(HTMLParser.java:747) [htmlunit-2.20.jar:2.20]
	at org.apache.xerces.parsers.AbstractSAXParser.endElement(Unknown Source) [xercesImpl-2.11.0.jar:?]
	at com.gargoylesoftware.htmlunit.html.HTMLParser$HtmlUnitDOMBuilder.endElement(HTMLParser.java:704) [htmlunit-2.20.jar:2.20]
	at org.cyberneko.html.HTMLTagBalancer.callEndElement(HTMLTagBalancer.java:1170) [nekohtml-1.9.22.jar:1.9.22]
	at org.cyberneko.html.HTMLTagBalancer.endElement(HTMLTagBalancer.java:1072) [nekohtml-1.9.22.jar:1.9.22]
	at org.cyberneko.html.filters.DefaultFilter.endElement(DefaultFilter.java:206) [nekohtml-1.9.22.jar:?]
	at org.cyberneko.html.filters.NamespaceBinder.endElement(NamespaceBinder.java:330) [nekohtml-1.9.22.jar:?]
	at org.cyberneko.html.HTMLScanner$ContentScanner.scanEndElement(HTMLScanner.java:3126) [nekohtml-1.9.22.jar:1.9.22]
	at org.cyberneko.html.HTMLScanner$ContentScanner.scan(HTMLScanner.java:2093) [nekohtml-1.9.22.jar:1.9.22]
	at org.cyberneko.html.HTMLScanner.scanDocument(HTMLScanner.java:920) [nekohtml-1.9.22.jar:1.9.22]
	at org.cyberneko.html.HTMLConfiguration.parse(HTMLConfiguration.java:499) [nekohtml-1.9.22.jar:1.9.22]
	at org.cyberneko.html.HTMLConfiguration.parse(HTMLConfiguration.java:452) [nekohtml-1.9.22.jar:1.9.22]
	at org.apache.xerces.parsers.XMLParser.parse(Unknown Source) [xercesImpl-2.11.0.jar:?]
	at com.gargoylesoftware.htmlunit.html.HTMLParser$HtmlUnitDOMBuilder.parse(HTMLParser.java:924) [htmlunit-2.20.jar:2.20]
	at com.gargoylesoftware.htmlunit.html.HTMLParser.parse(HTMLParser.java:238) [htmlunit-2.20.jar:2.20]
	at com.gargoylesoftware.htmlunit.html.HTMLParser.parseHtml(HTMLParser.java:184) [htmlunit-2.20.jar:2.20]
	at com.gargoylesoftware.htmlunit.DefaultPageCreator.createHtmlPage(DefaultPageCreator.java:269) [htmlunit-2.20.jar:2.20]
	at com.gargoylesoftware.htmlunit.DefaultPageCreator.createPage(DefaultPageCreator.java:157) [htmlunit-2.20.jar:2.20]
	at com.gargoylesoftware.htmlunit.WebClient.loadWebResponseInto(WebClient.java:477) [htmlunit-2.20.jar:2.20]
	at com.gargoylesoftware.htmlunit.WebClient.getPage(WebClient.java:351) [htmlunit-2.20.jar:2.20]
	at com.gargoylesoftware.htmlunit.WebClient.getPage(WebClient.java:416) [htmlunit-2.20.jar:2.20]
	at org.openqa.selenium.htmlunit.HtmlUnitDriver.get(HtmlUnitDriver.java:528) [htmlunit-driver-2.21.jar:?]
	at org.openqa.selenium.htmlunit.HtmlUnitDriver.get(HtmlUnitDriver.java:517) [htmlunit-driver-2.21.jar:?]
	at org.openqa.selenium.htmlunit.HtmlUnitDriver$HtmlUnitNavigation.to(HtmlUnitDriver.java:1421) [htmlunit-driver-2.21.jar:?]
	at org.xdi.oxauth.BaseTest.processAuthentication(BaseTest.java:337) [test-classes/:?]
	at org.xdi.oxauth.BaseTest.authenticateResourceOwnerAndGrantAccess(BaseTest.java:283) [test-classes/:?]
	at org.xdi.oxauth.BaseTest.authenticateResourceOwnerAndGrantAccess(BaseTest.java:271) [test-classes/:?]
	at org.xdi.oxauth.BaseTest.authenticateResourceOwnerAndGrantAccess(BaseTest.java:261) [test-classes/:?]
	at org.xdi.oxauth.BaseTest.authenticateResourceOwnerAndGrantAccess(BaseTest.java:252) [test-classes/:?]
	at org.xdi.oxauth.interop.UsesSymmetricIdTokenSignatures.usesSymmetricIdTokenSignaturesHS512(UsesSymmetricIdTokenSignatures.java:178) [test-classes/:?]
	at sun.reflect.NativeMethodAccessorImpl.invoke0(Native Method) ~[?:1.8.0_121]
	at sun.reflect.NativeMethodAccessorImpl.invoke(NativeMethodAccessorImpl.java:62) ~[?:1.8.0_121]
	at sun.reflect.DelegatingMethodAccessorImpl.invoke(DelegatingMethodAccessorImpl.java:43) ~[?:1.8.0_121]
	at java.lang.reflect.Method.invoke(Method.java:498) ~[?:1.8.0_121]
	at org.testng.internal.MethodInvocationHelper.invokeMethod(MethodInvocationHelper.java:108) [testng-6.11.jar:?]
	at org.testng.internal.Invoker.invokeMethod(Invoker.java:661) [testng-6.11.jar:?]
	at org.testng.internal.Invoker.invokeTestMethod(Invoker.java:869) [testng-6.11.jar:?]
	at org.testng.internal.Invoker.invokeTestMethods(Invoker.java:1193) [testng-6.11.jar:?]
	at org.testng.internal.TestMethodWorker.invokeTestMethods(TestMethodWorker.java:126) [testng-6.11.jar:?]
	at org.testng.internal.TestMethodWorker.run(TestMethodWorker.java:109) [testng-6.11.jar:?]
	at org.testng.TestRunner.privateRun(TestRunner.java:744) [testng-6.11.jar:?]
	at org.testng.TestRunner.run(TestRunner.java:602) [testng-6.11.jar:?]
	at org.testng.SuiteRunner.runTest(SuiteRunner.java:380) [testng-6.11.jar:?]
	at org.testng.SuiteRunner.runSequentially(SuiteRunner.java:375) [testng-6.11.jar:?]
	at org.testng.SuiteRunner.privateRun(SuiteRunner.java:340) [testng-6.11.jar:?]
	at org.testng.SuiteRunner.run(SuiteRunner.java:289) [testng-6.11.jar:?]
	at org.testng.SuiteRunnerWorker.runSuite(SuiteRunnerWorker.java:52) [testng-6.11.jar:?]
	at org.testng.SuiteRunnerWorker.run(SuiteRunnerWorker.java:86) [testng-6.11.jar:?]
	at org.testng.TestNG.runSuitesSequentially(TestNG.java:1301) [testng-6.11.jar:?]
	at org.testng.TestNG.runSuitesLocally(TestNG.java:1226) [testng-6.11.jar:?]
	at org.testng.TestNG.runSuites(TestNG.java:1144) [testng-6.11.jar:?]
	at org.testng.TestNG.run(TestNG.java:1115) [testng-6.11.jar:?]
	at org.apache.maven.surefire.testng.TestNGExecutor.run(TestNGExecutor.java:281) [surefire-testng-2.19.1.jar:2.19.1]
	at org.apache.maven.surefire.testng.TestNGXmlTestSuite.execute(TestNGXmlTestSuite.java:75) [surefire-testng-2.19.1.jar:2.19.1]
	at org.apache.maven.surefire.testng.TestNGProvider.invoke(TestNGProvider.java:121) [surefire-testng-2.19.1.jar:2.19.1]
	at org.apache.maven.surefire.booter.ForkedBooter.invokeProviderInSameClassLoader(ForkedBooter.java:290) [surefire-booter-2.19.1.jar:2.19.1]
	at org.apache.maven.surefire.booter.ForkedBooter.runSuitesInProcess(ForkedBooter.java:242) [surefire-booter-2.19.1.jar:2.19.1]
	at org.apache.maven.surefire.booter.ForkedBooter.main(ForkedBooter.java:121) [surefire-booter-2.19.1.jar:2.19.1]
authenticateResourceOwnerAndGrantAccess: sessionState:6ce1bdf3-c9e8-41c8-be22-e0c500135276
-------------------------------------------------------
REQUEST:
-------------------------------------------------------
https://ce-dev4.gluu.org/oxauth/restv1/authorize?response_type=id_token&client_id=%40%2138D4.410C.1D43.8932%210001%2137F2.B744%210008%21A06E.ACC3.8F23.03D6&scope=openid+profile+address+email&redirect_uri=https%3A%2F%2Fce-dev4.gluu.org%2Foxauth-rp%2Fhome.htm&state=b1a931f6-7417-4e1a-a118-1b900e5cba1d&nonce=171d5764-12a0-4ebe-9ac0-7da3fe64441e

-------------------------------------------------------
RESPONSE:
-------------------------------------------------------
HTTP/1.1 302 Found
Location: https://ce-dev4.gluu.org/oxauth-rp/home.htm#scope=address+openid+profile+email&id_token=eyJ0eXAiOiJKV1QiLCJhbGciOiJIUzUxMiJ9.eyJpc3MiOiJodHRwczovL2NlLWRldjQuZ2x1dS5vcmciLCJhdWQiOiJAITM4RDQuNDEwQy4xRDQzLjg5MzIhMDAwMSEzN0YyLkI3NDQhMDAwOCFBMDZFLkFDQzMuOEYyMy4wM0Q2IiwiZXhwIjoxNTMwNzE5NjE0LCJpYXQiOjE1MzA3MTYwMTQsIm5vbmNlIjoiMTcxZDU3NjQtMTJhMC00ZWJlLTlhYzAtN2RhM2ZlNjQ0NDFlIiwiYXV0aF90aW1lIjoxNTMwNzE2MDE0LCJveE9wZW5JRENvbm5lY3RWZXJzaW9uIjoib3BlbmlkY29ubmVjdC0xLjAiLCJzdWIiOiI2ZWpCRU5qRnpWY0VPOEg3NmR6eVgxZHpON0hyWk1UcnM2UnYzUkR6clJRIn0.KToaNwio8RHqk2-3F8aE4Zl3xpe0-LWSaQOf5S_AporDBnN293Dibk9jh4oifj9MwWt_xfj0wJYUJwZdTRCkjA&session_id=1f041841-db7c-4730-8902-5211ab39d970&state=b1a931f6-7417-4e1a-a118-1b900e5cba1d&session_state=6ce1bdf3-c9e8-41c8-be22-e0c500135276

#######################################################
TEST: OpenID Connect Discovery
#######################################################
-------------------------------------------------------
REQUEST:
-------------------------------------------------------
GET /.well-known/webfinger?resource=acct%3Atest_user%40ce-dev4.gluu.org&rel=http%3A%2F%2Fopenid.net%2Fspecs%2Fconnect%2F1.0%2Fissuer HTTP/1.1
Host: ce-dev4.gluu.org

-------------------------------------------------------
RESPONSE:
-------------------------------------------------------
HTTP/1.1 200
Connection: Keep-Alive
Content-Length: 181
Content-Type: application/jrd+json;charset=iso-8859-1
Date: Wed, 04 Jul 2018 14:53:34 GMT
Keep-Alive: timeout=5, max=100
Server: Jetty(9.4.9.v20180320)
Strict-Transport-Security: max-age=31536000; includeSubDomains
X-Content-Type-Options: nosniff
X-Xss-Protection: 1; mode=block

{
    "subject": "acct:test_user@ce-dev4.gluu.org",
    "links": [{
        "rel": "http://openid.net/specs/connect/1.0/issuer",
        "href": "https://ce-dev4.gluu.org"
    }]
}


OpenID Connect Configuration
-------------------------------------------------------
REQUEST:
-------------------------------------------------------
GET /.well-known/openid-configuration HTTP/1.1
Host: ce-dev4.gluu.org

-------------------------------------------------------
RESPONSE:
-------------------------------------------------------
HTTP/1.1 200
Connection: Keep-Alive
Content-Length: 6342
Content-Type: application/json
Date: Wed, 04 Jul 2018 14:53:34 GMT
Keep-Alive: timeout=5, max=100
Server: Jetty(9.4.9.v20180320)
Strict-Transport-Security: max-age=31536000; includeSubDomains
X-Content-Type-Options: nosniff
X-Xss-Protection: 1; mode=block

{
    "issuer": "https://ce-dev4.gluu.org",
    "authorization_endpoint": "https://ce-dev4.gluu.org/oxauth/restv1/authorize",
    "token_endpoint": "https://ce-dev4.gluu.org/oxauth/restv1/token",
    "userinfo_endpoint": "https://ce-dev4.gluu.org/oxauth/restv1/userinfo",
    "clientinfo_endpoint": "https://ce-dev4.gluu.org/oxauth/restv1/clientinfo",
    "check_session_iframe": "https://ce-dev4.gluu.org/oxauth/opiframe",
    "end_session_endpoint": "https://ce-dev4.gluu.org/oxauth/restv1/end_session",
    "jwks_uri": "https://ce-dev4.gluu.org/oxauth/restv1/jwks",
    "registration_endpoint": "https://ce-dev4.gluu.org/oxauth/restv1/register",
    "id_generation_endpoint": "https://ce-dev4.gluu.org/oxauth/restv1/id",
    "introspection_endpoint": "https://ce-dev4.gluu.org/oxauth/restv1/introspection",
    "scopes_supported": [
        "permission",
        "clientinfo",
        "email",
        "user_name",
        "sub",
        "org_name",
        "address",
        "openid",
        "test_scope1",
        "work_phone",
        "phone",
        "profile",
        "mobile_phone",
        "test"
    ],
    "response_types_supported": [
        "code id_token",
        "token code id_token",
        "token code",
        "token",
        "code",
        "token id_token",
        "id_token"
    ],
    "grant_types_supported": [
        "urn:ietf:params:oauth:grant-type:uma-ticket",
        "client_credentials",
        "refresh_token",
        "implicit",
        "authorization_code",
        "password"
    ],
    "acr_values_supported": [
        "super_gluu",
        "u2f",
        "otp",
        "basic",
        "auth_ldap_server"
    ],
    "auth_level_mapping": {
        "-1": ["auth_ldap_server"],
        "50": ["otp"],
        "100": ["basic"],
        "10": ["u2f"],
        "15": ["super_gluu"]
    },
    "subject_types_supported": [
        "public",
        "pairwise"
    ],
    "userinfo_signing_alg_values_supported": [
        "HS256",
        "HS384",
        "HS512",
        "RS256",
        "RS384",
        "RS512",
        "ES256",
        "ES384",
        "ES512"
    ],
    "userinfo_encryption_alg_values_supported": [
        "RSA1_5",
        "RSA-OAEP",
        "A128KW",
        "A256KW"
    ],
    "userinfo_encryption_enc_values_supported": [
        "RSA1_5",
        "RSA-OAEP",
        "A128KW",
        "A256KW"
    ],
    "id_token_signing_alg_values_supported": [
        "none",
        "HS256",
        "HS384",
        "HS512",
        "RS256",
        "RS384",
        "RS512",
        "ES256",
        "ES384",
        "ES512"
    ],
    "id_token_encryption_alg_values_supported": [
        "RSA1_5",
        "RSA-OAEP",
        "A128KW",
        "A256KW"
    ],
    "id_token_encryption_enc_values_supported": [
        "A128CBC+HS256",
        "A256CBC+HS512",
        "A128GCM",
        "A256GCM"
    ],
    "request_object_signing_alg_values_supported": [
        "none",
        "HS256",
        "HS384",
        "HS512",
        "RS256",
        "RS384",
        "RS512",
        "ES256",
        "ES384",
        "ES512"
    ],
    "request_object_encryption_alg_values_supported": [
        "RSA1_5",
        "RSA-OAEP",
        "A128KW",
        "A256KW"
    ],
    "request_object_encryption_enc_values_supported": [
        "A128CBC+HS256",
        "A256CBC+HS512",
        "A128GCM",
        "A256GCM"
    ],
    "token_endpoint_auth_methods_supported": [
        "client_secret_basic",
        "client_secret_post",
        "client_secret_jwt",
        "private_key_jwt"
    ],
    "token_endpoint_auth_signing_alg_values_supported": [
        "HS256",
        "HS384",
        "HS512",
        "RS256",
        "RS384",
        "RS512",
        "ES256",
        "ES384",
        "ES512"
    ],
    "display_values_supported": [
        "page",
        "popup"
    ],
    "claim_types_supported": ["normal"],
    "claims_supported": [
        "birthdate",
        "country",
        "name",
        "email",
        "email_verified",
        "given_name",
        "gender",
        "inum",
        "family_name",
        "updated_at",
        "locale",
        "member_of",
        "middle_name",
        "nickname",
        "oxAuthAppType",
        "oxAuthIdTokenSignedResponseAlg",
        "oxAuthRedirectURI",
        "oxAuthScope",
        "phone_number_verified",
        "picture",
        "preferred_username",
        "profile",
        "zoneinfo",
        "user_name",
        "website"
    ],
    "service_documentation": "http://gluu.org/docs",
    "claims_locales_supported": ["en"],
    "ui_locales_supported": [
        "en",
        "es"
    ],
    "scope_to_claims_mapping": [
        {"permission": []},
        {"uma_protection": []},
        {"clientinfo": [
            "name",
            "inum",
            "oxAuthAppType",
            "oxAuthIdTokenSignedResponseAlg",
            "oxAuthRedirectURI",
            "oxAuthScope"
        ]},
        {"email": [
            "email_verified",
            "email"
        ]},
        {"user_name": ["user_name"]},
        {"sub": []},
        {"org_name": []},
        {"address": [
            "formatted",
            "postal_code",
            "street_address",
            "locality",
            "country",
            "region"
        ]},
        {"openid": []},
        {"test_scope1": []},
        {"work_phone": []},
        {"phone": [
            "phone_number_verified",
            "phone_number"
        ]},
        {"profile": [
            "name",
            "family_name",
            "given_name",
            "middle_name",
            "nickname",
            "preferred_username",
            "profile",
            "picture",
            "website",
            "gender",
            "birthdate",
            "zoneinfo",
            "locale",
            "updated_at"
        ]},
        {"mobile_phone": ["phone_mobile_number"]},
        {"test": ["member_of"]}
    ],
    "claims_parameter_supported": true,
    "request_parameter_supported": true,
    "request_uri_parameter_supported": true,
    "require_request_uri_registration": false,
    "op_policy_uri": "http://ox.gluu.org/doku.php?id=oxauth:policy",
    "op_tos_uri": "http://ox.gluu.org/doku.php?id=oxauth:tos",
    "frontchannel_logout_supported": true,
    "frontchannel_logout_session_supported": true
}


#######################################################
TEST: OC5:FeatureTest-Verifies Correct at hash when Implicit Flow Used
#######################################################
-------------------------------------------------------
REQUEST:
-------------------------------------------------------
POST /oxauth/restv1/register HTTP/1.1
Content-Type: application/json
Accept: application/json
Host: ce-dev4.gluu.org

{
    "redirect_uris": [
        "https://ce-dev4.gluu.org/oxauth-rp/home.htm",
        "https://client.example.com/cb",
        "https://client.example.com/cb1",
        "https://client.example.com/cb2"
    ],
    "response_types": [
        "token",
        "id_token"
    ],
    "application_type": "web",
    "client_name": "oxAuth test app",
    "sector_identifier_uri": "https://ce-dev4.gluu.org/oxauth/sectoridentifier/@!38D4.410C.1D43.8932!0001!37F2.B744!0012!D426.70FD"
}

-------------------------------------------------------
RESPONSE:
-------------------------------------------------------
HTTP/1.1 200
Cache-Control: no-store
Connection: Keep-Alive
Content-Length: 1340
Content-Type: application/json
Date: Wed, 04 Jul 2018 14:53:34 GMT
Keep-Alive: timeout=5, max=100
Pragma: no-cache
Server: Jetty(9.4.9.v20180320)
Strict-Transport-Security: max-age=31536000; includeSubDomains
X-Content-Type-Options: nosniff
X-Xss-Protection: 1; mode=block

{
    "client_id": "@!38D4.410C.1D43.8932!0001!37F2.B744!0008!FF56.F9CA.B35E.DBC1",
    "client_secret": "b81d1767-d575-4267-bc37-2f5b555d7bca",
    "registration_access_token": "fb0dda35-e613-4ebb-93f4-e641a3d1029e",
    "registration_client_uri": "https://ce-dev4.gluu.org/oxauth/restv1/register?client_id=@!38D4.410C.1D43.8932!0001!37F2.B744!0008!FF56.F9CA.B35E.DBC1",
    "client_id_issued_at": 1530716014,
    "client_secret_expires_at": 1530802414,
    "redirect_uris": [
        "https://client.example.com/cb2",
        "https://client.example.com/cb1",
        "https://client.example.com/cb",
        "https://ce-dev4.gluu.org/oxauth-rp/home.htm"
    ],
    "response_types": [
        "token",
        "id_token"
    ],
    "grant_types": ["implicit"],
    "application_type": "web",
    "client_name": "oxAuth test app",
    "sector_identifier_uri": "https://ce-dev4.gluu.org/oxauth/sectoridentifier/@!38D4.410C.1D43.8932!0001!37F2.B744!0012!D426.70FD",
    "subject_type": "pairwise",
    "id_token_signed_response_alg": "RS256",
    "token_endpoint_auth_method": "client_secret_basic",
    "require_auth_time": false,
    "frontchannel_logout_session_required": false,
    "scope": "permission uma_protection clientinfo email user_name sub org_name address openid test_scope1 work_phone phone profile test",
    "claims": ""
}

authenticateResourceOwnerAndGrantAccess: Cleaning cookies
authenticateResourceOwnerAndGrantAccess: authorizationRequestUrl:https://ce-dev4.gluu.org/oxauth/restv1/authorize?response_type=token+id_token&client_id=%40%2138D4.410C.1D43.8932%210001%2137F2.B744%210008%21FF56.F9CA.B35E.DBC1&scope=openid+profile+address+email&redirect_uri=https%3A%2F%2Fce-dev4.gluu.org%2Foxauth-rp%2Fhome.htm&state=2d10dd0b-f2c2-41da-a2ff-dde2a43b32c3&nonce=01124d7d-0788-416d-a747-18e44f124af1
10:53:54.833 [main] ERROR com.gargoylesoftware.htmlunit.javascript.StrictErrorReporter - runtimeError: message=[An invalid or illegal selector was specified (selector: '*,:x' error: Invalid selector: :x).] sourceName=[https://ce-dev4.gluu.org/oxauth/js/jquery-1.12.4.min.js] line=[2] lineSource=[null] lineOffset=[0]
10:53:54.860 [main] ERROR com.gargoylesoftware.htmlunit.html.HtmlPage - Error loading JavaScript from [https://ce-dev4.gluu.org/oxauth/js/platform.js].
java.io.IOException: Unable to download JavaScript from 'https://ce-dev4.gluu.org/oxauth/js/platform.js' (status 404).
	at com.gargoylesoftware.htmlunit.html.HtmlPage.loadJavaScriptFromUrl(HtmlPage.java:1055) ~[htmlunit-2.20.jar:2.20]
	at com.gargoylesoftware.htmlunit.html.HtmlPage.loadExternalJavaScriptFile(HtmlPage.java:982) [htmlunit-2.20.jar:2.20]
	at com.gargoylesoftware.htmlunit.html.HtmlScript.executeScriptIfNeeded(HtmlScript.java:352) [htmlunit-2.20.jar:2.20]
	at com.gargoylesoftware.htmlunit.html.HtmlScript$2.execute(HtmlScript.java:238) [htmlunit-2.20.jar:2.20]
	at com.gargoylesoftware.htmlunit.html.HtmlScript.onAllChildrenAddedToPage(HtmlScript.java:257) [htmlunit-2.20.jar:2.20]
	at com.gargoylesoftware.htmlunit.html.HTMLParser$HtmlUnitDOMBuilder.endElement(HTMLParser.java:747) [htmlunit-2.20.jar:2.20]
	at org.apache.xerces.parsers.AbstractSAXParser.endElement(Unknown Source) [xercesImpl-2.11.0.jar:?]
	at com.gargoylesoftware.htmlunit.html.HTMLParser$HtmlUnitDOMBuilder.endElement(HTMLParser.java:704) [htmlunit-2.20.jar:2.20]
	at org.cyberneko.html.HTMLTagBalancer.callEndElement(HTMLTagBalancer.java:1170) [nekohtml-1.9.22.jar:1.9.22]
	at org.cyberneko.html.HTMLTagBalancer.endElement(HTMLTagBalancer.java:1072) [nekohtml-1.9.22.jar:1.9.22]
	at org.cyberneko.html.filters.DefaultFilter.endElement(DefaultFilter.java:206) [nekohtml-1.9.22.jar:?]
	at org.cyberneko.html.filters.NamespaceBinder.endElement(NamespaceBinder.java:330) [nekohtml-1.9.22.jar:?]
	at org.cyberneko.html.HTMLScanner$ContentScanner.scanEndElement(HTMLScanner.java:3126) [nekohtml-1.9.22.jar:1.9.22]
	at org.cyberneko.html.HTMLScanner$ContentScanner.scan(HTMLScanner.java:2093) [nekohtml-1.9.22.jar:1.9.22]
	at org.cyberneko.html.HTMLScanner.scanDocument(HTMLScanner.java:920) [nekohtml-1.9.22.jar:1.9.22]
	at org.cyberneko.html.HTMLConfiguration.parse(HTMLConfiguration.java:499) [nekohtml-1.9.22.jar:1.9.22]
	at org.cyberneko.html.HTMLConfiguration.parse(HTMLConfiguration.java:452) [nekohtml-1.9.22.jar:1.9.22]
	at org.apache.xerces.parsers.XMLParser.parse(Unknown Source) [xercesImpl-2.11.0.jar:?]
	at com.gargoylesoftware.htmlunit.html.HTMLParser$HtmlUnitDOMBuilder.parse(HTMLParser.java:924) [htmlunit-2.20.jar:2.20]
	at com.gargoylesoftware.htmlunit.html.HTMLParser.parse(HTMLParser.java:238) [htmlunit-2.20.jar:2.20]
	at com.gargoylesoftware.htmlunit.html.HTMLParser.parseHtml(HTMLParser.java:184) [htmlunit-2.20.jar:2.20]
	at com.gargoylesoftware.htmlunit.DefaultPageCreator.createHtmlPage(DefaultPageCreator.java:269) [htmlunit-2.20.jar:2.20]
	at com.gargoylesoftware.htmlunit.DefaultPageCreator.createPage(DefaultPageCreator.java:157) [htmlunit-2.20.jar:2.20]
	at com.gargoylesoftware.htmlunit.WebClient.loadWebResponseInto(WebClient.java:477) [htmlunit-2.20.jar:2.20]
	at com.gargoylesoftware.htmlunit.WebClient.getPage(WebClient.java:351) [htmlunit-2.20.jar:2.20]
	at com.gargoylesoftware.htmlunit.WebClient.getPage(WebClient.java:416) [htmlunit-2.20.jar:2.20]
	at org.openqa.selenium.htmlunit.HtmlUnitDriver.get(HtmlUnitDriver.java:528) [htmlunit-driver-2.21.jar:?]
	at org.openqa.selenium.htmlunit.HtmlUnitDriver.get(HtmlUnitDriver.java:517) [htmlunit-driver-2.21.jar:?]
	at org.openqa.selenium.htmlunit.HtmlUnitDriver$HtmlUnitNavigation.to(HtmlUnitDriver.java:1421) [htmlunit-driver-2.21.jar:?]
	at org.xdi.oxauth.BaseTest.processAuthentication(BaseTest.java:337) [test-classes/:?]
	at org.xdi.oxauth.BaseTest.authenticateResourceOwnerAndGrantAccess(BaseTest.java:283) [test-classes/:?]
	at org.xdi.oxauth.BaseTest.authenticateResourceOwnerAndGrantAccess(BaseTest.java:271) [test-classes/:?]
	at org.xdi.oxauth.BaseTest.authenticateResourceOwnerAndGrantAccess(BaseTest.java:261) [test-classes/:?]
	at org.xdi.oxauth.BaseTest.authenticateResourceOwnerAndGrantAccess(BaseTest.java:252) [test-classes/:?]
	at org.xdi.oxauth.interop.VerifiesCorrectAtHashWhenImplicitFlowUsed.verifiesCorrectAtHashWhenImplicitFlowUsed(VerifiesCorrectAtHashWhenImplicitFlowUsed.java:76) [test-classes/:?]
	at sun.reflect.NativeMethodAccessorImpl.invoke0(Native Method) ~[?:1.8.0_121]
	at sun.reflect.NativeMethodAccessorImpl.invoke(NativeMethodAccessorImpl.java:62) ~[?:1.8.0_121]
	at sun.reflect.DelegatingMethodAccessorImpl.invoke(DelegatingMethodAccessorImpl.java:43) ~[?:1.8.0_121]
	at java.lang.reflect.Method.invoke(Method.java:498) ~[?:1.8.0_121]
	at org.testng.internal.MethodInvocationHelper.invokeMethod(MethodInvocationHelper.java:108) [testng-6.11.jar:?]
	at org.testng.internal.Invoker.invokeMethod(Invoker.java:661) [testng-6.11.jar:?]
	at org.testng.internal.Invoker.invokeTestMethod(Invoker.java:869) [testng-6.11.jar:?]
	at org.testng.internal.Invoker.invokeTestMethods(Invoker.java:1193) [testng-6.11.jar:?]
	at org.testng.internal.TestMethodWorker.invokeTestMethods(TestMethodWorker.java:126) [testng-6.11.jar:?]
	at org.testng.internal.TestMethodWorker.run(TestMethodWorker.java:109) [testng-6.11.jar:?]
	at org.testng.TestRunner.privateRun(TestRunner.java:744) [testng-6.11.jar:?]
	at org.testng.TestRunner.run(TestRunner.java:602) [testng-6.11.jar:?]
	at org.testng.SuiteRunner.runTest(SuiteRunner.java:380) [testng-6.11.jar:?]
	at org.testng.SuiteRunner.runSequentially(SuiteRunner.java:375) [testng-6.11.jar:?]
	at org.testng.SuiteRunner.privateRun(SuiteRunner.java:340) [testng-6.11.jar:?]
	at org.testng.SuiteRunner.run(SuiteRunner.java:289) [testng-6.11.jar:?]
	at org.testng.SuiteRunnerWorker.runSuite(SuiteRunnerWorker.java:52) [testng-6.11.jar:?]
	at org.testng.SuiteRunnerWorker.run(SuiteRunnerWorker.java:86) [testng-6.11.jar:?]
	at org.testng.TestNG.runSuitesSequentially(TestNG.java:1301) [testng-6.11.jar:?]
	at org.testng.TestNG.runSuitesLocally(TestNG.java:1226) [testng-6.11.jar:?]
	at org.testng.TestNG.runSuites(TestNG.java:1144) [testng-6.11.jar:?]
	at org.testng.TestNG.run(TestNG.java:1115) [testng-6.11.jar:?]
	at org.apache.maven.surefire.testng.TestNGExecutor.run(TestNGExecutor.java:281) [surefire-testng-2.19.1.jar:2.19.1]
	at org.apache.maven.surefire.testng.TestNGXmlTestSuite.execute(TestNGXmlTestSuite.java:75) [surefire-testng-2.19.1.jar:2.19.1]
	at org.apache.maven.surefire.testng.TestNGProvider.invoke(TestNGProvider.java:121) [surefire-testng-2.19.1.jar:2.19.1]
	at org.apache.maven.surefire.booter.ForkedBooter.invokeProviderInSameClassLoader(ForkedBooter.java:290) [surefire-booter-2.19.1.jar:2.19.1]
	at org.apache.maven.surefire.booter.ForkedBooter.runSuitesInProcess(ForkedBooter.java:242) [surefire-booter-2.19.1.jar:2.19.1]
	at org.apache.maven.surefire.booter.ForkedBooter.main(ForkedBooter.java:121) [surefire-booter-2.19.1.jar:2.19.1]
authenticateResourceOwnerAndGrantAccess: sessionState:5d62453e-ead3-4f5a-afc2-d13319fbf405
-------------------------------------------------------
REQUEST:
-------------------------------------------------------
https://ce-dev4.gluu.org/oxauth/restv1/authorize?response_type=token+id_token&client_id=%40%2138D4.410C.1D43.8932%210001%2137F2.B744%210008%21FF56.F9CA.B35E.DBC1&scope=openid+profile+address+email&redirect_uri=https%3A%2F%2Fce-dev4.gluu.org%2Foxauth-rp%2Fhome.htm&state=2d10dd0b-f2c2-41da-a2ff-dde2a43b32c3&nonce=01124d7d-0788-416d-a747-18e44f124af1

-------------------------------------------------------
RESPONSE:
-------------------------------------------------------
HTTP/1.1 302 Found
Location: https://ce-dev4.gluu.org/oxauth-rp/home.htm#access_token=32275007-e401-4f0c-94b5-a7c6dc2e1fda&scope=address+openid+profile+email&id_token=eyJraWQiOiI4NzE2OGJjMS1lNTU4LTQxNjktOGRkMS05ZmJkNDUxZGU1ZDciLCJ0eXAiOiJKV1QiLCJhbGciOiJSUzI1NiJ9.eyJpc3MiOiJodHRwczovL2NlLWRldjQuZ2x1dS5vcmciLCJhdWQiOiJAITM4RDQuNDEwQy4xRDQzLjg5MzIhMDAwMSEzN0YyLkI3NDQhMDAwOCFGRjU2LkY5Q0EuQjM1RS5EQkMxIiwiZXhwIjoxNTMwNzE5NjE2LCJpYXQiOjE1MzA3MTYwMTYsIm5vbmNlIjoiMDExMjRkN2QtMDc4OC00MTZkLWE3NDctMThlNDRmMTI0YWYxIiwiYXV0aF90aW1lIjoxNTMwNzE2MDE2LCJhdF9oYXNoIjoidWQwSzUxYTZCUmFPakowVXl3MEs0USIsIm94T3BlbklEQ29ubmVjdFZlcnNpb24iOiJvcGVuaWRjb25uZWN0LTEuMCIsInN1YiI6ImpNVWc0aXBPLUkzYkV6eGsyaUpwX0tNU0VUanRSMDFLRHBVRFBmNUJ1UGMifQ.lPpBnXarJrN7apm1LZLeOukI5P7zmiZoTY73N-Zp4I5fUzEyeeb5Q3PQeL3PstlJjFtyk4P0GTADZ06RBUrTDk4Ry-acOCdYotTjplh-vm1IBzvvl2vKK63GiCbJG-HL_QN9XLWxynBRAGAbUu2jGQJRBXP5xlxT4gXvzaZSxOr_UWPGPwuUmDv_CwJJ5odQUXpuds_jlpDL_5ZHBai8vjmjeBfIxj7ZustVkrY2s-yWfM1st_oT-eQn2k5AO5vwIY12MkFe3HTEmfu9H4qwA9QRaovUaEDDCTUlEAeBWXkRUnZXIlb6UQ6NiuTRL37IBecSz7EqVCbTjC5Or8fGBg&session_id=2bd3476e-2376-4561-a521-2ca204b9a2f7&state=2d10dd0b-f2c2-41da-a2ff-dde2a43b32c3&token_type=bearer&session_state=5d62453e-ead3-4f5a-afc2-d13319fbf405&expires_in=299

#######################################################
TEST: OpenID Connect Discovery
#######################################################
-------------------------------------------------------
REQUEST:
-------------------------------------------------------
GET /.well-known/webfinger?resource=acct%3Atest_user%40ce-dev4.gluu.org&rel=http%3A%2F%2Fopenid.net%2Fspecs%2Fconnect%2F1.0%2Fissuer HTTP/1.1
Host: ce-dev4.gluu.org

-------------------------------------------------------
RESPONSE:
-------------------------------------------------------
HTTP/1.1 200
Connection: Keep-Alive
Content-Length: 181
Content-Type: application/jrd+json;charset=iso-8859-1
Date: Wed, 04 Jul 2018 14:53:36 GMT
Keep-Alive: timeout=5, max=100
Server: Jetty(9.4.9.v20180320)
Strict-Transport-Security: max-age=31536000; includeSubDomains
X-Content-Type-Options: nosniff
X-Xss-Protection: 1; mode=block

{
    "subject": "acct:test_user@ce-dev4.gluu.org",
    "links": [{
        "rel": "http://openid.net/specs/connect/1.0/issuer",
        "href": "https://ce-dev4.gluu.org"
    }]
}


OpenID Connect Configuration
-------------------------------------------------------
REQUEST:
-------------------------------------------------------
GET /.well-known/openid-configuration HTTP/1.1
Host: ce-dev4.gluu.org

-------------------------------------------------------
RESPONSE:
-------------------------------------------------------
HTTP/1.1 200
Connection: Keep-Alive
Content-Length: 6342
Content-Type: application/json
Date: Wed, 04 Jul 2018 14:53:36 GMT
Keep-Alive: timeout=5, max=100
Server: Jetty(9.4.9.v20180320)
Strict-Transport-Security: max-age=31536000; includeSubDomains
X-Content-Type-Options: nosniff
X-Xss-Protection: 1; mode=block

{
    "issuer": "https://ce-dev4.gluu.org",
    "authorization_endpoint": "https://ce-dev4.gluu.org/oxauth/restv1/authorize",
    "token_endpoint": "https://ce-dev4.gluu.org/oxauth/restv1/token",
    "userinfo_endpoint": "https://ce-dev4.gluu.org/oxauth/restv1/userinfo",
    "clientinfo_endpoint": "https://ce-dev4.gluu.org/oxauth/restv1/clientinfo",
    "check_session_iframe": "https://ce-dev4.gluu.org/oxauth/opiframe",
    "end_session_endpoint": "https://ce-dev4.gluu.org/oxauth/restv1/end_session",
    "jwks_uri": "https://ce-dev4.gluu.org/oxauth/restv1/jwks",
    "registration_endpoint": "https://ce-dev4.gluu.org/oxauth/restv1/register",
    "id_generation_endpoint": "https://ce-dev4.gluu.org/oxauth/restv1/id",
    "introspection_endpoint": "https://ce-dev4.gluu.org/oxauth/restv1/introspection",
    "scopes_supported": [
        "permission",
        "clientinfo",
        "email",
        "user_name",
        "sub",
        "org_name",
        "address",
        "openid",
        "test_scope1",
        "work_phone",
        "phone",
        "profile",
        "mobile_phone",
        "test"
    ],
    "response_types_supported": [
        "code id_token",
        "token code id_token",
        "token code",
        "token",
        "code",
        "token id_token",
        "id_token"
    ],
    "grant_types_supported": [
        "urn:ietf:params:oauth:grant-type:uma-ticket",
        "client_credentials",
        "refresh_token",
        "implicit",
        "authorization_code",
        "password"
    ],
    "acr_values_supported": [
        "super_gluu",
        "u2f",
        "otp",
        "basic",
        "auth_ldap_server"
    ],
    "auth_level_mapping": {
        "-1": ["auth_ldap_server"],
        "50": ["otp"],
        "100": ["basic"],
        "10": ["u2f"],
        "15": ["super_gluu"]
    },
    "subject_types_supported": [
        "public",
        "pairwise"
    ],
    "userinfo_signing_alg_values_supported": [
        "HS256",
        "HS384",
        "HS512",
        "RS256",
        "RS384",
        "RS512",
        "ES256",
        "ES384",
        "ES512"
    ],
    "userinfo_encryption_alg_values_supported": [
        "RSA1_5",
        "RSA-OAEP",
        "A128KW",
        "A256KW"
    ],
    "userinfo_encryption_enc_values_supported": [
        "RSA1_5",
        "RSA-OAEP",
        "A128KW",
        "A256KW"
    ],
    "id_token_signing_alg_values_supported": [
        "none",
        "HS256",
        "HS384",
        "HS512",
        "RS256",
        "RS384",
        "RS512",
        "ES256",
        "ES384",
        "ES512"
    ],
    "id_token_encryption_alg_values_supported": [
        "RSA1_5",
        "RSA-OAEP",
        "A128KW",
        "A256KW"
    ],
    "id_token_encryption_enc_values_supported": [
        "A128CBC+HS256",
        "A256CBC+HS512",
        "A128GCM",
        "A256GCM"
    ],
    "request_object_signing_alg_values_supported": [
        "none",
        "HS256",
        "HS384",
        "HS512",
        "RS256",
        "RS384",
        "RS512",
        "ES256",
        "ES384",
        "ES512"
    ],
    "request_object_encryption_alg_values_supported": [
        "RSA1_5",
        "RSA-OAEP",
        "A128KW",
        "A256KW"
    ],
    "request_object_encryption_enc_values_supported": [
        "A128CBC+HS256",
        "A256CBC+HS512",
        "A128GCM",
        "A256GCM"
    ],
    "token_endpoint_auth_methods_supported": [
        "client_secret_basic",
        "client_secret_post",
        "client_secret_jwt",
        "private_key_jwt"
    ],
    "token_endpoint_auth_signing_alg_values_supported": [
        "HS256",
        "HS384",
        "HS512",
        "RS256",
        "RS384",
        "RS512",
        "ES256",
        "ES384",
        "ES512"
    ],
    "display_values_supported": [
        "page",
        "popup"
    ],
    "claim_types_supported": ["normal"],
    "claims_supported": [
        "birthdate",
        "country",
        "name",
        "email",
        "email_verified",
        "given_name",
        "gender",
        "inum",
        "family_name",
        "updated_at",
        "locale",
        "member_of",
        "middle_name",
        "nickname",
        "oxAuthAppType",
        "oxAuthIdTokenSignedResponseAlg",
        "oxAuthRedirectURI",
        "oxAuthScope",
        "phone_number_verified",
        "picture",
        "preferred_username",
        "profile",
        "zoneinfo",
        "user_name",
        "website"
    ],
    "service_documentation": "http://gluu.org/docs",
    "claims_locales_supported": ["en"],
    "ui_locales_supported": [
        "en",
        "es"
    ],
    "scope_to_claims_mapping": [
        {"permission": []},
        {"uma_protection": []},
        {"clientinfo": [
            "name",
            "inum",
            "oxAuthAppType",
            "oxAuthIdTokenSignedResponseAlg",
            "oxAuthRedirectURI",
            "oxAuthScope"
        ]},
        {"email": [
            "email_verified",
            "email"
        ]},
        {"user_name": ["user_name"]},
        {"sub": []},
        {"org_name": []},
        {"address": [
            "formatted",
            "postal_code",
            "street_address",
            "locality",
            "country",
            "region"
        ]},
        {"openid": []},
        {"test_scope1": []},
        {"work_phone": []},
        {"phone": [
            "phone_number_verified",
            "phone_number"
        ]},
        {"profile": [
            "name",
            "family_name",
            "given_name",
            "middle_name",
            "nickname",
            "preferred_username",
            "profile",
            "picture",
            "website",
            "gender",
            "birthdate",
            "zoneinfo",
            "locale",
            "updated_at"
        ]},
        {"mobile_phone": ["phone_mobile_number"]},
        {"test": ["member_of"]}
    ],
    "claims_parameter_supported": true,
    "request_parameter_supported": true,
    "request_uri_parameter_supported": true,
    "require_request_uri_registration": false,
    "op_policy_uri": "http://ox.gluu.org/doku.php?id=oxauth:policy",
    "op_tos_uri": "http://ox.gluu.org/doku.php?id=oxauth:tos",
    "frontchannel_logout_supported": true,
    "frontchannel_logout_session_supported": true
}


#######################################################
TEST: OC5:FeatureTest-Verifies Correct c hash when Code Flow Used
#######################################################
-------------------------------------------------------
REQUEST:
-------------------------------------------------------
POST /oxauth/restv1/register HTTP/1.1
Content-Type: application/json
Accept: application/json
Host: ce-dev4.gluu.org

{
    "redirect_uris": [
        "https://ce-dev4.gluu.org/oxauth-rp/home.htm",
        "https://client.example.com/cb",
        "https://client.example.com/cb1",
        "https://client.example.com/cb2"
    ],
    "response_types": [
        "code",
        "id_token"
    ],
    "application_type": "web",
    "client_name": "oxAuth test app",
    "sector_identifier_uri": "https://ce-dev4.gluu.org/oxauth/sectoridentifier/@!38D4.410C.1D43.8932!0001!37F2.B744!0012!D426.70FD"
}

-------------------------------------------------------
RESPONSE:
-------------------------------------------------------
HTTP/1.1 200
Cache-Control: no-store
Connection: Keep-Alive
Content-Length: 1425
Content-Type: application/json
Date: Wed, 04 Jul 2018 14:53:36 GMT
Keep-Alive: timeout=5, max=100
Pragma: no-cache
Server: Jetty(9.4.9.v20180320)
Strict-Transport-Security: max-age=31536000; includeSubDomains
X-Content-Type-Options: nosniff
X-Xss-Protection: 1; mode=block

{
    "client_id": "@!38D4.410C.1D43.8932!0001!37F2.B744!0008!7920.FF34.56DB.8606",
    "client_secret": "8799161e-15c5-4559-9549-9e2c8651ef82",
    "registration_access_token": "7557e4ec-fa7f-4daf-b5c3-338760531947",
    "registration_client_uri": "https://ce-dev4.gluu.org/oxauth/restv1/register?client_id=@!38D4.410C.1D43.8932!0001!37F2.B744!0008!7920.FF34.56DB.8606",
    "client_id_issued_at": 1530716016,
    "client_secret_expires_at": 1530802416,
    "redirect_uris": [
        "https://client.example.com/cb2",
        "https://client.example.com/cb1",
        "https://client.example.com/cb",
        "https://ce-dev4.gluu.org/oxauth-rp/home.htm"
    ],
    "response_types": [
        "token",
        "code",
        "id_token"
    ],
    "grant_types": [
        "refresh_token",
        "implicit",
        "authorization_code"
    ],
    "application_type": "web",
    "client_name": "oxAuth test app",
    "sector_identifier_uri": "https://ce-dev4.gluu.org/oxauth/sectoridentifier/@!38D4.410C.1D43.8932!0001!37F2.B744!0012!D426.70FD",
    "subject_type": "pairwise",
    "id_token_signed_response_alg": "RS256",
    "token_endpoint_auth_method": "client_secret_basic",
    "require_auth_time": false,
    "frontchannel_logout_session_required": false,
    "scope": "permission uma_protection clientinfo email user_name sub org_name address openid test_scope1 work_phone phone profile test",
    "claims": ""
}

authenticateResourceOwnerAndGrantAccess: Cleaning cookies
authenticateResourceOwnerAndGrantAccess: authorizationRequestUrl:https://ce-dev4.gluu.org/oxauth/restv1/authorize?response_type=code+id_token&client_id=%40%2138D4.410C.1D43.8932%210001%2137F2.B744%210008%217920.FF34.56DB.8606&scope=openid+profile+address+email&redirect_uri=https%3A%2F%2Fce-dev4.gluu.org%2Foxauth-rp%2Fhome.htm&state=0894f765-dc75-489a-9da3-8fe492b14111&nonce=a43d11a1-d6b4-49e1-b2d1-bc0ad2efa65d
10:53:56.372 [main] ERROR com.gargoylesoftware.htmlunit.javascript.StrictErrorReporter - runtimeError: message=[An invalid or illegal selector was specified (selector: '*,:x' error: Invalid selector: :x).] sourceName=[https://ce-dev4.gluu.org/oxauth/js/jquery-1.12.4.min.js] line=[2] lineSource=[null] lineOffset=[0]
10:53:56.400 [main] ERROR com.gargoylesoftware.htmlunit.html.HtmlPage - Error loading JavaScript from [https://ce-dev4.gluu.org/oxauth/js/platform.js].
java.io.IOException: Unable to download JavaScript from 'https://ce-dev4.gluu.org/oxauth/js/platform.js' (status 404).
	at com.gargoylesoftware.htmlunit.html.HtmlPage.loadJavaScriptFromUrl(HtmlPage.java:1055) ~[htmlunit-2.20.jar:2.20]
	at com.gargoylesoftware.htmlunit.html.HtmlPage.loadExternalJavaScriptFile(HtmlPage.java:982) [htmlunit-2.20.jar:2.20]
	at com.gargoylesoftware.htmlunit.html.HtmlScript.executeScriptIfNeeded(HtmlScript.java:352) [htmlunit-2.20.jar:2.20]
	at com.gargoylesoftware.htmlunit.html.HtmlScript$2.execute(HtmlScript.java:238) [htmlunit-2.20.jar:2.20]
	at com.gargoylesoftware.htmlunit.html.HtmlScript.onAllChildrenAddedToPage(HtmlScript.java:257) [htmlunit-2.20.jar:2.20]
	at com.gargoylesoftware.htmlunit.html.HTMLParser$HtmlUnitDOMBuilder.endElement(HTMLParser.java:747) [htmlunit-2.20.jar:2.20]
	at org.apache.xerces.parsers.AbstractSAXParser.endElement(Unknown Source) [xercesImpl-2.11.0.jar:?]
	at com.gargoylesoftware.htmlunit.html.HTMLParser$HtmlUnitDOMBuilder.endElement(HTMLParser.java:704) [htmlunit-2.20.jar:2.20]
	at org.cyberneko.html.HTMLTagBalancer.callEndElement(HTMLTagBalancer.java:1170) [nekohtml-1.9.22.jar:1.9.22]
	at org.cyberneko.html.HTMLTagBalancer.endElement(HTMLTagBalancer.java:1072) [nekohtml-1.9.22.jar:1.9.22]
	at org.cyberneko.html.filters.DefaultFilter.endElement(DefaultFilter.java:206) [nekohtml-1.9.22.jar:?]
	at org.cyberneko.html.filters.NamespaceBinder.endElement(NamespaceBinder.java:330) [nekohtml-1.9.22.jar:?]
	at org.cyberneko.html.HTMLScanner$ContentScanner.scanEndElement(HTMLScanner.java:3126) [nekohtml-1.9.22.jar:1.9.22]
	at org.cyberneko.html.HTMLScanner$ContentScanner.scan(HTMLScanner.java:2093) [nekohtml-1.9.22.jar:1.9.22]
	at org.cyberneko.html.HTMLScanner.scanDocument(HTMLScanner.java:920) [nekohtml-1.9.22.jar:1.9.22]
	at org.cyberneko.html.HTMLConfiguration.parse(HTMLConfiguration.java:499) [nekohtml-1.9.22.jar:1.9.22]
	at org.cyberneko.html.HTMLConfiguration.parse(HTMLConfiguration.java:452) [nekohtml-1.9.22.jar:1.9.22]
	at org.apache.xerces.parsers.XMLParser.parse(Unknown Source) [xercesImpl-2.11.0.jar:?]
	at com.gargoylesoftware.htmlunit.html.HTMLParser$HtmlUnitDOMBuilder.parse(HTMLParser.java:924) [htmlunit-2.20.jar:2.20]
	at com.gargoylesoftware.htmlunit.html.HTMLParser.parse(HTMLParser.java:238) [htmlunit-2.20.jar:2.20]
	at com.gargoylesoftware.htmlunit.html.HTMLParser.parseHtml(HTMLParser.java:184) [htmlunit-2.20.jar:2.20]
	at com.gargoylesoftware.htmlunit.DefaultPageCreator.createHtmlPage(DefaultPageCreator.java:269) [htmlunit-2.20.jar:2.20]
	at com.gargoylesoftware.htmlunit.DefaultPageCreator.createPage(DefaultPageCreator.java:157) [htmlunit-2.20.jar:2.20]
	at com.gargoylesoftware.htmlunit.WebClient.loadWebResponseInto(WebClient.java:477) [htmlunit-2.20.jar:2.20]
	at com.gargoylesoftware.htmlunit.WebClient.getPage(WebClient.java:351) [htmlunit-2.20.jar:2.20]
	at com.gargoylesoftware.htmlunit.WebClient.getPage(WebClient.java:416) [htmlunit-2.20.jar:2.20]
	at org.openqa.selenium.htmlunit.HtmlUnitDriver.get(HtmlUnitDriver.java:528) [htmlunit-driver-2.21.jar:?]
	at org.openqa.selenium.htmlunit.HtmlUnitDriver.get(HtmlUnitDriver.java:517) [htmlunit-driver-2.21.jar:?]
	at org.openqa.selenium.htmlunit.HtmlUnitDriver$HtmlUnitNavigation.to(HtmlUnitDriver.java:1421) [htmlunit-driver-2.21.jar:?]
	at org.xdi.oxauth.BaseTest.processAuthentication(BaseTest.java:337) [test-classes/:?]
	at org.xdi.oxauth.BaseTest.authenticateResourceOwnerAndGrantAccess(BaseTest.java:283) [test-classes/:?]
	at org.xdi.oxauth.BaseTest.authenticateResourceOwnerAndGrantAccess(BaseTest.java:271) [test-classes/:?]
	at org.xdi.oxauth.BaseTest.authenticateResourceOwnerAndGrantAccess(BaseTest.java:261) [test-classes/:?]
	at org.xdi.oxauth.BaseTest.authenticateResourceOwnerAndGrantAccess(BaseTest.java:252) [test-classes/:?]
	at org.xdi.oxauth.interop.VerifiesCorrectCHashWhenCodeFlowUsed.verifiesCorrectCHashWhenCodeFlowUsed(VerifiesCorrectCHashWhenCodeFlowUsed.java:76) [test-classes/:?]
	at sun.reflect.NativeMethodAccessorImpl.invoke0(Native Method) ~[?:1.8.0_121]
	at sun.reflect.NativeMethodAccessorImpl.invoke(NativeMethodAccessorImpl.java:62) ~[?:1.8.0_121]
	at sun.reflect.DelegatingMethodAccessorImpl.invoke(DelegatingMethodAccessorImpl.java:43) ~[?:1.8.0_121]
	at java.lang.reflect.Method.invoke(Method.java:498) ~[?:1.8.0_121]
	at org.testng.internal.MethodInvocationHelper.invokeMethod(MethodInvocationHelper.java:108) [testng-6.11.jar:?]
	at org.testng.internal.Invoker.invokeMethod(Invoker.java:661) [testng-6.11.jar:?]
	at org.testng.internal.Invoker.invokeTestMethod(Invoker.java:869) [testng-6.11.jar:?]
	at org.testng.internal.Invoker.invokeTestMethods(Invoker.java:1193) [testng-6.11.jar:?]
	at org.testng.internal.TestMethodWorker.invokeTestMethods(TestMethodWorker.java:126) [testng-6.11.jar:?]
	at org.testng.internal.TestMethodWorker.run(TestMethodWorker.java:109) [testng-6.11.jar:?]
	at org.testng.TestRunner.privateRun(TestRunner.java:744) [testng-6.11.jar:?]
	at org.testng.TestRunner.run(TestRunner.java:602) [testng-6.11.jar:?]
	at org.testng.SuiteRunner.runTest(SuiteRunner.java:380) [testng-6.11.jar:?]
	at org.testng.SuiteRunner.runSequentially(SuiteRunner.java:375) [testng-6.11.jar:?]
	at org.testng.SuiteRunner.privateRun(SuiteRunner.java:340) [testng-6.11.jar:?]
	at org.testng.SuiteRunner.run(SuiteRunner.java:289) [testng-6.11.jar:?]
	at org.testng.SuiteRunnerWorker.runSuite(SuiteRunnerWorker.java:52) [testng-6.11.jar:?]
	at org.testng.SuiteRunnerWorker.run(SuiteRunnerWorker.java:86) [testng-6.11.jar:?]
	at org.testng.TestNG.runSuitesSequentially(TestNG.java:1301) [testng-6.11.jar:?]
	at org.testng.TestNG.runSuitesLocally(TestNG.java:1226) [testng-6.11.jar:?]
	at org.testng.TestNG.runSuites(TestNG.java:1144) [testng-6.11.jar:?]
	at org.testng.TestNG.run(TestNG.java:1115) [testng-6.11.jar:?]
	at org.apache.maven.surefire.testng.TestNGExecutor.run(TestNGExecutor.java:281) [surefire-testng-2.19.1.jar:2.19.1]
	at org.apache.maven.surefire.testng.TestNGXmlTestSuite.execute(TestNGXmlTestSuite.java:75) [surefire-testng-2.19.1.jar:2.19.1]
	at org.apache.maven.surefire.testng.TestNGProvider.invoke(TestNGProvider.java:121) [surefire-testng-2.19.1.jar:2.19.1]
	at org.apache.maven.surefire.booter.ForkedBooter.invokeProviderInSameClassLoader(ForkedBooter.java:290) [surefire-booter-2.19.1.jar:2.19.1]
	at org.apache.maven.surefire.booter.ForkedBooter.runSuitesInProcess(ForkedBooter.java:242) [surefire-booter-2.19.1.jar:2.19.1]
	at org.apache.maven.surefire.booter.ForkedBooter.main(ForkedBooter.java:121) [surefire-booter-2.19.1.jar:2.19.1]
authenticateResourceOwnerAndGrantAccess: sessionState:f719bcdc-a814-4a54-8a2f-747fda141b81
-------------------------------------------------------
REQUEST:
-------------------------------------------------------
https://ce-dev4.gluu.org/oxauth/restv1/authorize?response_type=code+id_token&client_id=%40%2138D4.410C.1D43.8932%210001%2137F2.B744%210008%217920.FF34.56DB.8606&scope=openid+profile+address+email&redirect_uri=https%3A%2F%2Fce-dev4.gluu.org%2Foxauth-rp%2Fhome.htm&state=0894f765-dc75-489a-9da3-8fe492b14111&nonce=a43d11a1-d6b4-49e1-b2d1-bc0ad2efa65d

-------------------------------------------------------
RESPONSE:
-------------------------------------------------------
HTTP/1.1 302 Found
Location: https://ce-dev4.gluu.org/oxauth-rp/home.htm#code=92e4f88b-69e6-4f4d-95c5-bd09c5c81954&scope=address+openid+profile+email&id_token=eyJraWQiOiI4NzE2OGJjMS1lNTU4LTQxNjktOGRkMS05ZmJkNDUxZGU1ZDciLCJ0eXAiOiJKV1QiLCJhbGciOiJSUzI1NiJ9.eyJpc3MiOiJodHRwczovL2NlLWRldjQuZ2x1dS5vcmciLCJhdWQiOiJAITM4RDQuNDEwQy4xRDQzLjg5MzIhMDAwMSEzN0YyLkI3NDQhMDAwOCE3OTIwLkZGMzQuNTZEQi44NjA2IiwiZXhwIjoxNTMwNzE5NjE3LCJpYXQiOjE1MzA3MTYwMTcsIm5vbmNlIjoiYTQzZDExYTEtZDZiNC00OWUxLWIyZDEtYmMwYWQyZWZhNjVkIiwiYXV0aF90aW1lIjoxNTMwNzE2MDE3LCJjX2hhc2giOiJpSl9FcDdUaElmWVJzRWRFREt0VV93Iiwib3hPcGVuSURDb25uZWN0VmVyc2lvbiI6Im9wZW5pZGNvbm5lY3QtMS4wIiwic3ViIjoiVUZoX0tyZ3ZnVDFoeWtoWnRXSTM2cUlMUXlWMl94ZjQ3VXRiWVBWd2l2ZyJ9.Prmme0lcRKpexlkvrY8Em08T5WnKSI-jo-2igTGdWjFIQIUEFmvuGvHJ5EObrZvVqb2-mIi_OUcL65c_DoROwkzhg8yiodqeuKXHt1jIOIgXpMpLRNGIkorWUXxplQaerdVNZHlx68_534-EHkVai9n5IUwYvnJWV9UX45zVLFExrO_9Yl2qJiP_7wdhLFo-t5DrgMKBF0077jLa1NQg8pAZNemphv538g8DgZ9z8laAH41Q6Kn6ZZJCIQxHqQsjXYAMgywl7kTqyQFtRjYibtiU9ooqHL3m0q5Y0EdA68tcIsRA8RL46o_6UfeGd7HgGB9zBHDo5_CzI0kQ8scaGA&session_id=b6edccf0-9df3-46a7-b788-b966700a4dd2&state=0894f765-dc75-489a-9da3-8fe492b14111&session_state=f719bcdc-a814-4a54-8a2f-747fda141b81

Tests run: 680, Failures: 17, Errors: 0, Skipped: 1, Time elapsed: 917.228 sec <<< FAILURE! - in TestSuite
authorizationRequestObjectWithMultivaluedClaimAlgA128KWEncA128GCM(org.xdi.oxauth.ws.rs.MultivaluedClaims)  Time elapsed: 1.592 sec  <<< FAILURE!
java.lang.AssertionError: expected [true] but found [false]
	at org.testng.Assert.fail(Assert.java:93)
	at org.testng.Assert.failNotEquals(Assert.java:512)
	at org.testng.Assert.assertTrue(Assert.java:41)
	at org.testng.Assert.assertTrue(Assert.java:51)
	at org.xdi.oxauth.ws.rs.MultivaluedClaims.authorizationRequestObjectWithMultivaluedClaimAlgA128KWEncA128GCM(MultivaluedClaims.java:2470)
	at sun.reflect.NativeMethodAccessorImpl.invoke0(Native Method)
	at sun.reflect.NativeMethodAccessorImpl.invoke(NativeMethodAccessorImpl.java:62)
	at sun.reflect.DelegatingMethodAccessorImpl.invoke(DelegatingMethodAccessorImpl.java:43)
	at java.lang.reflect.Method.invoke(Method.java:498)
	at org.testng.internal.MethodInvocationHelper.invokeMethod(MethodInvocationHelper.java:108)
	at org.testng.internal.Invoker.invokeMethod(Invoker.java:661)
	at org.testng.internal.Invoker.invokeTestMethod(Invoker.java:869)
	at org.testng.internal.Invoker.invokeTestMethods(Invoker.java:1193)
	at org.testng.internal.TestMethodWorker.invokeTestMethods(TestMethodWorker.java:126)
	at org.testng.internal.TestMethodWorker.run(TestMethodWorker.java:109)
	at org.testng.TestRunner.privateRun(TestRunner.java:744)
	at org.testng.TestRunner.run(TestRunner.java:602)
	at org.testng.SuiteRunner.runTest(SuiteRunner.java:380)
	at org.testng.SuiteRunner.runSequentially(SuiteRunner.java:375)
	at org.testng.SuiteRunner.privateRun(SuiteRunner.java:340)
	at org.testng.SuiteRunner.run(SuiteRunner.java:289)
	at org.testng.SuiteRunnerWorker.runSuite(SuiteRunnerWorker.java:52)
	at org.testng.SuiteRunnerWorker.run(SuiteRunnerWorker.java:86)
	at org.testng.TestNG.runSuitesSequentially(TestNG.java:1301)
	at org.testng.TestNG.runSuitesLocally(TestNG.java:1226)
	at org.testng.TestNG.runSuites(TestNG.java:1144)
	at org.testng.TestNG.run(TestNG.java:1115)
	at org.apache.maven.surefire.testng.TestNGExecutor.run(TestNGExecutor.java:281)
	at org.apache.maven.surefire.testng.TestNGXmlTestSuite.execute(TestNGXmlTestSuite.java:75)
	at org.apache.maven.surefire.testng.TestNGProvider.invoke(TestNGProvider.java:121)
	at org.apache.maven.surefire.booter.ForkedBooter.invokeProviderInSameClassLoader(ForkedBooter.java:290)
	at org.apache.maven.surefire.booter.ForkedBooter.runSuitesInProcess(ForkedBooter.java:242)
	at org.apache.maven.surefire.booter.ForkedBooter.main(ForkedBooter.java:121)

authorizationRequestObjectWithMultivaluedClaimAlgA256KWEncA256GCM(org.xdi.oxauth.ws.rs.MultivaluedClaims)  Time elapsed: 1.492 sec  <<< FAILURE!
java.lang.AssertionError: expected [true] but found [false]
	at org.testng.Assert.fail(Assert.java:93)
	at org.testng.Assert.failNotEquals(Assert.java:512)
	at org.testng.Assert.assertTrue(Assert.java:41)
	at org.testng.Assert.assertTrue(Assert.java:51)
	at org.xdi.oxauth.ws.rs.MultivaluedClaims.authorizationRequestObjectWithMultivaluedClaimAlgA256KWEncA256GCM(MultivaluedClaims.java:2568)
	at sun.reflect.NativeMethodAccessorImpl.invoke0(Native Method)
	at sun.reflect.NativeMethodAccessorImpl.invoke(NativeMethodAccessorImpl.java:62)
	at sun.reflect.DelegatingMethodAccessorImpl.invoke(DelegatingMethodAccessorImpl.java:43)
	at java.lang.reflect.Method.invoke(Method.java:498)
	at org.testng.internal.MethodInvocationHelper.invokeMethod(MethodInvocationHelper.java:108)
	at org.testng.internal.Invoker.invokeMethod(Invoker.java:661)
	at org.testng.internal.Invoker.invokeTestMethod(Invoker.java:869)
	at org.testng.internal.Invoker.invokeTestMethods(Invoker.java:1193)
	at org.testng.internal.TestMethodWorker.invokeTestMethods(TestMethodWorker.java:126)
	at org.testng.internal.TestMethodWorker.run(TestMethodWorker.java:109)
	at org.testng.TestRunner.privateRun(TestRunner.java:744)
	at org.testng.TestRunner.run(TestRunner.java:602)
	at org.testng.SuiteRunner.runTest(SuiteRunner.java:380)
	at org.testng.SuiteRunner.runSequentially(SuiteRunner.java:375)
	at org.testng.SuiteRunner.privateRun(SuiteRunner.java:340)
	at org.testng.SuiteRunner.run(SuiteRunner.java:289)
	at org.testng.SuiteRunnerWorker.runSuite(SuiteRunnerWorker.java:52)
	at org.testng.SuiteRunnerWorker.run(SuiteRunnerWorker.java:86)
	at org.testng.TestNG.runSuitesSequentially(TestNG.java:1301)
	at org.testng.TestNG.runSuitesLocally(TestNG.java:1226)
	at org.testng.TestNG.runSuites(TestNG.java:1144)
	at org.testng.TestNG.run(TestNG.java:1115)
	at org.apache.maven.surefire.testng.TestNGExecutor.run(TestNGExecutor.java:281)
	at org.apache.maven.surefire.testng.TestNGXmlTestSuite.execute(TestNGXmlTestSuite.java:75)
	at org.apache.maven.surefire.testng.TestNGProvider.invoke(TestNGProvider.java:121)
	at org.apache.maven.surefire.booter.ForkedBooter.invokeProviderInSameClassLoader(ForkedBooter.java:290)
	at org.apache.maven.surefire.booter.ForkedBooter.runSuitesInProcess(ForkedBooter.java:242)
	at org.apache.maven.surefire.booter.ForkedBooter.main(ForkedBooter.java:121)

authorizationRequestObjectWithMultivaluedClaimAlgRSA15EncA128CBCPLUSHS256(org.xdi.oxauth.ws.rs.MultivaluedClaims)  Time elapsed: 1.67 sec  <<< FAILURE!
java.lang.AssertionError: expected [true] but found [false]
	at org.testng.Assert.fail(Assert.java:93)
	at org.testng.Assert.failNotEquals(Assert.java:512)
	at org.testng.Assert.assertTrue(Assert.java:41)
	at org.testng.Assert.assertTrue(Assert.java:51)
	at org.xdi.oxauth.ws.rs.MultivaluedClaims.authorizationRequestObjectWithMultivaluedClaimAlgRSA15EncA128CBCPLUSHS256(MultivaluedClaims.java:2678)
	at sun.reflect.NativeMethodAccessorImpl.invoke0(Native Method)
	at sun.reflect.NativeMethodAccessorImpl.invoke(NativeMethodAccessorImpl.java:62)
	at sun.reflect.DelegatingMethodAccessorImpl.invoke(DelegatingMethodAccessorImpl.java:43)
	at java.lang.reflect.Method.invoke(Method.java:498)
	at org.testng.internal.MethodInvocationHelper.invokeMethod(MethodInvocationHelper.java:108)
	at org.testng.internal.Invoker.invokeMethod(Invoker.java:661)
	at org.testng.internal.Invoker.invokeTestMethod(Invoker.java:869)
	at org.testng.internal.Invoker.invokeTestMethods(Invoker.java:1193)
	at org.testng.internal.TestMethodWorker.invokeTestMethods(TestMethodWorker.java:126)
	at org.testng.internal.TestMethodWorker.run(TestMethodWorker.java:109)
	at org.testng.TestRunner.privateRun(TestRunner.java:744)
	at org.testng.TestRunner.run(TestRunner.java:602)
	at org.testng.SuiteRunner.runTest(SuiteRunner.java:380)
	at org.testng.SuiteRunner.runSequentially(SuiteRunner.java:375)
	at org.testng.SuiteRunner.privateRun(SuiteRunner.java:340)
	at org.testng.SuiteRunner.run(SuiteRunner.java:289)
	at org.testng.SuiteRunnerWorker.runSuite(SuiteRunnerWorker.java:52)
	at org.testng.SuiteRunnerWorker.run(SuiteRunnerWorker.java:86)
	at org.testng.TestNG.runSuitesSequentially(TestNG.java:1301)
	at org.testng.TestNG.runSuitesLocally(TestNG.java:1226)
	at org.testng.TestNG.runSuites(TestNG.java:1144)
	at org.testng.TestNG.run(TestNG.java:1115)
	at org.apache.maven.surefire.testng.TestNGExecutor.run(TestNGExecutor.java:281)
	at org.apache.maven.surefire.testng.TestNGXmlTestSuite.execute(TestNGXmlTestSuite.java:75)
	at org.apache.maven.surefire.testng.TestNGProvider.invoke(TestNGProvider.java:121)
	at org.apache.maven.surefire.booter.ForkedBooter.invokeProviderInSameClassLoader(ForkedBooter.java:290)
	at org.apache.maven.surefire.booter.ForkedBooter.runSuitesInProcess(ForkedBooter.java:242)
	at org.apache.maven.surefire.booter.ForkedBooter.main(ForkedBooter.java:121)

authorizationRequestObjectWithMultivaluedClaimAlgRSA15EncA256CBCPLUSHS512(org.xdi.oxauth.ws.rs.MultivaluedClaims)  Time elapsed: 1.653 sec  <<< FAILURE!
java.lang.AssertionError: expected [true] but found [false]
	at org.testng.Assert.fail(Assert.java:93)
	at org.testng.Assert.failNotEquals(Assert.java:512)
	at org.testng.Assert.assertTrue(Assert.java:41)
	at org.testng.Assert.assertTrue(Assert.java:51)
	at org.xdi.oxauth.ws.rs.MultivaluedClaims.authorizationRequestObjectWithMultivaluedClaimAlgRSA15EncA256CBCPLUSHS512(MultivaluedClaims.java:2788)
	at sun.reflect.NativeMethodAccessorImpl.invoke0(Native Method)
	at sun.reflect.NativeMethodAccessorImpl.invoke(NativeMethodAccessorImpl.java:62)
	at sun.reflect.DelegatingMethodAccessorImpl.invoke(DelegatingMethodAccessorImpl.java:43)
	at java.lang.reflect.Method.invoke(Method.java:498)
	at org.testng.internal.MethodInvocationHelper.invokeMethod(MethodInvocationHelper.java:108)
	at org.testng.internal.Invoker.invokeMethod(Invoker.java:661)
	at org.testng.internal.Invoker.invokeTestMethod(Invoker.java:869)
	at org.testng.internal.Invoker.invokeTestMethods(Invoker.java:1193)
	at org.testng.internal.TestMethodWorker.invokeTestMethods(TestMethodWorker.java:126)
	at org.testng.internal.TestMethodWorker.run(TestMethodWorker.java:109)
	at org.testng.TestRunner.privateRun(TestRunner.java:744)
	at org.testng.TestRunner.run(TestRunner.java:602)
	at org.testng.SuiteRunner.runTest(SuiteRunner.java:380)
	at org.testng.SuiteRunner.runSequentially(SuiteRunner.java:375)
	at org.testng.SuiteRunner.privateRun(SuiteRunner.java:340)
	at org.testng.SuiteRunner.run(SuiteRunner.java:289)
	at org.testng.SuiteRunnerWorker.runSuite(SuiteRunnerWorker.java:52)
	at org.testng.SuiteRunnerWorker.run(SuiteRunnerWorker.java:86)
	at org.testng.TestNG.runSuitesSequentially(TestNG.java:1301)
	at org.testng.TestNG.runSuitesLocally(TestNG.java:1226)
	at org.testng.TestNG.runSuites(TestNG.java:1144)
	at org.testng.TestNG.run(TestNG.java:1115)
	at org.apache.maven.surefire.testng.TestNGExecutor.run(TestNGExecutor.java:281)
	at org.apache.maven.surefire.testng.TestNGXmlTestSuite.execute(TestNGXmlTestSuite.java:75)
	at org.apache.maven.surefire.testng.TestNGProvider.invoke(TestNGProvider.java:121)
	at org.apache.maven.surefire.booter.ForkedBooter.invokeProviderInSameClassLoader(ForkedBooter.java:290)
	at org.apache.maven.surefire.booter.ForkedBooter.runSuitesInProcess(ForkedBooter.java:242)
	at org.apache.maven.surefire.booter.ForkedBooter.main(ForkedBooter.java:121)

authorizationRequestObjectWithMultivaluedClaimAlgRSAOAEPEncA256GCM(org.xdi.oxauth.ws.rs.MultivaluedClaims)  Time elapsed: 1.728 sec  <<< FAILURE!
java.lang.AssertionError: expected [true] but found [false]
	at org.testng.Assert.fail(Assert.java:93)
	at org.testng.Assert.failNotEquals(Assert.java:512)
	at org.testng.Assert.assertTrue(Assert.java:41)
	at org.testng.Assert.assertTrue(Assert.java:51)
	at org.xdi.oxauth.ws.rs.MultivaluedClaims.authorizationRequestObjectWithMultivaluedClaimAlgRSAOAEPEncA256GCM(MultivaluedClaims.java:2898)
	at sun.reflect.NativeMethodAccessorImpl.invoke0(Native Method)
	at sun.reflect.NativeMethodAccessorImpl.invoke(NativeMethodAccessorImpl.java:62)
	at sun.reflect.DelegatingMethodAccessorImpl.invoke(DelegatingMethodAccessorImpl.java:43)
	at java.lang.reflect.Method.invoke(Method.java:498)
	at org.testng.internal.MethodInvocationHelper.invokeMethod(MethodInvocationHelper.java:108)
	at org.testng.internal.Invoker.invokeMethod(Invoker.java:661)
	at org.testng.internal.Invoker.invokeTestMethod(Invoker.java:869)
	at org.testng.internal.Invoker.invokeTestMethods(Invoker.java:1193)
	at org.testng.internal.TestMethodWorker.invokeTestMethods(TestMethodWorker.java:126)
	at org.testng.internal.TestMethodWorker.run(TestMethodWorker.java:109)
	at org.testng.TestRunner.privateRun(TestRunner.java:744)
	at org.testng.TestRunner.run(TestRunner.java:602)
	at org.testng.SuiteRunner.runTest(SuiteRunner.java:380)
	at org.testng.SuiteRunner.runSequentially(SuiteRunner.java:375)
	at org.testng.SuiteRunner.privateRun(SuiteRunner.java:340)
	at org.testng.SuiteRunner.run(SuiteRunner.java:289)
	at org.testng.SuiteRunnerWorker.runSuite(SuiteRunnerWorker.java:52)
	at org.testng.SuiteRunnerWorker.run(SuiteRunnerWorker.java:86)
	at org.testng.TestNG.runSuitesSequentially(TestNG.java:1301)
	at org.testng.TestNG.runSuitesLocally(TestNG.java:1226)
	at org.testng.TestNG.runSuites(TestNG.java:1144)
	at org.testng.TestNG.run(TestNG.java:1115)
	at org.apache.maven.surefire.testng.TestNGExecutor.run(TestNGExecutor.java:281)
	at org.apache.maven.surefire.testng.TestNGXmlTestSuite.execute(TestNGXmlTestSuite.java:75)
	at org.apache.maven.surefire.testng.TestNGProvider.invoke(TestNGProvider.java:121)
	at org.apache.maven.surefire.booter.ForkedBooter.invokeProviderInSameClassLoader(ForkedBooter.java:290)
	at org.apache.maven.surefire.booter.ForkedBooter.runSuitesInProcess(ForkedBooter.java:242)
	at org.apache.maven.surefire.booter.ForkedBooter.main(ForkedBooter.java:121)

authorizationRequestObjectWithMultivaluedClaimES256(org.xdi.oxauth.ws.rs.MultivaluedClaims)  Time elapsed: 1.675 sec  <<< FAILURE!
java.lang.AssertionError: expected [true] but found [false]
	at org.testng.Assert.fail(Assert.java:93)
	at org.testng.Assert.failNotEquals(Assert.java:512)
	at org.testng.Assert.assertTrue(Assert.java:41)
	at org.testng.Assert.assertTrue(Assert.java:51)
	at org.xdi.oxauth.ws.rs.MultivaluedClaims.authorizationRequestObjectWithMultivaluedClaimES256(MultivaluedClaims.java:2159)
	at sun.reflect.NativeMethodAccessorImpl.invoke0(Native Method)
	at sun.reflect.NativeMethodAccessorImpl.invoke(NativeMethodAccessorImpl.java:62)
	at sun.reflect.DelegatingMethodAccessorImpl.invoke(DelegatingMethodAccessorImpl.java:43)
	at java.lang.reflect.Method.invoke(Method.java:498)
	at org.testng.internal.MethodInvocationHelper.invokeMethod(MethodInvocationHelper.java:108)
	at org.testng.internal.Invoker.invokeMethod(Invoker.java:661)
	at org.testng.internal.Invoker.invokeTestMethod(Invoker.java:869)
	at org.testng.internal.Invoker.invokeTestMethods(Invoker.java:1193)
	at org.testng.internal.TestMethodWorker.invokeTestMethods(TestMethodWorker.java:126)
	at org.testng.internal.TestMethodWorker.run(TestMethodWorker.java:109)
	at org.testng.TestRunner.privateRun(TestRunner.java:744)
	at org.testng.TestRunner.run(TestRunner.java:602)
	at org.testng.SuiteRunner.runTest(SuiteRunner.java:380)
	at org.testng.SuiteRunner.runSequentially(SuiteRunner.java:375)
	at org.testng.SuiteRunner.privateRun(SuiteRunner.java:340)
	at org.testng.SuiteRunner.run(SuiteRunner.java:289)
	at org.testng.SuiteRunnerWorker.runSuite(SuiteRunnerWorker.java:52)
	at org.testng.SuiteRunnerWorker.run(SuiteRunnerWorker.java:86)
	at org.testng.TestNG.runSuitesSequentially(TestNG.java:1301)
	at org.testng.TestNG.runSuitesLocally(TestNG.java:1226)
	at org.testng.TestNG.runSuites(TestNG.java:1144)
	at org.testng.TestNG.run(TestNG.java:1115)
	at org.apache.maven.surefire.testng.TestNGExecutor.run(TestNGExecutor.java:281)
	at org.apache.maven.surefire.testng.TestNGXmlTestSuite.execute(TestNGXmlTestSuite.java:75)
	at org.apache.maven.surefire.testng.TestNGProvider.invoke(TestNGProvider.java:121)
	at org.apache.maven.surefire.booter.ForkedBooter.invokeProviderInSameClassLoader(ForkedBooter.java:290)
	at org.apache.maven.surefire.booter.ForkedBooter.runSuitesInProcess(ForkedBooter.java:242)
	at org.apache.maven.surefire.booter.ForkedBooter.main(ForkedBooter.java:121)

authorizationRequestObjectWithMultivaluedClaimES384(org.xdi.oxauth.ws.rs.MultivaluedClaims)  Time elapsed: 1.676 sec  <<< FAILURE!
java.lang.AssertionError: expected [true] but found [false]
	at org.testng.Assert.fail(Assert.java:93)
	at org.testng.Assert.failNotEquals(Assert.java:512)
	at org.testng.Assert.assertTrue(Assert.java:41)
	at org.testng.Assert.assertTrue(Assert.java:51)
	at org.xdi.oxauth.ws.rs.MultivaluedClaims.authorizationRequestObjectWithMultivaluedClaimES384(MultivaluedClaims.java:2262)
	at sun.reflect.NativeMethodAccessorImpl.invoke0(Native Method)
	at sun.reflect.NativeMethodAccessorImpl.invoke(NativeMethodAccessorImpl.java:62)
	at sun.reflect.DelegatingMethodAccessorImpl.invoke(DelegatingMethodAccessorImpl.java:43)
	at java.lang.reflect.Method.invoke(Method.java:498)
	at org.testng.internal.MethodInvocationHelper.invokeMethod(MethodInvocationHelper.java:108)
	at org.testng.internal.Invoker.invokeMethod(Invoker.java:661)
	at org.testng.internal.Invoker.invokeTestMethod(Invoker.java:869)
	at org.testng.internal.Invoker.invokeTestMethods(Invoker.java:1193)
	at org.testng.internal.TestMethodWorker.invokeTestMethods(TestMethodWorker.java:126)
	at org.testng.internal.TestMethodWorker.run(TestMethodWorker.java:109)
	at org.testng.TestRunner.privateRun(TestRunner.java:744)
	at org.testng.TestRunner.run(TestRunner.java:602)
	at org.testng.SuiteRunner.runTest(SuiteRunner.java:380)
	at org.testng.SuiteRunner.runSequentially(SuiteRunner.java:375)
	at org.testng.SuiteRunner.privateRun(SuiteRunner.java:340)
	at org.testng.SuiteRunner.run(SuiteRunner.java:289)
	at org.testng.SuiteRunnerWorker.runSuite(SuiteRunnerWorker.java:52)
	at org.testng.SuiteRunnerWorker.run(SuiteRunnerWorker.java:86)
	at org.testng.TestNG.runSuitesSequentially(TestNG.java:1301)
	at org.testng.TestNG.runSuitesLocally(TestNG.java:1226)
	at org.testng.TestNG.runSuites(TestNG.java:1144)
	at org.testng.TestNG.run(TestNG.java:1115)
	at org.apache.maven.surefire.testng.TestNGExecutor.run(TestNGExecutor.java:281)
	at org.apache.maven.surefire.testng.TestNGXmlTestSuite.execute(TestNGXmlTestSuite.java:75)
	at org.apache.maven.surefire.testng.TestNGProvider.invoke(TestNGProvider.java:121)
	at org.apache.maven.surefire.booter.ForkedBooter.invokeProviderInSameClassLoader(ForkedBooter.java:290)
	at org.apache.maven.surefire.booter.ForkedBooter.runSuitesInProcess(ForkedBooter.java:242)
	at org.apache.maven.surefire.booter.ForkedBooter.main(ForkedBooter.java:121)

authorizationRequestObjectWithMultivaluedClaimES512(org.xdi.oxauth.ws.rs.MultivaluedClaims)  Time elapsed: 1.783 sec  <<< FAILURE!
java.lang.AssertionError: expected [true] but found [false]
	at org.testng.Assert.fail(Assert.java:93)
	at org.testng.Assert.failNotEquals(Assert.java:512)
	at org.testng.Assert.assertTrue(Assert.java:41)
	at org.testng.Assert.assertTrue(Assert.java:51)
	at org.xdi.oxauth.ws.rs.MultivaluedClaims.authorizationRequestObjectWithMultivaluedClaimES512(MultivaluedClaims.java:2365)
	at sun.reflect.NativeMethodAccessorImpl.invoke0(Native Method)
	at sun.reflect.NativeMethodAccessorImpl.invoke(NativeMethodAccessorImpl.java:62)
	at sun.reflect.DelegatingMethodAccessorImpl.invoke(DelegatingMethodAccessorImpl.java:43)
	at java.lang.reflect.Method.invoke(Method.java:498)
	at org.testng.internal.MethodInvocationHelper.invokeMethod(MethodInvocationHelper.java:108)
	at org.testng.internal.Invoker.invokeMethod(Invoker.java:661)
	at org.testng.internal.Invoker.invokeTestMethod(Invoker.java:869)
	at org.testng.internal.Invoker.invokeTestMethods(Invoker.java:1193)
	at org.testng.internal.TestMethodWorker.invokeTestMethods(TestMethodWorker.java:126)
	at org.testng.internal.TestMethodWorker.run(TestMethodWorker.java:109)
	at org.testng.TestRunner.privateRun(TestRunner.java:744)
	at org.testng.TestRunner.run(TestRunner.java:602)
	at org.testng.SuiteRunner.runTest(SuiteRunner.java:380)
	at org.testng.SuiteRunner.runSequentially(SuiteRunner.java:375)
	at org.testng.SuiteRunner.privateRun(SuiteRunner.java:340)
	at org.testng.SuiteRunner.run(SuiteRunner.java:289)
	at org.testng.SuiteRunnerWorker.runSuite(SuiteRunnerWorker.java:52)
	at org.testng.SuiteRunnerWorker.run(SuiteRunnerWorker.java:86)
	at org.testng.TestNG.runSuitesSequentially(TestNG.java:1301)
	at org.testng.TestNG.runSuitesLocally(TestNG.java:1226)
	at org.testng.TestNG.runSuites(TestNG.java:1144)
	at org.testng.TestNG.run(TestNG.java:1115)
	at org.apache.maven.surefire.testng.TestNGExecutor.run(TestNGExecutor.java:281)
	at org.apache.maven.surefire.testng.TestNGXmlTestSuite.execute(TestNGXmlTestSuite.java:75)
	at org.apache.maven.surefire.testng.TestNGProvider.invoke(TestNGProvider.java:121)
	at org.apache.maven.surefire.booter.ForkedBooter.invokeProviderInSameClassLoader(ForkedBooter.java:290)
	at org.apache.maven.surefire.booter.ForkedBooter.runSuitesInProcess(ForkedBooter.java:242)
	at org.apache.maven.surefire.booter.ForkedBooter.main(ForkedBooter.java:121)

authorizationRequestObjectWithMultivaluedClaimHS256(org.xdi.oxauth.ws.rs.MultivaluedClaims)  Time elapsed: 1.536 sec  <<< FAILURE!
java.lang.AssertionError: expected [true] but found [false]
	at org.testng.Assert.fail(Assert.java:93)
	at org.testng.Assert.failNotEquals(Assert.java:512)
	at org.testng.Assert.assertTrue(Assert.java:41)
	at org.testng.Assert.assertTrue(Assert.java:51)
	at org.xdi.oxauth.ws.rs.MultivaluedClaims.authorizationRequestObjectWithMultivaluedClaimHS256(MultivaluedClaims.java:1557)
	at sun.reflect.NativeMethodAccessorImpl.invoke0(Native Method)
	at sun.reflect.NativeMethodAccessorImpl.invoke(NativeMethodAccessorImpl.java:62)
	at sun.reflect.DelegatingMethodAccessorImpl.invoke(DelegatingMethodAccessorImpl.java:43)
	at java.lang.reflect.Method.invoke(Method.java:498)
	at org.testng.internal.MethodInvocationHelper.invokeMethod(MethodInvocationHelper.java:108)
	at org.testng.internal.Invoker.invokeMethod(Invoker.java:661)
	at org.testng.internal.Invoker.invokeTestMethod(Invoker.java:869)
	at org.testng.internal.Invoker.invokeTestMethods(Invoker.java:1193)
	at org.testng.internal.TestMethodWorker.invokeTestMethods(TestMethodWorker.java:126)
	at org.testng.internal.TestMethodWorker.run(TestMethodWorker.java:109)
	at org.testng.TestRunner.privateRun(TestRunner.java:744)
	at org.testng.TestRunner.run(TestRunner.java:602)
	at org.testng.SuiteRunner.runTest(SuiteRunner.java:380)
	at org.testng.SuiteRunner.runSequentially(SuiteRunner.java:375)
	at org.testng.SuiteRunner.privateRun(SuiteRunner.java:340)
	at org.testng.SuiteRunner.run(SuiteRunner.java:289)
	at org.testng.SuiteRunnerWorker.runSuite(SuiteRunnerWorker.java:52)
	at org.testng.SuiteRunnerWorker.run(SuiteRunnerWorker.java:86)
	at org.testng.TestNG.runSuitesSequentially(TestNG.java:1301)
	at org.testng.TestNG.runSuitesLocally(TestNG.java:1226)
	at org.testng.TestNG.runSuites(TestNG.java:1144)
	at org.testng.TestNG.run(TestNG.java:1115)
	at org.apache.maven.surefire.testng.TestNGExecutor.run(TestNGExecutor.java:281)
	at org.apache.maven.surefire.testng.TestNGXmlTestSuite.execute(TestNGXmlTestSuite.java:75)
	at org.apache.maven.surefire.testng.TestNGProvider.invoke(TestNGProvider.java:121)
	at org.apache.maven.surefire.booter.ForkedBooter.invokeProviderInSameClassLoader(ForkedBooter.java:290)
	at org.apache.maven.surefire.booter.ForkedBooter.runSuitesInProcess(ForkedBooter.java:242)
	at org.apache.maven.surefire.booter.ForkedBooter.main(ForkedBooter.java:121)

authorizationRequestObjectWithMultivaluedClaimHS384(org.xdi.oxauth.ws.rs.MultivaluedClaims)  Time elapsed: 1.59 sec  <<< FAILURE!
java.lang.AssertionError: expected [true] but found [false]
	at org.testng.Assert.fail(Assert.java:93)
	at org.testng.Assert.failNotEquals(Assert.java:512)
	at org.testng.Assert.assertTrue(Assert.java:41)
	at org.testng.Assert.assertTrue(Assert.java:51)
	at org.xdi.oxauth.ws.rs.MultivaluedClaims.authorizationRequestObjectWithMultivaluedClaimHS384(MultivaluedClaims.java:1654)
	at sun.reflect.NativeMethodAccessorImpl.invoke0(Native Method)
	at sun.reflect.NativeMethodAccessorImpl.invoke(NativeMethodAccessorImpl.java:62)
	at sun.reflect.DelegatingMethodAccessorImpl.invoke(DelegatingMethodAccessorImpl.java:43)
	at java.lang.reflect.Method.invoke(Method.java:498)
	at org.testng.internal.MethodInvocationHelper.invokeMethod(MethodInvocationHelper.java:108)
	at org.testng.internal.Invoker.invokeMethod(Invoker.java:661)
	at org.testng.internal.Invoker.invokeTestMethod(Invoker.java:869)
	at org.testng.internal.Invoker.invokeTestMethods(Invoker.java:1193)
	at org.testng.internal.TestMethodWorker.invokeTestMethods(TestMethodWorker.java:126)
	at org.testng.internal.TestMethodWorker.run(TestMethodWorker.java:109)
	at org.testng.TestRunner.privateRun(TestRunner.java:744)
	at org.testng.TestRunner.run(TestRunner.java:602)
	at org.testng.SuiteRunner.runTest(SuiteRunner.java:380)
	at org.testng.SuiteRunner.runSequentially(SuiteRunner.java:375)
	at org.testng.SuiteRunner.privateRun(SuiteRunner.java:340)
	at org.testng.SuiteRunner.run(SuiteRunner.java:289)
	at org.testng.SuiteRunnerWorker.runSuite(SuiteRunnerWorker.java:52)
	at org.testng.SuiteRunnerWorker.run(SuiteRunnerWorker.java:86)
	at org.testng.TestNG.runSuitesSequentially(TestNG.java:1301)
	at org.testng.TestNG.runSuitesLocally(TestNG.java:1226)
	at org.testng.TestNG.runSuites(TestNG.java:1144)
	at org.testng.TestNG.run(TestNG.java:1115)
	at org.apache.maven.surefire.testng.TestNGExecutor.run(TestNGExecutor.java:281)
	at org.apache.maven.surefire.testng.TestNGXmlTestSuite.execute(TestNGXmlTestSuite.java:75)
	at org.apache.maven.surefire.testng.TestNGProvider.invoke(TestNGProvider.java:121)
	at org.apache.maven.surefire.booter.ForkedBooter.invokeProviderInSameClassLoader(ForkedBooter.java:290)
	at org.apache.maven.surefire.booter.ForkedBooter.runSuitesInProcess(ForkedBooter.java:242)
	at org.apache.maven.surefire.booter.ForkedBooter.main(ForkedBooter.java:121)

authorizationRequestObjectWithMultivaluedClaimHS512(org.xdi.oxauth.ws.rs.MultivaluedClaims)  Time elapsed: 1.444 sec  <<< FAILURE!
java.lang.AssertionError: expected [true] but found [false]
	at org.testng.Assert.fail(Assert.java:93)
	at org.testng.Assert.failNotEquals(Assert.java:512)
	at org.testng.Assert.assertTrue(Assert.java:41)
	at org.testng.Assert.assertTrue(Assert.java:51)
	at org.xdi.oxauth.ws.rs.MultivaluedClaims.authorizationRequestObjectWithMultivaluedClaimHS512(MultivaluedClaims.java:1751)
	at sun.reflect.NativeMethodAccessorImpl.invoke0(Native Method)
	at sun.reflect.NativeMethodAccessorImpl.invoke(NativeMethodAccessorImpl.java:62)
	at sun.reflect.DelegatingMethodAccessorImpl.invoke(DelegatingMethodAccessorImpl.java:43)
	at java.lang.reflect.Method.invoke(Method.java:498)
	at org.testng.internal.MethodInvocationHelper.invokeMethod(MethodInvocationHelper.java:108)
	at org.testng.internal.Invoker.invokeMethod(Invoker.java:661)
	at org.testng.internal.Invoker.invokeTestMethod(Invoker.java:869)
	at org.testng.internal.Invoker.invokeTestMethods(Invoker.java:1193)
	at org.testng.internal.TestMethodWorker.invokeTestMethods(TestMethodWorker.java:126)
	at org.testng.internal.TestMethodWorker.run(TestMethodWorker.java:109)
	at org.testng.TestRunner.privateRun(TestRunner.java:744)
	at org.testng.TestRunner.run(TestRunner.java:602)
	at org.testng.SuiteRunner.runTest(SuiteRunner.java:380)
	at org.testng.SuiteRunner.runSequentially(SuiteRunner.java:375)
	at org.testng.SuiteRunner.privateRun(SuiteRunner.java:340)
	at org.testng.SuiteRunner.run(SuiteRunner.java:289)
	at org.testng.SuiteRunnerWorker.runSuite(SuiteRunnerWorker.java:52)
	at org.testng.SuiteRunnerWorker.run(SuiteRunnerWorker.java:86)
	at org.testng.TestNG.runSuitesSequentially(TestNG.java:1301)
	at org.testng.TestNG.runSuitesLocally(TestNG.java:1226)
	at org.testng.TestNG.runSuites(TestNG.java:1144)
	at org.testng.TestNG.run(TestNG.java:1115)
	at org.apache.maven.surefire.testng.TestNGExecutor.run(TestNGExecutor.java:281)
	at org.apache.maven.surefire.testng.TestNGXmlTestSuite.execute(TestNGXmlTestSuite.java:75)
	at org.apache.maven.surefire.testng.TestNGProvider.invoke(TestNGProvider.java:121)
	at org.apache.maven.surefire.booter.ForkedBooter.invokeProviderInSameClassLoader(ForkedBooter.java:290)
	at org.apache.maven.surefire.booter.ForkedBooter.runSuitesInProcess(ForkedBooter.java:242)
	at org.apache.maven.surefire.booter.ForkedBooter.main(ForkedBooter.java:121)

authorizationRequestObjectWithMultivaluedClaimNone(org.xdi.oxauth.ws.rs.MultivaluedClaims)  Time elapsed: 1.605 sec  <<< FAILURE!
java.lang.AssertionError: expected [true] but found [false]
	at org.testng.Assert.fail(Assert.java:93)
	at org.testng.Assert.failNotEquals(Assert.java:512)
	at org.testng.Assert.assertTrue(Assert.java:41)
	at org.testng.Assert.assertTrue(Assert.java:51)
	at org.xdi.oxauth.ws.rs.MultivaluedClaims.authorizationRequestObjectWithMultivaluedClaimNone(MultivaluedClaims.java:1461)
	at sun.reflect.NativeMethodAccessorImpl.invoke0(Native Method)
	at sun.reflect.NativeMethodAccessorImpl.invoke(NativeMethodAccessorImpl.java:62)
	at sun.reflect.DelegatingMethodAccessorImpl.invoke(DelegatingMethodAccessorImpl.java:43)
	at java.lang.reflect.Method.invoke(Method.java:498)
	at org.testng.internal.MethodInvocationHelper.invokeMethod(MethodInvocationHelper.java:108)
	at org.testng.internal.Invoker.invokeMethod(Invoker.java:661)
	at org.testng.internal.Invoker.invokeTestMethod(Invoker.java:869)
	at org.testng.internal.Invoker.invokeTestMethods(Invoker.java:1193)
	at org.testng.internal.TestMethodWorker.invokeTestMethods(TestMethodWorker.java:126)
	at org.testng.internal.TestMethodWorker.run(TestMethodWorker.java:109)
	at org.testng.TestRunner.privateRun(TestRunner.java:744)
	at org.testng.TestRunner.run(TestRunner.java:602)
	at org.testng.SuiteRunner.runTest(SuiteRunner.java:380)
	at org.testng.SuiteRunner.runSequentially(SuiteRunner.java:375)
	at org.testng.SuiteRunner.privateRun(SuiteRunner.java:340)
	at org.testng.SuiteRunner.run(SuiteRunner.java:289)
	at org.testng.SuiteRunnerWorker.runSuite(SuiteRunnerWorker.java:52)
	at org.testng.SuiteRunnerWorker.run(SuiteRunnerWorker.java:86)
	at org.testng.TestNG.runSuitesSequentially(TestNG.java:1301)
	at org.testng.TestNG.runSuitesLocally(TestNG.java:1226)
	at org.testng.TestNG.runSuites(TestNG.java:1144)
	at org.testng.TestNG.run(TestNG.java:1115)
	at org.apache.maven.surefire.testng.TestNGExecutor.run(TestNGExecutor.java:281)
	at org.apache.maven.surefire.testng.TestNGXmlTestSuite.execute(TestNGXmlTestSuite.java:75)
	at org.apache.maven.surefire.testng.TestNGProvider.invoke(TestNGProvider.java:121)
	at org.apache.maven.surefire.booter.ForkedBooter.invokeProviderInSameClassLoader(ForkedBooter.java:290)
	at org.apache.maven.surefire.booter.ForkedBooter.runSuitesInProcess(ForkedBooter.java:242)
	at org.apache.maven.surefire.booter.ForkedBooter.main(ForkedBooter.java:121)

authorizationRequestObjectWithMultivaluedClaimRS256(org.xdi.oxauth.ws.rs.MultivaluedClaims)  Time elapsed: 2.455 sec  <<< FAILURE!
java.lang.AssertionError: expected [true] but found [false]
	at org.testng.Assert.fail(Assert.java:93)
	at org.testng.Assert.failNotEquals(Assert.java:512)
	at org.testng.Assert.assertTrue(Assert.java:41)
	at org.testng.Assert.assertTrue(Assert.java:51)
	at org.xdi.oxauth.ws.rs.MultivaluedClaims.authorizationRequestObjectWithMultivaluedClaimRS256(MultivaluedClaims.java:1850)
	at sun.reflect.NativeMethodAccessorImpl.invoke0(Native Method)
	at sun.reflect.NativeMethodAccessorImpl.invoke(NativeMethodAccessorImpl.java:62)
	at sun.reflect.DelegatingMethodAccessorImpl.invoke(DelegatingMethodAccessorImpl.java:43)
	at java.lang.reflect.Method.invoke(Method.java:498)
	at org.testng.internal.MethodInvocationHelper.invokeMethod(MethodInvocationHelper.java:108)
	at org.testng.internal.Invoker.invokeMethod(Invoker.java:661)
	at org.testng.internal.Invoker.invokeTestMethod(Invoker.java:869)
	at org.testng.internal.Invoker.invokeTestMethods(Invoker.java:1193)
	at org.testng.internal.TestMethodWorker.invokeTestMethods(TestMethodWorker.java:126)
	at org.testng.internal.TestMethodWorker.run(TestMethodWorker.java:109)
	at org.testng.TestRunner.privateRun(TestRunner.java:744)
	at org.testng.TestRunner.run(TestRunner.java:602)
	at org.testng.SuiteRunner.runTest(SuiteRunner.java:380)
	at org.testng.SuiteRunner.runSequentially(SuiteRunner.java:375)
	at org.testng.SuiteRunner.privateRun(SuiteRunner.java:340)
	at org.testng.SuiteRunner.run(SuiteRunner.java:289)
	at org.testng.SuiteRunnerWorker.runSuite(SuiteRunnerWorker.java:52)
	at org.testng.SuiteRunnerWorker.run(SuiteRunnerWorker.java:86)
	at org.testng.TestNG.runSuitesSequentially(TestNG.java:1301)
	at org.testng.TestNG.runSuitesLocally(TestNG.java:1226)
	at org.testng.TestNG.runSuites(TestNG.java:1144)
	at org.testng.TestNG.run(TestNG.java:1115)
	at org.apache.maven.surefire.testng.TestNGExecutor.run(TestNGExecutor.java:281)
	at org.apache.maven.surefire.testng.TestNGXmlTestSuite.execute(TestNGXmlTestSuite.java:75)
	at org.apache.maven.surefire.testng.TestNGProvider.invoke(TestNGProvider.java:121)
	at org.apache.maven.surefire.booter.ForkedBooter.invokeProviderInSameClassLoader(ForkedBooter.java:290)
	at org.apache.maven.surefire.booter.ForkedBooter.runSuitesInProcess(ForkedBooter.java:242)
	at org.apache.maven.surefire.booter.ForkedBooter.main(ForkedBooter.java:121)

authorizationRequestObjectWithMultivaluedClaimRS384(org.xdi.oxauth.ws.rs.MultivaluedClaims)  Time elapsed: 1.871 sec  <<< FAILURE!
java.lang.AssertionError: expected [true] but found [false]
	at org.testng.Assert.fail(Assert.java:93)
	at org.testng.Assert.failNotEquals(Assert.java:512)
	at org.testng.Assert.assertTrue(Assert.java:41)
	at org.testng.Assert.assertTrue(Assert.java:51)
	at org.xdi.oxauth.ws.rs.MultivaluedClaims.authorizationRequestObjectWithMultivaluedClaimRS384(MultivaluedClaims.java:1953)
	at sun.reflect.NativeMethodAccessorImpl.invoke0(Native Method)
	at sun.reflect.NativeMethodAccessorImpl.invoke(NativeMethodAccessorImpl.java:62)
	at sun.reflect.DelegatingMethodAccessorImpl.invoke(DelegatingMethodAccessorImpl.java:43)
	at java.lang.reflect.Method.invoke(Method.java:498)
	at org.testng.internal.MethodInvocationHelper.invokeMethod(MethodInvocationHelper.java:108)
	at org.testng.internal.Invoker.invokeMethod(Invoker.java:661)
	at org.testng.internal.Invoker.invokeTestMethod(Invoker.java:869)
	at org.testng.internal.Invoker.invokeTestMethods(Invoker.java:1193)
	at org.testng.internal.TestMethodWorker.invokeTestMethods(TestMethodWorker.java:126)
	at org.testng.internal.TestMethodWorker.run(TestMethodWorker.java:109)
	at org.testng.TestRunner.privateRun(TestRunner.java:744)
	at org.testng.TestRunner.run(TestRunner.java:602)
	at org.testng.SuiteRunner.runTest(SuiteRunner.java:380)
	at org.testng.SuiteRunner.runSequentially(SuiteRunner.java:375)
	at org.testng.SuiteRunner.privateRun(SuiteRunner.java:340)
	at org.testng.SuiteRunner.run(SuiteRunner.java:289)
	at org.testng.SuiteRunnerWorker.runSuite(SuiteRunnerWorker.java:52)
	at org.testng.SuiteRunnerWorker.run(SuiteRunnerWorker.java:86)
	at org.testng.TestNG.runSuitesSequentially(TestNG.java:1301)
	at org.testng.TestNG.runSuitesLocally(TestNG.java:1226)
	at org.testng.TestNG.runSuites(TestNG.java:1144)
	at org.testng.TestNG.run(TestNG.java:1115)
	at org.apache.maven.surefire.testng.TestNGExecutor.run(TestNGExecutor.java:281)
	at org.apache.maven.surefire.testng.TestNGXmlTestSuite.execute(TestNGXmlTestSuite.java:75)
	at org.apache.maven.surefire.testng.TestNGProvider.invoke(TestNGProvider.java:121)
	at org.apache.maven.surefire.booter.ForkedBooter.invokeProviderInSameClassLoader(ForkedBooter.java:290)
	at org.apache.maven.surefire.booter.ForkedBooter.runSuitesInProcess(ForkedBooter.java:242)
	at org.apache.maven.surefire.booter.ForkedBooter.main(ForkedBooter.java:121)

authorizationRequestObjectWithMultivaluedClaimRS512(org.xdi.oxauth.ws.rs.MultivaluedClaims)  Time elapsed: 1.634 sec  <<< FAILURE!
java.lang.AssertionError: expected [true] but found [false]
	at org.testng.Assert.fail(Assert.java:93)
	at org.testng.Assert.failNotEquals(Assert.java:512)
	at org.testng.Assert.assertTrue(Assert.java:41)
	at org.testng.Assert.assertTrue(Assert.java:51)
	at org.xdi.oxauth.ws.rs.MultivaluedClaims.authorizationRequestObjectWithMultivaluedClaimRS512(MultivaluedClaims.java:2056)
	at sun.reflect.NativeMethodAccessorImpl.invoke0(Native Method)
	at sun.reflect.NativeMethodAccessorImpl.invoke(NativeMethodAccessorImpl.java:62)
	at sun.reflect.DelegatingMethodAccessorImpl.invoke(DelegatingMethodAccessorImpl.java:43)
	at java.lang.reflect.Method.invoke(Method.java:498)
	at org.testng.internal.MethodInvocationHelper.invokeMethod(MethodInvocationHelper.java:108)
	at org.testng.internal.Invoker.invokeMethod(Invoker.java:661)
	at org.testng.internal.Invoker.invokeTestMethod(Invoker.java:869)
	at org.testng.internal.Invoker.invokeTestMethods(Invoker.java:1193)
	at org.testng.internal.TestMethodWorker.invokeTestMethods(TestMethodWorker.java:126)
	at org.testng.internal.TestMethodWorker.run(TestMethodWorker.java:109)
	at org.testng.TestRunner.privateRun(TestRunner.java:744)
	at org.testng.TestRunner.run(TestRunner.java:602)
	at org.testng.SuiteRunner.runTest(SuiteRunner.java:380)
	at org.testng.SuiteRunner.runSequentially(SuiteRunner.java:375)
	at org.testng.SuiteRunner.privateRun(SuiteRunner.java:340)
	at org.testng.SuiteRunner.run(SuiteRunner.java:289)
	at org.testng.SuiteRunnerWorker.runSuite(SuiteRunnerWorker.java:52)
	at org.testng.SuiteRunnerWorker.run(SuiteRunnerWorker.java:86)
	at org.testng.TestNG.runSuitesSequentially(TestNG.java:1301)
	at org.testng.TestNG.runSuitesLocally(TestNG.java:1226)
	at org.testng.TestNG.runSuites(TestNG.java:1144)
	at org.testng.TestNG.run(TestNG.java:1115)
	at org.apache.maven.surefire.testng.TestNGExecutor.run(TestNGExecutor.java:281)
	at org.apache.maven.surefire.testng.TestNGXmlTestSuite.execute(TestNGXmlTestSuite.java:75)
	at org.apache.maven.surefire.testng.TestNGProvider.invoke(TestNGProvider.java:121)
	at org.apache.maven.surefire.booter.ForkedBooter.invokeProviderInSameClassLoader(ForkedBooter.java:290)
	at org.apache.maven.surefire.booter.ForkedBooter.runSuitesInProcess(ForkedBooter.java:242)
	at org.apache.maven.surefire.booter.ForkedBooter.main(ForkedBooter.java:121)

successfulRptRequest(org.xdi.oxauth.ws.rs.uma.AccessProtectedResourceFlowHttpTest)  Time elapsed: 0.014 sec  <<< FAILURE!
org.jboss.resteasy.client.ClientResponseFailure: RESTEASY003150: Error status 400 Bad Request returned
	at org.jboss.resteasy.client.core.BaseClientResponse.createResponseFailure(BaseClientResponse.java:581)
	at org.jboss.resteasy.client.core.BaseClientResponse.createResponseFailure(BaseClientResponse.java:572)
	at org.jboss.resteasy.client.core.BaseClientResponse.checkFailureStatus(BaseClientResponse.java:566)
	at org.jboss.resteasy.client.core.extractors.BodyEntityExtractor.extractEntity(BodyEntityExtractor.java:39)
	at org.jboss.resteasy.client.core.ClientInvoker.invoke(ClientInvoker.java:128)
	at org.jboss.resteasy.client.core.ClientProxy.invoke(ClientProxy.java:89)
	at com.sun.proxy.$Proxy62.requestRpt(Unknown Source)
	at org.xdi.oxauth.ws.rs.uma.AccessProtectedResourceFlowHttpTest.successfulRptRequest(AccessProtectedResourceFlowHttpTest.java:161)
	at sun.reflect.NativeMethodAccessorImpl.invoke0(Native Method)
	at sun.reflect.NativeMethodAccessorImpl.invoke(NativeMethodAccessorImpl.java:62)
	at sun.reflect.DelegatingMethodAccessorImpl.invoke(DelegatingMethodAccessorImpl.java:43)
	at java.lang.reflect.Method.invoke(Method.java:498)
	at org.testng.internal.MethodInvocationHelper.invokeMethod(MethodInvocationHelper.java:108)
	at org.testng.internal.Invoker.invokeMethod(Invoker.java:661)
	at org.testng.internal.Invoker.invokeTestMethod(Invoker.java:869)
	at org.testng.internal.Invoker.invokeTestMethods(Invoker.java:1193)
	at org.testng.internal.TestMethodWorker.invokeTestMethods(TestMethodWorker.java:126)
	at org.testng.internal.TestMethodWorker.run(TestMethodWorker.java:109)
	at org.testng.TestRunner.privateRun(TestRunner.java:744)
	at org.testng.TestRunner.run(TestRunner.java:602)
	at org.testng.SuiteRunner.runTest(SuiteRunner.java:380)
	at org.testng.SuiteRunner.runSequentially(SuiteRunner.java:375)
	at org.testng.SuiteRunner.privateRun(SuiteRunner.java:340)
	at org.testng.SuiteRunner.run(SuiteRunner.java:289)
	at org.testng.SuiteRunnerWorker.runSuite(SuiteRunnerWorker.java:52)
	at org.testng.SuiteRunnerWorker.run(SuiteRunnerWorker.java:86)
	at org.testng.TestNG.runSuitesSequentially(TestNG.java:1301)
	at org.testng.TestNG.runSuitesLocally(TestNG.java:1226)
	at org.testng.TestNG.runSuites(TestNG.java:1144)
	at org.testng.TestNG.run(TestNG.java:1115)
	at org.apache.maven.surefire.testng.TestNGExecutor.run(TestNGExecutor.java:281)
	at org.apache.maven.surefire.testng.TestNGXmlTestSuite.execute(TestNGXmlTestSuite.java:75)
	at org.apache.maven.surefire.testng.TestNGProvider.invoke(TestNGProvider.java:121)
	at org.apache.maven.surefire.booter.ForkedBooter.invokeProviderInSameClassLoader(ForkedBooter.java:290)
	at org.apache.maven.surefire.booter.ForkedBooter.runSuitesInProcess(ForkedBooter.java:242)
	at org.apache.maven.surefire.booter.ForkedBooter.main(ForkedBooter.java:121)

supportsReturningClaimsInIdToken(org.xdi.oxauth.interop.SupportsReturningClaimsInIdToken)  Time elapsed: 1.423 sec  <<< FAILURE!
java.lang.AssertionError: expected object to not be null
	at org.testng.Assert.fail(Assert.java:93)
	at org.testng.Assert.assertNotNull(Assert.java:422)
	at org.testng.Assert.assertNotNull(Assert.java:407)
	at org.xdi.oxauth.interop.SupportsReturningClaimsInIdToken.supportsReturningClaimsInIdToken(SupportsReturningClaimsInIdToken.java:114)
	at sun.reflect.NativeMethodAccessorImpl.invoke0(Native Method)
	at sun.reflect.NativeMethodAccessorImpl.invoke(NativeMethodAccessorImpl.java:62)
	at sun.reflect.DelegatingMethodAccessorImpl.invoke(DelegatingMethodAccessorImpl.java:43)
	at java.lang.reflect.Method.invoke(Method.java:498)
	at org.testng.internal.MethodInvocationHelper.invokeMethod(MethodInvocationHelper.java:108)
	at org.testng.internal.Invoker.invokeMethod(Invoker.java:661)
	at org.testng.internal.Invoker.invokeTestMethod(Invoker.java:869)
	at org.testng.internal.Invoker.invokeTestMethods(Invoker.java:1193)
	at org.testng.internal.TestMethodWorker.invokeTestMethods(TestMethodWorker.java:126)
	at org.testng.internal.TestMethodWorker.run(TestMethodWorker.java:109)
	at org.testng.TestRunner.privateRun(TestRunner.java:744)
	at org.testng.TestRunner.run(TestRunner.java:602)
	at org.testng.SuiteRunner.runTest(SuiteRunner.java:380)
	at org.testng.SuiteRunner.runSequentially(SuiteRunner.java:375)
	at org.testng.SuiteRunner.privateRun(SuiteRunner.java:340)
	at org.testng.SuiteRunner.run(SuiteRunner.java:289)
	at org.testng.SuiteRunnerWorker.runSuite(SuiteRunnerWorker.java:52)
	at org.testng.SuiteRunnerWorker.run(SuiteRunnerWorker.java:86)
	at org.testng.TestNG.runSuitesSequentially(TestNG.java:1301)
	at org.testng.TestNG.runSuitesLocally(TestNG.java:1226)
	at org.testng.TestNG.runSuites(TestNG.java:1144)
	at org.testng.TestNG.run(TestNG.java:1115)
	at org.apache.maven.surefire.testng.TestNGExecutor.run(TestNGExecutor.java:281)
	at org.apache.maven.surefire.testng.TestNGXmlTestSuite.execute(TestNGXmlTestSuite.java:75)
	at org.apache.maven.surefire.testng.TestNGProvider.invoke(TestNGProvider.java:121)
	at org.apache.maven.surefire.booter.ForkedBooter.invokeProviderInSameClassLoader(ForkedBooter.java:290)
	at org.apache.maven.surefire.booter.ForkedBooter.runSuitesInProcess(ForkedBooter.java:242)
	at org.apache.maven.surefire.booter.ForkedBooter.main(ForkedBooter.java:121)


Results :

Failed tests: 
  SupportsReturningClaimsInIdToken.supportsReturningClaimsInIdToken:114 expected object to not be null
  MultivaluedClaims.authorizationRequestObjectWithMultivaluedClaimAlgA128KWEncA128GCM:2470 expected [true] but found [false]
  MultivaluedClaims.authorizationRequestObjectWithMultivaluedClaimAlgA256KWEncA256GCM:2568 expected [true] but found [false]
  MultivaluedClaims.authorizationRequestObjectWithMultivaluedClaimAlgRSA15EncA128CBCPLUSHS256:2678 expected [true] but found [false]
  MultivaluedClaims.authorizationRequestObjectWithMultivaluedClaimAlgRSA15EncA256CBCPLUSHS512:2788 expected [true] but found [false]
  MultivaluedClaims.authorizationRequestObjectWithMultivaluedClaimAlgRSAOAEPEncA256GCM:2898 expected [true] but found [false]
  MultivaluedClaims.authorizationRequestObjectWithMultivaluedClaimES256:2159 expected [true] but found [false]
  MultivaluedClaims.authorizationRequestObjectWithMultivaluedClaimES384:2262 expected [true] but found [false]
  MultivaluedClaims.authorizationRequestObjectWithMultivaluedClaimES512:2365 expected [true] but found [false]
  MultivaluedClaims.authorizationRequestObjectWithMultivaluedClaimHS256:1557 expected [true] but found [false]
  MultivaluedClaims.authorizationRequestObjectWithMultivaluedClaimHS384:1654 expected [true] but found [false]
  MultivaluedClaims.authorizationRequestObjectWithMultivaluedClaimHS512:1751 expected [true] but found [false]
  MultivaluedClaims.authorizationRequestObjectWithMultivaluedClaimNone:1461 expected [true] but found [false]
  MultivaluedClaims.authorizationRequestObjectWithMultivaluedClaimRS256:1850 expected [true] but found [false]
  MultivaluedClaims.authorizationRequestObjectWithMultivaluedClaimRS384:1953 expected [true] but found [false]
  MultivaluedClaims.authorizationRequestObjectWithMultivaluedClaimRS512:2056 expected [true] but found [false]
  AccessProtectedResourceFlowHttpTest.successfulRptRequest:161 » ClientResponseFailure

Tests run: 680, Failures: 17, Errors: 0, Skipped: 1

[INFO] ------------------------------------------------------------------------
[INFO] Reactor Summary:
[INFO] 
[INFO] oxAuth ............................................. SUCCESS [  4.995 s]
[INFO] oxAuth Model ....................................... SUCCESS [ 57.902 s]
[INFO] oxAuth Client ...................................... FAILURE [15:35 min]
[INFO] oxauth-static ...................................... SKIPPED
[INFO] oxAuth RP .......................................... SKIPPED
[INFO] oxAuth RP Demo ..................................... SKIPPED
[INFO] oxAuth Server ...................................... SKIPPED
[INFO] ------------------------------------------------------------------------
[INFO] BUILD FAILURE
[INFO] ------------------------------------------------------------------------
[INFO] Total time: 16:40 min
[INFO] Finished at: 2018-07-04T10:53:59-04:00
[INFO] Final Memory: 64M/422M
[INFO] ------------------------------------------------------------------------
[ERROR] Failed to execute goal org.apache.maven.plugins:maven-surefire-plugin:2.19.1:test (default-test) on project oxauth-client: There are test failures.
[ERROR] 
[ERROR] Please refer to /home/tomcat/.jenkins/jobs/oxAuth/workspace/Client/target/surefire-reports for the individual test results.
[ERROR] -> [Help 1]
[ERROR] 
[ERROR] To see the full stack trace of the errors, re-run Maven with the -e switch.
[ERROR] Re-run Maven using the -X switch to enable full debug logging.
[ERROR] 
[ERROR] For more information about the errors and possible solutions, please read the following articles:
[ERROR] [Help 1] http://cwiki.apache.org/confluence/display/MAVEN/MojoFailureException
[ERROR] 
[ERROR] After correcting the problems, you can resume the build with the command
[ERROR]   mvn <goals> -rf :oxauth-client
Build step 'Invoke top-level Maven targets' marked build as failure
[FINDBUGS] Skipping publisher since build result is FAILURE
Publishing Javadoc
TestNG Reports Processing: START
Looking for TestNG results report in workspace using pattern: **/testng-results.xml
Saving reports...
Processing '/home/tomcat/.jenkins/jobs/oxAuth/builds/3291/testng/testng-results-1.xml'
Processing '/home/tomcat/.jenkins/jobs/oxAuth/builds/3291/testng/testng-results.xml'
2.474527% of tests failed, which exceeded threshold of 0%. Marking build as UNSTABLE
TestNG Reports Processing: FINISH
Not sending mail to unregistered user bonustrack310@gmail.com
Sending e-mails to: support@gluu.org yuriy@gluu.org
Finished: FAILURE