FailedConsole Output

Started by an SCM change
Running as SYSTEM
Building on master in workspace /home/jenkins/.jenkins/jobs/oxtrust-api_master/workspace
The recommended git tool is: NONE
No credentials specified
 > git rev-parse --is-inside-work-tree # timeout=10
Fetching changes from the remote Git repository
 > git config remote.origin.url https://github.com/GluuFederation/oxtrust-api # timeout=10
Fetching upstream changes from https://github.com/GluuFederation/oxtrust-api
 > git --version # timeout=10
 > git --version # 'git version 1.8.3.1'
 > git fetch --tags --progress https://github.com/GluuFederation/oxtrust-api +refs/heads/*:refs/remotes/origin/* # timeout=10
 > git rev-parse refs/remotes/origin/master^{commit} # timeout=10
 > git rev-parse refs/remotes/origin/origin/master^{commit} # timeout=10
Checking out Revision ed9251fb28ffc72ea66e1361d3d052de9a71c495 (refs/remotes/origin/master)
 > git config core.sparsecheckout # timeout=10
 > git checkout -f ed9251fb28ffc72ea66e1361d3d052de9a71c495 # timeout=10
Commit message: "Merge pull request #30 from uprightech/master"
 > git rev-list --no-walk 44afe99a208da50633125324cb8b34e44bb5e53e # timeout=10
Run condition [Boolean condition] enabling prebuild for step [Trigger/call builds on other projects]
[workspace] $ /bin/bash /opt/jetty/temp/jenkins7127068387032602896.sh
[workspace] $ /home/jenkins/.jenkins/tools/hudson.tasks.Maven_MavenInstallation/maven_3.3.9/bin/mvn -DDEPLOY_BUILD=true -DVERSION_NAME=master -DPROFILE_NAME=default -DDEVELOPMENT_BUILD=false -DMAVEN_SKIP_TESTS=false -Dpython.import.site=false -DPYTHON_HOME=/opt/jython -Dcfg=default -Dmaven.test.skip=false -Ddevelopment-build=false -Dskip.qa.test=true clean compile install javadoc:javadoc site
[INFO] Scanning for projects...
Downloading: https://repo2.maven.org/maven2/org/bouncycastle/org/gluu/gluu-core-bom/4.3.1-SNAPSHOT/maven-metadata.xml
Downloading: https://repo1.maven.org/maven2/org/gluu/gluu-core-bom/4.3.1-SNAPSHOT/maven-metadata.xml
Downloading: https://repository.jboss.org/nexus/content/groups/public-jboss/org/gluu/gluu-core-bom/4.3.1-SNAPSHOT/maven-metadata.xml
Downloading: https://ox.gluu.org/maven/org/gluu/gluu-core-bom/4.3.1-SNAPSHOT/maven-metadata.xml

Downloading: https://build.shibboleth.net/nexus/content/repositories/releases/org/gluu/gluu-core-bom/4.3.1-SNAPSHOT/maven-metadata.xml




[WARNING] Could not transfer metadata org.gluu:gluu-core-bom:4.3.1-SNAPSHOT/maven-metadata.xml from/to bouncycastle (https://repo2.maven.org/maven2/org/bouncycastle): repo2.maven.org: Name or service not known
[WARNING] 
[WARNING] Some problems were encountered while building the effective model for org.gluu:api-model:jar:4.3.1-SNAPSHOT
[WARNING] 'dependencies.dependency.(groupId:artifactId:type:classifier)' must be unique: com.fasterxml.jackson.core:jackson-annotations:jar -> duplicate declaration of version (?) @ org.gluu:api-model:[unknown-version], /home/jenkins/.jenkins/jobs/oxtrust-api_master/workspace/api-model/pom.xml, line 79, column 15
[WARNING] 'dependencies.dependency.(groupId:artifactId:type:classifier)' must be unique: com.fasterxml.jackson.core:jackson-core:jar -> duplicate declaration of version (?) @ org.gluu:api-model:[unknown-version], /home/jenkins/.jenkins/jobs/oxtrust-api_master/workspace/api-model/pom.xml, line 83, column 15
[WARNING] 'dependencies.dependency.(groupId:artifactId:type:classifier)' must be unique: com.fasterxml.jackson.core:jackson-databind:jar -> duplicate declaration of version (?) @ org.gluu:api-model:[unknown-version], /home/jenkins/.jenkins/jobs/oxtrust-api_master/workspace/api-model/pom.xml, line 87, column 15
[WARNING] 
[WARNING] Some problems were encountered while building the effective model for org.gluu:api-server:war:4.3.1-SNAPSHOT
[WARNING] 'build.plugins.plugin.version' for org.apache.maven.plugins:maven-javadoc-plugin is missing. @ org.gluu:api-server:[unknown-version], /home/jenkins/.jenkins/jobs/oxtrust-api_master/workspace/api-server/pom.xml, line 68, column 12
[WARNING] 
[WARNING] It is highly recommended to fix these problems because they threaten the stability of your build.
[WARNING] 
[WARNING] For this reason, future Maven versions might no longer support building such malformed projects.
[WARNING] 
[INFO] ------------------------------------------------------------------------
[INFO] Reactor Build Order:
[INFO] 
[INFO] oxTrust API
[INFO] oxTrust API Model library
[INFO] oxTrust API Client library
[INFO] API server rest
[INFO] API Server
[INFO]                                                                         
[INFO] ------------------------------------------------------------------------
[INFO] Building oxTrust API 4.3.1-SNAPSHOT
[INFO] ------------------------------------------------------------------------
[INFO] 
[INFO] --- maven-clean-plugin:2.5:clean (default-clean) @ oxtrust-api ---
[INFO] Deleting /home/jenkins/.jenkins/jobs/oxtrust-api_master/workspace/target
[INFO] 
[INFO] --- maven-install-plugin:2.3.1:install (default-install) @ oxtrust-api ---
[INFO] Installing /home/jenkins/.jenkins/jobs/oxtrust-api_master/workspace/pom.xml to /var/www/html/maven/org/gluu/oxtrust-api/4.3.1-SNAPSHOT/oxtrust-api-4.3.1-SNAPSHOT.pom
[INFO] 
[INFO] >>> maven-javadoc-plugin:3.0.1:javadoc (default-cli) > generate-sources @ oxtrust-api >>>
[INFO] 
[INFO] <<< maven-javadoc-plugin:3.0.1:javadoc (default-cli) < generate-sources @ oxtrust-api <<<
[INFO] 
[INFO] --- maven-javadoc-plugin:3.0.1:javadoc (default-cli) @ oxtrust-api ---
[INFO] 
[INFO] --- maven-site-plugin:2.1.1:site (default-site) @ oxtrust-api ---
Downloading: https://ox.gluu.org/maven/org/apache/maven/skins/maven-default-skin/maven-metadata.xml
Downloading: https://repo1.maven.org/maven2/org/apache/maven/skins/maven-default-skin/maven-metadata.xml
Downloading: https://repository.jboss.org/nexus/content/groups/public-jboss/org/apache/maven/skins/maven-default-skin/maven-metadata.xml
Downloading: https://repo2.maven.org/maven2/org/bouncycastle/org/apache/maven/skins/maven-default-skin/maven-metadata.xml

Downloading: https://build.shibboleth.net/nexus/content/repositories/releases/org/apache/maven/skins/maven-default-skin/maven-metadata.xml
428/428 B   
            
Downloading: https://repo.maven.apache.org/maven2/org/apache/maven/skins/maven-default-skin/maven-metadata.xml
            
Downloaded: https://repo1.maven.org/maven2/org/apache/maven/skins/maven-default-skin/maven-metadata.xml (428 B at 5.0 KB/sec)
            
428/428 B   
            
Downloaded: https://repo.maven.apache.org/maven2/org/apache/maven/skins/maven-default-skin/maven-metadata.xml (428 B at 6.3 KB/sec)
            
[WARNING] Could not transfer metadata org.apache.maven.skins:maven-default-skin/maven-metadata.xml from/to bouncycastle (https://repo2.maven.org/maven2/org/bouncycastle): repo2.maven.org
[INFO]                                                                         
[INFO] ------------------------------------------------------------------------
[INFO] Building oxTrust API Model library 4.3.1-SNAPSHOT
[INFO] ------------------------------------------------------------------------
Downloading: https://repository.jboss.org/nexus/content/groups/public-jboss/org/gluu/oxcore-model/4.3.1-SNAPSHOT/maven-metadata.xml
Downloading: https://ox.gluu.org/maven/org/gluu/oxcore-model/4.3.1-SNAPSHOT/maven-metadata.xml
Downloading: https://repo2.maven.org/maven2/org/bouncycastle/org/gluu/oxcore-model/4.3.1-SNAPSHOT/maven-metadata.xml
            
Downloading: https://repo1.maven.org/maven2/org/gluu/oxcore-model/4.3.1-SNAPSHOT/maven-metadata.xml
Downloading: https://build.shibboleth.net/nexus/content/repositories/releases/org/gluu/oxcore-model/4.3.1-SNAPSHOT/maven-metadata.xml
            
            
            
            
[WARNING] Could not transfer metadata org.gluu:oxcore-model:4.3.1-SNAPSHOT/maven-metadata.xml from/to bouncycastle (https://repo2.maven.org/maven2/org/bouncycastle): repo2.maven.org
[WARNING] Failure to transfer org.gluu:oxcore-model:4.3.1-SNAPSHOT/maven-metadata.xml from https://repo2.maven.org/maven2/org/bouncycastle was cached in the local repository, resolution will not be reattempted until the update interval of bouncycastle has elapsed or updates are forced. Original error: Could not transfer metadata org.gluu:oxcore-model:4.3.1-SNAPSHOT/maven-metadata.xml from/to bouncycastle (https://repo2.maven.org/maven2/org/bouncycastle): repo2.maven.org
Downloading: https://repository.jboss.org/nexus/content/groups/public-jboss/org/gluu/oxcore/4.3.1-SNAPSHOT/maven-metadata.xml
Downloading: https://repo1.maven.org/maven2/org/gluu/oxcore/4.3.1-SNAPSHOT/maven-metadata.xml
Downloading: https://ox.gluu.org/maven/org/gluu/oxcore/4.3.1-SNAPSHOT/maven-metadata.xml
Downloading: https://repo2.maven.org/maven2/org/bouncycastle/org/gluu/oxcore/4.3.1-SNAPSHOT/maven-metadata.xml
            
Downloading: https://build.shibboleth.net/nexus/content/repositories/releases/org/gluu/oxcore/4.3.1-SNAPSHOT/maven-metadata.xml
            
            
            
            
[WARNING] Could not transfer metadata org.gluu:oxcore:4.3.1-SNAPSHOT/maven-metadata.xml from/to bouncycastle (https://repo2.maven.org/maven2/org/bouncycastle): repo2.maven.org
[WARNING] Failure to transfer org.gluu:gluu-core-bom:4.3.1-SNAPSHOT/maven-metadata.xml from https://repo2.maven.org/maven2/org/bouncycastle was cached in the local repository, resolution will not be reattempted until the update interval of bouncycastle has elapsed or updates are forced. Original error: Could not transfer metadata org.gluu:gluu-core-bom:4.3.1-SNAPSHOT/maven-metadata.xml from/to bouncycastle (https://repo2.maven.org/maven2/org/bouncycastle): repo2.maven.org: Name or service not known
Downloading: https://ox.gluu.org/maven/org/gluu/gluu-orm-annotation/4.3.1-SNAPSHOT/maven-metadata.xml
Downloading: https://repo2.maven.org/maven2/org/bouncycastle/org/gluu/gluu-orm-annotation/4.3.1-SNAPSHOT/maven-metadata.xml
            
Downloading: https://repository.jboss.org/nexus/content/groups/public-jboss/org/gluu/gluu-orm-annotation/4.3.1-SNAPSHOT/maven-metadata.xml
Downloading: https://repo1.maven.org/maven2/org/gluu/gluu-orm-annotation/4.3.1-SNAPSHOT/maven-metadata.xml
Downloading: https://build.shibboleth.net/nexus/content/repositories/releases/org/gluu/gluu-orm-annotation/4.3.1-SNAPSHOT/maven-metadata.xml
            
            
            
            
[WARNING] Could not transfer metadata org.gluu:gluu-orm-annotation:4.3.1-SNAPSHOT/maven-metadata.xml from/to bouncycastle (https://repo2.maven.org/maven2/org/bouncycastle): repo2.maven.org
[WARNING] Failure to transfer org.gluu:gluu-orm-annotation:4.3.1-SNAPSHOT/maven-metadata.xml from https://repo2.maven.org/maven2/org/bouncycastle was cached in the local repository, resolution will not be reattempted until the update interval of bouncycastle has elapsed or updates are forced. Original error: Could not transfer metadata org.gluu:gluu-orm-annotation:4.3.1-SNAPSHOT/maven-metadata.xml from/to bouncycastle (https://repo2.maven.org/maven2/org/bouncycastle): repo2.maven.org
Downloading: https://repo2.maven.org/maven2/org/bouncycastle/org/gluu/gluu-orm-parent/4.3.1-SNAPSHOT/maven-metadata.xml
Downloading: https://ox.gluu.org/maven/org/gluu/gluu-orm-parent/4.3.1-SNAPSHOT/maven-metadata.xml
Downloading: https://repository.jboss.org/nexus/content/groups/public-jboss/org/gluu/gluu-orm-parent/4.3.1-SNAPSHOT/maven-metadata.xml
Downloading: https://repo1.maven.org/maven2/org/gluu/gluu-orm-parent/4.3.1-SNAPSHOT/maven-metadata.xml
            
Downloading: https://build.shibboleth.net/nexus/content/repositories/releases/org/gluu/gluu-orm-parent/4.3.1-SNAPSHOT/maven-metadata.xml
            
            
            
            
[WARNING] Could not transfer metadata org.gluu:gluu-orm-parent:4.3.1-SNAPSHOT/maven-metadata.xml from/to bouncycastle (https://repo2.maven.org/maven2/org/bouncycastle): repo2.maven.org
Downloading: https://repository.jboss.org/nexus/content/groups/public-jboss/org/gluu/gluu-orm-model/4.3.1-SNAPSHOT/maven-metadata.xml
Downloading: https://repo1.maven.org/maven2/org/gluu/gluu-orm-model/4.3.1-SNAPSHOT/maven-metadata.xml
Downloading: https://ox.gluu.org/maven/org/gluu/gluu-orm-model/4.3.1-SNAPSHOT/maven-metadata.xml
Downloading: https://repo2.maven.org/maven2/org/bouncycastle/org/gluu/gluu-orm-model/4.3.1-SNAPSHOT/maven-metadata.xml
            
Downloading: https://build.shibboleth.net/nexus/content/repositories/releases/org/gluu/gluu-orm-model/4.3.1-SNAPSHOT/maven-metadata.xml
            
            
            
            
[WARNING] Could not transfer metadata org.gluu:gluu-orm-model:4.3.1-SNAPSHOT/maven-metadata.xml from/to bouncycastle (https://repo2.maven.org/maven2/org/bouncycastle): repo2.maven.org
[WARNING] Failure to transfer org.gluu:gluu-orm-model:4.3.1-SNAPSHOT/maven-metadata.xml from https://repo2.maven.org/maven2/org/bouncycastle was cached in the local repository, resolution will not be reattempted until the update interval of bouncycastle has elapsed or updates are forced. Original error: Could not transfer metadata org.gluu:gluu-orm-model:4.3.1-SNAPSHOT/maven-metadata.xml from/to bouncycastle (https://repo2.maven.org/maven2/org/bouncycastle): repo2.maven.org
Downloading: https://repository.jboss.org/nexus/content/groups/public-jboss/org/gluu/gluu-orm-util/4.3.1-SNAPSHOT/maven-metadata.xml
Downloading: https://ox.gluu.org/maven/org/gluu/gluu-orm-util/4.3.1-SNAPSHOT/maven-metadata.xml
Downloading: https://repo2.maven.org/maven2/org/bouncycastle/org/gluu/gluu-orm-util/4.3.1-SNAPSHOT/maven-metadata.xml
Downloading: https://repo1.maven.org/maven2/org/gluu/gluu-orm-util/4.3.1-SNAPSHOT/maven-metadata.xml
            
Downloading: https://build.shibboleth.net/nexus/content/repositories/releases/org/gluu/gluu-orm-util/4.3.1-SNAPSHOT/maven-metadata.xml
            
            
            
            
[WARNING] Could not transfer metadata org.gluu:gluu-orm-util:4.3.1-SNAPSHOT/maven-metadata.xml from/to bouncycastle (https://repo2.maven.org/maven2/org/bouncycastle): repo2.maven.org
[WARNING] Failure to transfer org.gluu:gluu-orm-util:4.3.1-SNAPSHOT/maven-metadata.xml from https://repo2.maven.org/maven2/org/bouncycastle was cached in the local repository, resolution will not be reattempted until the update interval of bouncycastle has elapsed or updates are forced. Original error: Could not transfer metadata org.gluu:gluu-orm-util:4.3.1-SNAPSHOT/maven-metadata.xml from/to bouncycastle (https://repo2.maven.org/maven2/org/bouncycastle): repo2.maven.org
Downloading: https://repository.jboss.org/nexus/content/groups/public-jboss/org/gluu/oxcore-util/4.3.1-SNAPSHOT/maven-metadata.xml
Downloading: https://repo1.maven.org/maven2/org/gluu/oxcore-util/4.3.1-SNAPSHOT/maven-metadata.xml
Downloading: https://repo2.maven.org/maven2/org/bouncycastle/org/gluu/oxcore-util/4.3.1-SNAPSHOT/maven-metadata.xml
Downloading: https://ox.gluu.org/maven/org/gluu/oxcore-util/4.3.1-SNAPSHOT/maven-metadata.xml
            
Downloading: https://build.shibboleth.net/nexus/content/repositories/releases/org/gluu/oxcore-util/4.3.1-SNAPSHOT/maven-metadata.xml
            
            
            
            
[WARNING] Could not transfer metadata org.gluu:oxcore-util:4.3.1-SNAPSHOT/maven-metadata.xml from/to bouncycastle (https://repo2.maven.org/maven2/org/bouncycastle): repo2.maven.org
[WARNING] Failure to transfer org.gluu:oxcore-util:4.3.1-SNAPSHOT/maven-metadata.xml from https://repo2.maven.org/maven2/org/bouncycastle was cached in the local repository, resolution will not be reattempted until the update interval of bouncycastle has elapsed or updates are forced. Original error: Could not transfer metadata org.gluu:oxcore-util:4.3.1-SNAPSHOT/maven-metadata.xml from/to bouncycastle (https://repo2.maven.org/maven2/org/bouncycastle): repo2.maven.org
Downloading: https://repository.jboss.org/nexus/content/groups/public-jboss/org/gluu/gluu-orm-ldap/4.3.1-SNAPSHOT/maven-metadata.xml
Downloading: https://ox.gluu.org/maven/org/gluu/gluu-orm-ldap/4.3.1-SNAPSHOT/maven-metadata.xml
Downloading: https://repo2.maven.org/maven2/org/bouncycastle/org/gluu/gluu-orm-ldap/4.3.1-SNAPSHOT/maven-metadata.xml
            
Downloading: https://repo1.maven.org/maven2/org/gluu/gluu-orm-ldap/4.3.1-SNAPSHOT/maven-metadata.xml
Downloading: https://build.shibboleth.net/nexus/content/repositories/releases/org/gluu/gluu-orm-ldap/4.3.1-SNAPSHOT/maven-metadata.xml
            
            
            
            
[WARNING] Could not transfer metadata org.gluu:gluu-orm-ldap:4.3.1-SNAPSHOT/maven-metadata.xml from/to bouncycastle (https://repo2.maven.org/maven2/org/bouncycastle): repo2.maven.org
[WARNING] Failure to transfer org.gluu:gluu-orm-ldap:4.3.1-SNAPSHOT/maven-metadata.xml from https://repo2.maven.org/maven2/org/bouncycastle was cached in the local repository, resolution will not be reattempted until the update interval of bouncycastle has elapsed or updates are forced. Original error: Could not transfer metadata org.gluu:gluu-orm-ldap:4.3.1-SNAPSHOT/maven-metadata.xml from/to bouncycastle (https://repo2.maven.org/maven2/org/bouncycastle): repo2.maven.org
Downloading: https://repository.jboss.org/nexus/content/groups/public-jboss/org/gluu/gluu-orm-core/4.3.1-SNAPSHOT/maven-metadata.xml
Downloading: https://repo1.maven.org/maven2/org/gluu/gluu-orm-core/4.3.1-SNAPSHOT/maven-metadata.xml
Downloading: https://repo2.maven.org/maven2/org/bouncycastle/org/gluu/gluu-orm-core/4.3.1-SNAPSHOT/maven-metadata.xml
Downloading: https://ox.gluu.org/maven/org/gluu/gluu-orm-core/4.3.1-SNAPSHOT/maven-metadata.xml
            
Downloading: https://build.shibboleth.net/nexus/content/repositories/releases/org/gluu/gluu-orm-core/4.3.1-SNAPSHOT/maven-metadata.xml
            
            
            
            
[WARNING] Could not transfer metadata org.gluu:gluu-orm-core:4.3.1-SNAPSHOT/maven-metadata.xml from/to bouncycastle (https://repo2.maven.org/maven2/org/bouncycastle): repo2.maven.org
[WARNING] Failure to transfer org.gluu:gluu-orm-core:4.3.1-SNAPSHOT/maven-metadata.xml from https://repo2.maven.org/maven2/org/bouncycastle was cached in the local repository, resolution will not be reattempted until the update interval of bouncycastle has elapsed or updates are forced. Original error: Could not transfer metadata org.gluu:gluu-orm-core:4.3.1-SNAPSHOT/maven-metadata.xml from/to bouncycastle (https://repo2.maven.org/maven2/org/bouncycastle): repo2.maven.org
Downloading: https://repository.jboss.org/nexus/content/groups/public-jboss/org/gluu/gluu-orm-filter/4.3.1-SNAPSHOT/maven-metadata.xml
Downloading: https://ox.gluu.org/maven/org/gluu/gluu-orm-filter/4.3.1-SNAPSHOT/maven-metadata.xml
Downloading: https://repo1.maven.org/maven2/org/gluu/gluu-orm-filter/4.3.1-SNAPSHOT/maven-metadata.xml
Downloading: https://repo2.maven.org/maven2/org/bouncycastle/org/gluu/gluu-orm-filter/4.3.1-SNAPSHOT/maven-metadata.xml
            
Downloading: https://build.shibboleth.net/nexus/content/repositories/releases/org/gluu/gluu-orm-filter/4.3.1-SNAPSHOT/maven-metadata.xml
            
            
            
            
[WARNING] Could not transfer metadata org.gluu:gluu-orm-filter:4.3.1-SNAPSHOT/maven-metadata.xml from/to bouncycastle (https://repo2.maven.org/maven2/org/bouncycastle): repo2.maven.org
[WARNING] Failure to transfer org.gluu:gluu-orm-filter:4.3.1-SNAPSHOT/maven-metadata.xml from https://repo2.maven.org/maven2/org/bouncycastle was cached in the local repository, resolution will not be reattempted until the update interval of bouncycastle has elapsed or updates are forced. Original error: Could not transfer metadata org.gluu:gluu-orm-filter:4.3.1-SNAPSHOT/maven-metadata.xml from/to bouncycastle (https://repo2.maven.org/maven2/org/bouncycastle): repo2.maven.org
Downloading: https://repository.jboss.org/nexus/content/groups/public-jboss/org/gluu/oxcore-service/4.3.1-SNAPSHOT/maven-metadata.xml
Downloading: https://repo2.maven.org/maven2/org/bouncycastle/org/gluu/oxcore-service/4.3.1-SNAPSHOT/maven-metadata.xml
Downloading: https://ox.gluu.org/maven/org/gluu/oxcore-service/4.3.1-SNAPSHOT/maven-metadata.xml
Downloading: https://repo1.maven.org/maven2/org/gluu/oxcore-service/4.3.1-SNAPSHOT/maven-metadata.xml
            
Downloading: https://build.shibboleth.net/nexus/content/repositories/releases/org/gluu/oxcore-service/4.3.1-SNAPSHOT/maven-metadata.xml
            
            
            
            
[WARNING] Could not transfer metadata org.gluu:oxcore-service:4.3.1-SNAPSHOT/maven-metadata.xml from/to bouncycastle (https://repo2.maven.org/maven2/org/bouncycastle): repo2.maven.org
[WARNING] Failure to transfer org.gluu:oxcore-service:4.3.1-SNAPSHOT/maven-metadata.xml from https://repo2.maven.org/maven2/org/bouncycastle was cached in the local repository, resolution will not be reattempted until the update interval of bouncycastle has elapsed or updates are forced. Original error: Could not transfer metadata org.gluu:oxcore-service:4.3.1-SNAPSHOT/maven-metadata.xml from/to bouncycastle (https://repo2.maven.org/maven2/org/bouncycastle): repo2.maven.org
Downloading: https://repository.jboss.org/nexus/content/groups/public-jboss/org/gluu/gluu-orm-couchbase/4.3.1-SNAPSHOT/maven-metadata.xml
Downloading: https://repo2.maven.org/maven2/org/bouncycastle/org/gluu/gluu-orm-couchbase/4.3.1-SNAPSHOT/maven-metadata.xml
Downloading: https://repo1.maven.org/maven2/org/gluu/gluu-orm-couchbase/4.3.1-SNAPSHOT/maven-metadata.xml
Downloading: https://ox.gluu.org/maven/org/gluu/gluu-orm-couchbase/4.3.1-SNAPSHOT/maven-metadata.xml
            
Downloading: https://build.shibboleth.net/nexus/content/repositories/releases/org/gluu/gluu-orm-couchbase/4.3.1-SNAPSHOT/maven-metadata.xml
            
            
            
            
[WARNING] Could not transfer metadata org.gluu:gluu-orm-couchbase:4.3.1-SNAPSHOT/maven-metadata.xml from/to bouncycastle (https://repo2.maven.org/maven2/org/bouncycastle): repo2.maven.org
[WARNING] Failure to transfer org.gluu:gluu-orm-couchbase:4.3.1-SNAPSHOT/maven-metadata.xml from https://repo2.maven.org/maven2/org/bouncycastle was cached in the local repository, resolution will not be reattempted until the update interval of bouncycastle has elapsed or updates are forced. Original error: Could not transfer metadata org.gluu:gluu-orm-couchbase:4.3.1-SNAPSHOT/maven-metadata.xml from/to bouncycastle (https://repo2.maven.org/maven2/org/bouncycastle): repo2.maven.org
Downloading: https://repository.jboss.org/nexus/content/groups/public-jboss/org/gluu/gluu-orm-spanner/4.3.1-SNAPSHOT/maven-metadata.xml
Downloading: https://repo2.maven.org/maven2/org/bouncycastle/org/gluu/gluu-orm-spanner/4.3.1-SNAPSHOT/maven-metadata.xml
Downloading: https://ox.gluu.org/maven/org/gluu/gluu-orm-spanner/4.3.1-SNAPSHOT/maven-metadata.xml
Downloading: https://repo1.maven.org/maven2/org/gluu/gluu-orm-spanner/4.3.1-SNAPSHOT/maven-metadata.xml
            
Downloading: https://build.shibboleth.net/nexus/content/repositories/releases/org/gluu/gluu-orm-spanner/4.3.1-SNAPSHOT/maven-metadata.xml
            
            
            
            
[WARNING] Could not transfer metadata org.gluu:gluu-orm-spanner:4.3.1-SNAPSHOT/maven-metadata.xml from/to bouncycastle (https://repo2.maven.org/maven2/org/bouncycastle): repo2.maven.org
[WARNING] Failure to transfer org.gluu:gluu-orm-spanner:4.3.1-SNAPSHOT/maven-metadata.xml from https://repo2.maven.org/maven2/org/bouncycastle was cached in the local repository, resolution will not be reattempted until the update interval of bouncycastle has elapsed or updates are forced. Original error: Could not transfer metadata org.gluu:gluu-orm-spanner:4.3.1-SNAPSHOT/maven-metadata.xml from/to bouncycastle (https://repo2.maven.org/maven2/org/bouncycastle): repo2.maven.org
Downloading: https://repository.jboss.org/nexus/content/groups/public-jboss/org/gluu/gluu-orm-sql/4.3.1-SNAPSHOT/maven-metadata.xml
Downloading: https://ox.gluu.org/maven/org/gluu/gluu-orm-sql/4.3.1-SNAPSHOT/maven-metadata.xml
Downloading: https://repo2.maven.org/maven2/org/bouncycastle/org/gluu/gluu-orm-sql/4.3.1-SNAPSHOT/maven-metadata.xml
Downloading: https://repo1.maven.org/maven2/org/gluu/gluu-orm-sql/4.3.1-SNAPSHOT/maven-metadata.xml
            
Downloading: https://build.shibboleth.net/nexus/content/repositories/releases/org/gluu/gluu-orm-sql/4.3.1-SNAPSHOT/maven-metadata.xml
            
            
            
            
[WARNING] Could not transfer metadata org.gluu:gluu-orm-sql:4.3.1-SNAPSHOT/maven-metadata.xml from/to bouncycastle (https://repo2.maven.org/maven2/org/bouncycastle): repo2.maven.org
[WARNING] Failure to transfer org.gluu:gluu-orm-sql:4.3.1-SNAPSHOT/maven-metadata.xml from https://repo2.maven.org/maven2/org/bouncycastle was cached in the local repository, resolution will not be reattempted until the update interval of bouncycastle has elapsed or updates are forced. Original error: Could not transfer metadata org.gluu:gluu-orm-sql:4.3.1-SNAPSHOT/maven-metadata.xml from/to bouncycastle (https://repo2.maven.org/maven2/org/bouncycastle): repo2.maven.org
Downloading: https://repository.jboss.org/nexus/content/groups/public-jboss/org/gluu/gluu-orm-hybrid/4.3.1-SNAPSHOT/maven-metadata.xml
Downloading: https://repo2.maven.org/maven2/org/bouncycastle/org/gluu/gluu-orm-hybrid/4.3.1-SNAPSHOT/maven-metadata.xml
Downloading: https://ox.gluu.org/maven/org/gluu/gluu-orm-hybrid/4.3.1-SNAPSHOT/maven-metadata.xml
Downloading: https://repo1.maven.org/maven2/org/gluu/gluu-orm-hybrid/4.3.1-SNAPSHOT/maven-metadata.xml
            
Downloading: https://build.shibboleth.net/nexus/content/repositories/releases/org/gluu/gluu-orm-hybrid/4.3.1-SNAPSHOT/maven-metadata.xml
            
            
            
            
[WARNING] Could not transfer metadata org.gluu:gluu-orm-hybrid:4.3.1-SNAPSHOT/maven-metadata.xml from/to bouncycastle (https://repo2.maven.org/maven2/org/bouncycastle): repo2.maven.org
[WARNING] Failure to transfer org.gluu:gluu-orm-hybrid:4.3.1-SNAPSHOT/maven-metadata.xml from https://repo2.maven.org/maven2/org/bouncycastle was cached in the local repository, resolution will not be reattempted until the update interval of bouncycastle has elapsed or updates are forced. Original error: Could not transfer metadata org.gluu:gluu-orm-hybrid:4.3.1-SNAPSHOT/maven-metadata.xml from/to bouncycastle (https://repo2.maven.org/maven2/org/bouncycastle): repo2.maven.org
Downloading: https://repository.jboss.org/nexus/content/groups/public-jboss/org/gluu/gluu-orm-cdi/4.3.1-SNAPSHOT/maven-metadata.xml
Downloading: https://ox.gluu.org/maven/org/gluu/gluu-orm-cdi/4.3.1-SNAPSHOT/maven-metadata.xml
Downloading: https://repo2.maven.org/maven2/org/bouncycastle/org/gluu/gluu-orm-cdi/4.3.1-SNAPSHOT/maven-metadata.xml
Downloading: https://repo1.maven.org/maven2/org/gluu/gluu-orm-cdi/4.3.1-SNAPSHOT/maven-metadata.xml
            
Downloading: https://build.shibboleth.net/nexus/content/repositories/releases/org/gluu/gluu-orm-cdi/4.3.1-SNAPSHOT/maven-metadata.xml
            
            
            
            
[WARNING] Could not transfer metadata org.gluu:gluu-orm-cdi:4.3.1-SNAPSHOT/maven-metadata.xml from/to bouncycastle (https://repo2.maven.org/maven2/org/bouncycastle): repo2.maven.org
[WARNING] Failure to transfer org.gluu:gluu-orm-cdi:4.3.1-SNAPSHOT/maven-metadata.xml from https://repo2.maven.org/maven2/org/bouncycastle was cached in the local repository, resolution will not be reattempted until the update interval of bouncycastle has elapsed or updates are forced. Original error: Could not transfer metadata org.gluu:gluu-orm-cdi:4.3.1-SNAPSHOT/maven-metadata.xml from/to bouncycastle (https://repo2.maven.org/maven2/org/bouncycastle): repo2.maven.org
Downloading: https://repository.jboss.org/nexus/content/groups/public-jboss/org/gluu/oxcore-cache/4.3.1-SNAPSHOT/maven-metadata.xml
Downloading: https://ox.gluu.org/maven/org/gluu/oxcore-cache/4.3.1-SNAPSHOT/maven-metadata.xml
Downloading: https://repo2.maven.org/maven2/org/bouncycastle/org/gluu/oxcore-cache/4.3.1-SNAPSHOT/maven-metadata.xml
            
Downloading: https://repo1.maven.org/maven2/org/gluu/oxcore-cache/4.3.1-SNAPSHOT/maven-metadata.xml
Downloading: https://build.shibboleth.net/nexus/content/repositories/releases/org/gluu/oxcore-cache/4.3.1-SNAPSHOT/maven-metadata.xml
            
            
            
            
[WARNING] Could not transfer metadata org.gluu:oxcore-cache:4.3.1-SNAPSHOT/maven-metadata.xml from/to bouncycastle (https://repo2.maven.org/maven2/org/bouncycastle): repo2.maven.org
[WARNING] Failure to transfer org.gluu:oxcore-cache:4.3.1-SNAPSHOT/maven-metadata.xml from https://repo2.maven.org/maven2/org/bouncycastle was cached in the local repository, resolution will not be reattempted until the update interval of bouncycastle has elapsed or updates are forced. Original error: Could not transfer metadata org.gluu:oxcore-cache:4.3.1-SNAPSHOT/maven-metadata.xml from/to bouncycastle (https://repo2.maven.org/maven2/org/bouncycastle): repo2.maven.org
Downloading: https://repository.jboss.org/nexus/content/groups/public-jboss/org/gluu/oxcore-script/4.3.1-SNAPSHOT/maven-metadata.xml
Downloading: https://repo2.maven.org/maven2/org/bouncycastle/org/gluu/oxcore-script/4.3.1-SNAPSHOT/maven-metadata.xml
Downloading: https://ox.gluu.org/maven/org/gluu/oxcore-script/4.3.1-SNAPSHOT/maven-metadata.xml
Downloading: https://repo1.maven.org/maven2/org/gluu/oxcore-script/4.3.1-SNAPSHOT/maven-metadata.xml
            
Downloading: https://build.shibboleth.net/nexus/content/repositories/releases/org/gluu/oxcore-script/4.3.1-SNAPSHOT/maven-metadata.xml
            
            
            
            
[WARNING] Could not transfer metadata org.gluu:oxcore-script:4.3.1-SNAPSHOT/maven-metadata.xml from/to bouncycastle (https://repo2.maven.org/maven2/org/bouncycastle): repo2.maven.org
[WARNING] Failure to transfer org.gluu:oxcore-script:4.3.1-SNAPSHOT/maven-metadata.xml from https://repo2.maven.org/maven2/org/bouncycastle was cached in the local repository, resolution will not be reattempted until the update interval of bouncycastle has elapsed or updates are forced. Original error: Could not transfer metadata org.gluu:oxcore-script:4.3.1-SNAPSHOT/maven-metadata.xml from/to bouncycastle (https://repo2.maven.org/maven2/org/bouncycastle): repo2.maven.org
Downloading: https://repository.jboss.org/nexus/content/groups/public-jboss/org/gluu/oxcore-cdi/4.3.1-SNAPSHOT/maven-metadata.xml
Downloading: https://ox.gluu.org/maven/org/gluu/oxcore-cdi/4.3.1-SNAPSHOT/maven-metadata.xml
Downloading: https://repo2.maven.org/maven2/org/bouncycastle/org/gluu/oxcore-cdi/4.3.1-SNAPSHOT/maven-metadata.xml
Downloading: https://repo1.maven.org/maven2/org/gluu/oxcore-cdi/4.3.1-SNAPSHOT/maven-metadata.xml
            
Downloading: https://build.shibboleth.net/nexus/content/repositories/releases/org/gluu/oxcore-cdi/4.3.1-SNAPSHOT/maven-metadata.xml
            
            
            
            
[WARNING] Could not transfer metadata org.gluu:oxcore-cdi:4.3.1-SNAPSHOT/maven-metadata.xml from/to bouncycastle (https://repo2.maven.org/maven2/org/bouncycastle): repo2.maven.org: Name or service not known
[WARNING] Failure to transfer org.gluu:oxcore-cdi:4.3.1-SNAPSHOT/maven-metadata.xml from https://repo2.maven.org/maven2/org/bouncycastle was cached in the local repository, resolution will not be reattempted until the update interval of bouncycastle has elapsed or updates are forced. Original error: Could not transfer metadata org.gluu:oxcore-cdi:4.3.1-SNAPSHOT/maven-metadata.xml from/to bouncycastle (https://repo2.maven.org/maven2/org/bouncycastle): repo2.maven.org: Name or service not known
Downloading: https://repository.jboss.org/nexus/content/groups/public-jboss/org/gluu/oxcore-server/4.3.1-SNAPSHOT/maven-metadata.xml
Downloading: https://ox.gluu.org/maven/org/gluu/oxcore-server/4.3.1-SNAPSHOT/maven-metadata.xml
Downloading: https://repo2.maven.org/maven2/org/bouncycastle/org/gluu/oxcore-server/4.3.1-SNAPSHOT/maven-metadata.xml
            
Downloading: https://repo1.maven.org/maven2/org/gluu/oxcore-server/4.3.1-SNAPSHOT/maven-metadata.xml
Downloading: https://build.shibboleth.net/nexus/content/repositories/releases/org/gluu/oxcore-server/4.3.1-SNAPSHOT/maven-metadata.xml
            
            
            
            
[WARNING] Could not transfer metadata org.gluu:oxcore-server:4.3.1-SNAPSHOT/maven-metadata.xml from/to bouncycastle (https://repo2.maven.org/maven2/org/bouncycastle): repo2.maven.org
[WARNING] Failure to transfer org.gluu:oxcore-server:4.3.1-SNAPSHOT/maven-metadata.xml from https://repo2.maven.org/maven2/org/bouncycastle was cached in the local repository, resolution will not be reattempted until the update interval of bouncycastle has elapsed or updates are forced. Original error: Could not transfer metadata org.gluu:oxcore-server:4.3.1-SNAPSHOT/maven-metadata.xml from/to bouncycastle (https://repo2.maven.org/maven2/org/bouncycastle): repo2.maven.org
Downloading: https://repository.jboss.org/nexus/content/groups/public-jboss/org/gluu/oxcore-saml/4.3.1-SNAPSHOT/maven-metadata.xml
Downloading: https://repo2.maven.org/maven2/org/bouncycastle/org/gluu/oxcore-saml/4.3.1-SNAPSHOT/maven-metadata.xml
Downloading: https://ox.gluu.org/maven/org/gluu/oxcore-saml/4.3.1-SNAPSHOT/maven-metadata.xml
Downloading: https://repo1.maven.org/maven2/org/gluu/oxcore-saml/4.3.1-SNAPSHOT/maven-metadata.xml
            
Downloading: https://build.shibboleth.net/nexus/content/repositories/releases/org/gluu/oxcore-saml/4.3.1-SNAPSHOT/maven-metadata.xml
            
            
            
            
[WARNING] Could not transfer metadata org.gluu:oxcore-saml:4.3.1-SNAPSHOT/maven-metadata.xml from/to bouncycastle (https://repo2.maven.org/maven2/org/bouncycastle): repo2.maven.org
[WARNING] Failure to transfer org.gluu:oxcore-saml:4.3.1-SNAPSHOT/maven-metadata.xml from https://repo2.maven.org/maven2/org/bouncycastle was cached in the local repository, resolution will not be reattempted until the update interval of bouncycastle has elapsed or updates are forced. Original error: Could not transfer metadata org.gluu:oxcore-saml:4.3.1-SNAPSHOT/maven-metadata.xml from/to bouncycastle (https://repo2.maven.org/maven2/org/bouncycastle): repo2.maven.org
Downloading: https://repository.jboss.org/nexus/content/groups/public-jboss/org/gluu/oxcore-document-store/4.3.1-SNAPSHOT/maven-metadata.xml
Downloading: https://ox.gluu.org/maven/org/gluu/oxcore-document-store/4.3.1-SNAPSHOT/maven-metadata.xml
Downloading: https://repo2.maven.org/maven2/org/bouncycastle/org/gluu/oxcore-document-store/4.3.1-SNAPSHOT/maven-metadata.xml
Downloading: https://repo1.maven.org/maven2/org/gluu/oxcore-document-store/4.3.1-SNAPSHOT/maven-metadata.xml
            
Downloading: https://build.shibboleth.net/nexus/content/repositories/releases/org/gluu/oxcore-document-store/4.3.1-SNAPSHOT/maven-metadata.xml
            
            
            
            
[WARNING] Could not transfer metadata org.gluu:oxcore-document-store:4.3.1-SNAPSHOT/maven-metadata.xml from/to bouncycastle (https://repo2.maven.org/maven2/org/bouncycastle): repo2.maven.org
[WARNING] Failure to transfer org.gluu:oxcore-document-store:4.3.1-SNAPSHOT/maven-metadata.xml from https://repo2.maven.org/maven2/org/bouncycastle was cached in the local repository, resolution will not be reattempted until the update interval of bouncycastle has elapsed or updates are forced. Original error: Could not transfer metadata org.gluu:oxcore-document-store:4.3.1-SNAPSHOT/maven-metadata.xml from/to bouncycastle (https://repo2.maven.org/maven2/org/bouncycastle): repo2.maven.org
Downloading: https://repository.jboss.org/nexus/content/groups/public-jboss/org/gluu/oxauth-model/4.3.1-SNAPSHOT/maven-metadata.xml
Downloading: https://ox.gluu.org/maven/org/gluu/oxauth-model/4.3.1-SNAPSHOT/maven-metadata.xml
Downloading: https://repo2.maven.org/maven2/org/bouncycastle/org/gluu/oxauth-model/4.3.1-SNAPSHOT/maven-metadata.xml
            
Downloading: https://repo1.maven.org/maven2/org/gluu/oxauth-model/4.3.1-SNAPSHOT/maven-metadata.xml
Downloading: https://build.shibboleth.net/nexus/content/repositories/releases/org/gluu/oxauth-model/4.3.1-SNAPSHOT/maven-metadata.xml
            
            
            
            
[WARNING] Could not transfer metadata org.gluu:oxauth-model:4.3.1-SNAPSHOT/maven-metadata.xml from/to bouncycastle (https://repo2.maven.org/maven2/org/bouncycastle): repo2.maven.org
[WARNING] Failure to transfer org.gluu:oxauth-model:4.3.1-SNAPSHOT/maven-metadata.xml from https://repo2.maven.org/maven2/org/bouncycastle was cached in the local repository, resolution will not be reattempted until the update interval of bouncycastle has elapsed or updates are forced. Original error: Could not transfer metadata org.gluu:oxauth-model:4.3.1-SNAPSHOT/maven-metadata.xml from/to bouncycastle (https://repo2.maven.org/maven2/org/bouncycastle): repo2.maven.org
Downloading: https://repository.jboss.org/nexus/content/groups/public-jboss/org/gluu/oxauth/4.3.1-SNAPSHOT/maven-metadata.xml
Downloading: https://ox.gluu.org/maven/org/gluu/oxauth/4.3.1-SNAPSHOT/maven-metadata.xml
Downloading: https://repo2.maven.org/maven2/org/bouncycastle/org/gluu/oxauth/4.3.1-SNAPSHOT/maven-metadata.xml
            
Downloading: https://repo1.maven.org/maven2/org/gluu/oxauth/4.3.1-SNAPSHOT/maven-metadata.xml
Downloading: https://build.shibboleth.net/nexus/content/repositories/releases/org/gluu/oxauth/4.3.1-SNAPSHOT/maven-metadata.xml
            
            
            
            
[WARNING] Could not transfer metadata org.gluu:oxauth:4.3.1-SNAPSHOT/maven-metadata.xml from/to bouncycastle (https://repo2.maven.org/maven2/org/bouncycastle): repo2.maven.org
Downloading: https://repository.jboss.org/nexus/content/groups/public-jboss/org/gluu/oxeleven-client/4.3.1-SNAPSHOT/maven-metadata.xml
Downloading: https://ox.gluu.org/maven/org/gluu/oxeleven-client/4.3.1-SNAPSHOT/maven-metadata.xml
Downloading: https://repo2.maven.org/maven2/org/bouncycastle/org/gluu/oxeleven-client/4.3.1-SNAPSHOT/maven-metadata.xml
Downloading: https://repo1.maven.org/maven2/org/gluu/oxeleven-client/4.3.1-SNAPSHOT/maven-metadata.xml
            
Downloading: https://build.shibboleth.net/nexus/content/repositories/releases/org/gluu/oxeleven-client/4.3.1-SNAPSHOT/maven-metadata.xml
            
            
            
            
[WARNING] Could not transfer metadata org.gluu:oxeleven-client:4.3.1-SNAPSHOT/maven-metadata.xml from/to bouncycastle (https://repo2.maven.org/maven2/org/bouncycastle): repo2.maven.org
[WARNING] Failure to transfer org.gluu:oxeleven-client:4.3.1-SNAPSHOT/maven-metadata.xml from https://repo2.maven.org/maven2/org/bouncycastle was cached in the local repository, resolution will not be reattempted until the update interval of bouncycastle has elapsed or updates are forced. Original error: Could not transfer metadata org.gluu:oxeleven-client:4.3.1-SNAPSHOT/maven-metadata.xml from/to bouncycastle (https://repo2.maven.org/maven2/org/bouncycastle): repo2.maven.org
Downloading: https://repository.jboss.org/nexus/content/groups/public-jboss/org/gluu/oxeleven/4.3.1-SNAPSHOT/maven-metadata.xml
Downloading: https://repo2.maven.org/maven2/org/bouncycastle/org/gluu/oxeleven/4.3.1-SNAPSHOT/maven-metadata.xml
Downloading: https://ox.gluu.org/maven/org/gluu/oxeleven/4.3.1-SNAPSHOT/maven-metadata.xml
Downloading: https://repo1.maven.org/maven2/org/gluu/oxeleven/4.3.1-SNAPSHOT/maven-metadata.xml
            
Downloading: https://build.shibboleth.net/nexus/content/repositories/releases/org/gluu/oxeleven/4.3.1-SNAPSHOT/maven-metadata.xml
            
            
            
            
[WARNING] Could not transfer metadata org.gluu:oxeleven:4.3.1-SNAPSHOT/maven-metadata.xml from/to bouncycastle (https://repo2.maven.org/maven2/org/bouncycastle): repo2.maven.org
Downloading: https://repository.jboss.org/nexus/content/groups/public-jboss/org/gluu/oxeleven-model/4.3.1-SNAPSHOT/maven-metadata.xml
Downloading: https://ox.gluu.org/maven/org/gluu/oxeleven-model/4.3.1-SNAPSHOT/maven-metadata.xml
Downloading: https://repo2.maven.org/maven2/org/bouncycastle/org/gluu/oxeleven-model/4.3.1-SNAPSHOT/maven-metadata.xml
            
Downloading: https://repo1.maven.org/maven2/org/gluu/oxeleven-model/4.3.1-SNAPSHOT/maven-metadata.xml
Downloading: https://build.shibboleth.net/nexus/content/repositories/releases/org/gluu/oxeleven-model/4.3.1-SNAPSHOT/maven-metadata.xml
            
            
            
            
[WARNING] Could not transfer metadata org.gluu:oxeleven-model:4.3.1-SNAPSHOT/maven-metadata.xml from/to bouncycastle (https://repo2.maven.org/maven2/org/bouncycastle): repo2.maven.org
[WARNING] Failure to transfer org.gluu:oxeleven-model:4.3.1-SNAPSHOT/maven-metadata.xml from https://repo2.maven.org/maven2/org/bouncycastle was cached in the local repository, resolution will not be reattempted until the update interval of bouncycastle has elapsed or updates are forced. Original error: Could not transfer metadata org.gluu:oxeleven-model:4.3.1-SNAPSHOT/maven-metadata.xml from/to bouncycastle (https://repo2.maven.org/maven2/org/bouncycastle): repo2.maven.org
Downloading: https://repo1.maven.org/maven2/org/gluu/oxauth-persistence-model/4.3.1-SNAPSHOT/maven-metadata.xml
Downloading: https://repo2.maven.org/maven2/org/bouncycastle/org/gluu/oxauth-persistence-model/4.3.1-SNAPSHOT/maven-metadata.xml
Downloading: https://ox.gluu.org/maven/org/gluu/oxauth-persistence-model/4.3.1-SNAPSHOT/maven-metadata.xml
Downloading: https://repository.jboss.org/nexus/content/groups/public-jboss/org/gluu/oxauth-persistence-model/4.3.1-SNAPSHOT/maven-metadata.xml
            
Downloading: https://build.shibboleth.net/nexus/content/repositories/releases/org/gluu/oxauth-persistence-model/4.3.1-SNAPSHOT/maven-metadata.xml
            
            
            
            
[WARNING] Could not transfer metadata org.gluu:oxauth-persistence-model:4.3.1-SNAPSHOT/maven-metadata.xml from/to bouncycastle (https://repo2.maven.org/maven2/org/bouncycastle): repo2.maven.org
[WARNING] Failure to transfer org.gluu:oxauth-persistence-model:4.3.1-SNAPSHOT/maven-metadata.xml from https://repo2.maven.org/maven2/org/bouncycastle was cached in the local repository, resolution will not be reattempted until the update interval of bouncycastle has elapsed or updates are forced. Original error: Could not transfer metadata org.gluu:oxauth-persistence-model:4.3.1-SNAPSHOT/maven-metadata.xml from/to bouncycastle (https://repo2.maven.org/maven2/org/bouncycastle): repo2.maven.org
[INFO] 
[INFO] --- maven-clean-plugin:2.5:clean (default-clean) @ api-model ---
[INFO] Deleting /home/jenkins/.jenkins/jobs/oxtrust-api_master/workspace/api-model/target
[INFO] 
[INFO] --- maven-resources-plugin:2.6:resources (default-resources) @ api-model ---
[INFO] Using 'UTF-8' encoding to copy filtered resources.
[INFO] skip non existing resourceDirectory /home/jenkins/.jenkins/jobs/oxtrust-api_master/workspace/api-model/src/main/resources
[INFO] 
[INFO] --- maven-compiler-plugin:2.3.2:compile (default-compile) @ api-model ---
[INFO] No sources to compile
[INFO] 
[INFO] --- maven-resources-plugin:2.6:resources (default-resources) @ api-model ---
[INFO] Using 'UTF-8' encoding to copy filtered resources.
[INFO] skip non existing resourceDirectory /home/jenkins/.jenkins/jobs/oxtrust-api_master/workspace/api-model/src/main/resources
[INFO] 
[INFO] --- maven-compiler-plugin:2.3.2:compile (default-compile) @ api-model ---
[INFO] No sources to compile
[INFO] 
[INFO] --- maven-resources-plugin:2.6:testResources (default-testResources) @ api-model ---
[INFO] Using 'UTF-8' encoding to copy filtered resources.
[INFO] skip non existing resourceDirectory /home/jenkins/.jenkins/jobs/oxtrust-api_master/workspace/api-model/src/test/resources
[INFO] 
[INFO] --- maven-compiler-plugin:2.3.2:testCompile (default-testCompile) @ api-model ---
[INFO] No sources to compile
[INFO] 
[INFO] --- maven-surefire-plugin:2.19.1:test (default-test) @ api-model ---
[INFO] No tests to run.
[INFO] 
[INFO] --- maven-jar-plugin:2.4:jar (default-jar) @ api-model ---
[WARNING] JAR will be empty - no content was marked for inclusion!
[INFO] Building jar: /home/jenkins/.jenkins/jobs/oxtrust-api_master/workspace/api-model/target/api-model-4.3.1-SNAPSHOT.jar
[INFO] 
[INFO] --- maven-jar-plugin:2.4:test-jar (default) @ api-model ---
[WARNING] JAR will be empty - no content was marked for inclusion!
[INFO] Building jar: /home/jenkins/.jenkins/jobs/oxtrust-api_master/workspace/api-model/target/api-model-4.3.1-SNAPSHOT-tests.jar
[INFO] 
[INFO] --- maven-install-plugin:2.3.1:install (default-install) @ api-model ---
[INFO] Installing /home/jenkins/.jenkins/jobs/oxtrust-api_master/workspace/api-model/target/api-model-4.3.1-SNAPSHOT.jar to /var/www/html/maven/org/gluu/api-model/4.3.1-SNAPSHOT/api-model-4.3.1-SNAPSHOT.jar
[INFO] Installing /home/jenkins/.jenkins/jobs/oxtrust-api_master/workspace/api-model/pom.xml to /var/www/html/maven/org/gluu/api-model/4.3.1-SNAPSHOT/api-model-4.3.1-SNAPSHOT.pom
[INFO] Installing /home/jenkins/.jenkins/jobs/oxtrust-api_master/workspace/api-model/target/api-model-4.3.1-SNAPSHOT-tests.jar to /var/www/html/maven/org/gluu/api-model/4.3.1-SNAPSHOT/api-model-4.3.1-SNAPSHOT-tests.jar
[INFO] 
[INFO] >>> maven-javadoc-plugin:3.0.1:javadoc (default-cli) > generate-sources @ api-model >>>
[INFO] 
[INFO] <<< maven-javadoc-plugin:3.0.1:javadoc (default-cli) < generate-sources @ api-model <<<
[INFO] 
[INFO] --- maven-javadoc-plugin:3.0.1:javadoc (default-cli) @ api-model ---
[INFO] 
[INFO] --- maven-site-plugin:2.1.1:site (default-site) @ api-model ---
[INFO]                                                                         
[INFO] ------------------------------------------------------------------------
[INFO] Building oxTrust API Client library 4.3.1-SNAPSHOT
[INFO] ------------------------------------------------------------------------
Downloading: https://repository.jboss.org/nexus/content/groups/public-jboss/org/gluu/oxauth-client/4.3.1-SNAPSHOT/maven-metadata.xml
Downloading: https://ox.gluu.org/maven/org/gluu/oxauth-client/4.3.1-SNAPSHOT/maven-metadata.xml
Downloading: https://repo2.maven.org/maven2/org/bouncycastle/org/gluu/oxauth-client/4.3.1-SNAPSHOT/maven-metadata.xml
Downloading: https://repo1.maven.org/maven2/org/gluu/oxauth-client/4.3.1-SNAPSHOT/maven-metadata.xml
            
Downloading: https://build.shibboleth.net/nexus/content/repositories/releases/org/gluu/oxauth-client/4.3.1-SNAPSHOT/maven-metadata.xml
            
            
            
            
[WARNING] Could not transfer metadata org.gluu:oxauth-client:4.3.1-SNAPSHOT/maven-metadata.xml from/to bouncycastle (https://repo2.maven.org/maven2/org/bouncycastle): repo2.maven.org
[WARNING] Failure to transfer org.gluu:oxauth-client:4.3.1-SNAPSHOT/maven-metadata.xml from https://repo2.maven.org/maven2/org/bouncycastle was cached in the local repository, resolution will not be reattempted until the update interval of bouncycastle has elapsed or updates are forced. Original error: Could not transfer metadata org.gluu:oxauth-client:4.3.1-SNAPSHOT/maven-metadata.xml from/to bouncycastle (https://repo2.maven.org/maven2/org/bouncycastle): repo2.maven.org
Downloading: https://repository.jboss.org/nexus/content/groups/public-jboss/org/gluu/oxtrust-model/4.3.1-SNAPSHOT/maven-metadata.xml
Downloading: https://ox.gluu.org/maven/org/gluu/oxtrust-model/4.3.1-SNAPSHOT/maven-metadata.xml
Downloading: https://repo1.maven.org/maven2/org/gluu/oxtrust-model/4.3.1-SNAPSHOT/maven-metadata.xml
Downloading: https://repo2.maven.org/maven2/org/bouncycastle/org/gluu/oxtrust-model/4.3.1-SNAPSHOT/maven-metadata.xml
            
Downloading: https://build.shibboleth.net/nexus/content/repositories/releases/org/gluu/oxtrust-model/4.3.1-SNAPSHOT/maven-metadata.xml
            
            
            
            
[WARNING] Could not transfer metadata org.gluu:oxtrust-model:4.3.1-SNAPSHOT/maven-metadata.xml from/to bouncycastle (https://repo2.maven.org/maven2/org/bouncycastle): repo2.maven.org
[WARNING] Failure to transfer org.gluu:oxtrust-model:4.3.1-SNAPSHOT/maven-metadata.xml from https://repo2.maven.org/maven2/org/bouncycastle was cached in the local repository, resolution will not be reattempted until the update interval of bouncycastle has elapsed or updates are forced. Original error: Could not transfer metadata org.gluu:oxtrust-model:4.3.1-SNAPSHOT/maven-metadata.xml from/to bouncycastle (https://repo2.maven.org/maven2/org/bouncycastle): repo2.maven.org
Downloading: https://repository.jboss.org/nexus/content/groups/public-jboss/org/gluu/oxtrust/4.3.1-SNAPSHOT/maven-metadata.xml
Downloading: https://ox.gluu.org/maven/org/gluu/oxtrust/4.3.1-SNAPSHOT/maven-metadata.xml
Downloading: https://repo1.maven.org/maven2/org/gluu/oxtrust/4.3.1-SNAPSHOT/maven-metadata.xml
Downloading: https://repo2.maven.org/maven2/org/bouncycastle/org/gluu/oxtrust/4.3.1-SNAPSHOT/maven-metadata.xml
            
Downloading: https://build.shibboleth.net/nexus/content/repositories/releases/org/gluu/oxtrust/4.3.1-SNAPSHOT/maven-metadata.xml
            
            
            
            
[WARNING] Could not transfer metadata org.gluu:oxtrust:4.3.1-SNAPSHOT/maven-metadata.xml from/to bouncycastle (https://repo2.maven.org/maven2/org/bouncycastle): repo2.maven.org
[INFO] 
[INFO] --- maven-clean-plugin:2.5:clean (default-clean) @ api-client ---
[INFO] Deleting /home/jenkins/.jenkins/jobs/oxtrust-api_master/workspace/api-client/target
[INFO] 
[INFO] --- maven-resources-plugin:2.6:resources (default-resources) @ api-client ---
[INFO] Using 'UTF-8' encoding to copy filtered resources.
[INFO] skip non existing resourceDirectory /home/jenkins/.jenkins/jobs/oxtrust-api_master/workspace/api-client/src/main/resources
[INFO] 
[INFO] --- maven-compiler-plugin:2.3.2:compile (default-compile) @ api-client ---
[INFO] No sources to compile
[INFO] 
[INFO] --- maven-resources-plugin:2.6:resources (default-resources) @ api-client ---
[INFO] Using 'UTF-8' encoding to copy filtered resources.
[INFO] skip non existing resourceDirectory /home/jenkins/.jenkins/jobs/oxtrust-api_master/workspace/api-client/src/main/resources
[INFO] 
[INFO] --- maven-compiler-plugin:2.3.2:compile (default-compile) @ api-client ---
[INFO] No sources to compile
[INFO] 
[INFO] --- maven-resources-plugin:2.6:testResources (default-testResources) @ api-client ---
[INFO] Using 'UTF-8' encoding to copy filtered resources.
[INFO] skip non existing resourceDirectory /home/jenkins/.jenkins/jobs/oxtrust-api_master/workspace/api-client/src/test/resources
[INFO] 
[INFO] --- maven-compiler-plugin:2.3.2:testCompile (default-testCompile) @ api-client ---
[INFO] No sources to compile
[INFO] 
[INFO] --- maven-surefire-plugin:2.19.1:test (default-test) @ api-client ---
[INFO] No tests to run.
[INFO] 
[INFO] --- maven-jar-plugin:2.4:jar (default-jar) @ api-client ---
[WARNING] JAR will be empty - no content was marked for inclusion!
[INFO] Building jar: /home/jenkins/.jenkins/jobs/oxtrust-api_master/workspace/api-client/target/api-client-4.3.1-SNAPSHOT.jar
[INFO] 
[INFO] --- maven-jar-plugin:2.4:test-jar (default) @ api-client ---
[WARNING] JAR will be empty - no content was marked for inclusion!
[INFO] Building jar: /home/jenkins/.jenkins/jobs/oxtrust-api_master/workspace/api-client/target/api-client-4.3.1-SNAPSHOT-tests.jar
[INFO] 
[INFO] --- maven-install-plugin:2.3.1:install (default-install) @ api-client ---
[INFO] Installing /home/jenkins/.jenkins/jobs/oxtrust-api_master/workspace/api-client/target/api-client-4.3.1-SNAPSHOT.jar to /var/www/html/maven/org/gluu/api-client/4.3.1-SNAPSHOT/api-client-4.3.1-SNAPSHOT.jar
[INFO] Installing /home/jenkins/.jenkins/jobs/oxtrust-api_master/workspace/api-client/pom.xml to /var/www/html/maven/org/gluu/api-client/4.3.1-SNAPSHOT/api-client-4.3.1-SNAPSHOT.pom
[INFO] Installing /home/jenkins/.jenkins/jobs/oxtrust-api_master/workspace/api-client/target/api-client-4.3.1-SNAPSHOT-tests.jar to /var/www/html/maven/org/gluu/api-client/4.3.1-SNAPSHOT/api-client-4.3.1-SNAPSHOT-tests.jar
[INFO] 
[INFO] >>> maven-javadoc-plugin:3.0.1:javadoc (default-cli) > generate-sources @ api-client >>>
[INFO] 
[INFO] <<< maven-javadoc-plugin:3.0.1:javadoc (default-cli) < generate-sources @ api-client <<<
[INFO] 
[INFO] --- maven-javadoc-plugin:3.0.1:javadoc (default-cli) @ api-client ---
[INFO] 
[INFO] --- maven-site-plugin:2.1.1:site (default-site) @ api-client ---
[INFO]                                                                         
[INFO] ------------------------------------------------------------------------
[INFO] Building API server rest 4.3.1-SNAPSHOT
[INFO] ------------------------------------------------------------------------
Downloading: https://repository.jboss.org/nexus/content/groups/public-jboss/org/gluu/oxtrust-service/4.3.1-SNAPSHOT/maven-metadata.xml
Downloading: https://ox.gluu.org/maven/org/gluu/oxtrust-service/4.3.1-SNAPSHOT/maven-metadata.xml
Downloading: https://repo2.maven.org/maven2/org/bouncycastle/org/gluu/oxtrust-service/4.3.1-SNAPSHOT/maven-metadata.xml
Downloading: https://repo1.maven.org/maven2/org/gluu/oxtrust-service/4.3.1-SNAPSHOT/maven-metadata.xml
            
Downloading: https://build.shibboleth.net/nexus/content/repositories/releases/org/gluu/oxtrust-service/4.3.1-SNAPSHOT/maven-metadata.xml
            
            
            
            
[WARNING] Could not transfer metadata org.gluu:oxtrust-service:4.3.1-SNAPSHOT/maven-metadata.xml from/to bouncycastle (https://repo2.maven.org/maven2/org/bouncycastle): repo2.maven.org
[WARNING] Failure to transfer org.gluu:oxtrust-service:4.3.1-SNAPSHOT/maven-metadata.xml from https://repo2.maven.org/maven2/org/bouncycastle was cached in the local repository, resolution will not be reattempted until the update interval of bouncycastle has elapsed or updates are forced. Original error: Could not transfer metadata org.gluu:oxtrust-service:4.3.1-SNAPSHOT/maven-metadata.xml from/to bouncycastle (https://repo2.maven.org/maven2/org/bouncycastle): repo2.maven.org
Downloading: https://ox.gluu.org/maven/org/gluu/oxcore-radius/4.3.1-SNAPSHOT/maven-metadata.xml
Downloading: https://repo1.maven.org/maven2/org/gluu/oxcore-radius/4.3.1-SNAPSHOT/maven-metadata.xml
Downloading: https://repo2.maven.org/maven2/org/bouncycastle/org/gluu/oxcore-radius/4.3.1-SNAPSHOT/maven-metadata.xml
Downloading: https://repository.jboss.org/nexus/content/groups/public-jboss/org/gluu/oxcore-radius/4.3.1-SNAPSHOT/maven-metadata.xml
            
Downloading: https://build.shibboleth.net/nexus/content/repositories/releases/org/gluu/oxcore-radius/4.3.1-SNAPSHOT/maven-metadata.xml
            
            
            
            
[WARNING] Could not transfer metadata org.gluu:oxcore-radius:4.3.1-SNAPSHOT/maven-metadata.xml from/to bouncycastle (https://repo2.maven.org/maven2/org/bouncycastle): repo2.maven.org
[WARNING] Failure to transfer org.gluu:oxcore-radius:4.3.1-SNAPSHOT/maven-metadata.xml from https://repo2.maven.org/maven2/org/bouncycastle was cached in the local repository, resolution will not be reattempted until the update interval of bouncycastle has elapsed or updates are forced. Original error: Could not transfer metadata org.gluu:oxcore-radius:4.3.1-SNAPSHOT/maven-metadata.xml from/to bouncycastle (https://repo2.maven.org/maven2/org/bouncycastle): repo2.maven.org
[INFO] 
[INFO] --- maven-clean-plugin:2.5:clean (default-clean) @ api-rest ---
[INFO] Deleting /home/jenkins/.jenkins/jobs/oxtrust-api_master/workspace/api-rest/target
[INFO] 
[INFO] --- maven-resources-plugin:2.6:resources (default-resources) @ api-rest ---
[INFO] Using 'UTF-8' encoding to copy filtered resources.
[INFO] Copying 1 resource
[INFO] 
[INFO] --- maven-compiler-plugin:2.3.2:compile (default-compile) @ api-rest ---
[INFO] Compiling 71 source files to /home/jenkins/.jenkins/jobs/oxtrust-api_master/workspace/api-rest/target/classes
[INFO] 
[INFO] --- swagger-maven-plugin:2.0.8:resolve (default) @ api-rest ---
[INFO] Resolving OpenAPI specification..
[INFO] 
[INFO] --- maven-resources-plugin:2.6:resources (default-resources) @ api-rest ---
[INFO] Using 'UTF-8' encoding to copy filtered resources.
[INFO] Copying 1 resource
[INFO] 
[INFO] --- maven-compiler-plugin:2.3.2:compile (default-compile) @ api-rest ---
[INFO] Nothing to compile - all classes are up to date
[INFO] 
[INFO] --- swagger-maven-plugin:2.0.8:resolve (default) @ api-rest ---
[INFO] Resolving OpenAPI specification..
[INFO] 
[INFO] --- maven-resources-plugin:2.6:testResources (default-testResources) @ api-rest ---
[INFO] Using 'UTF-8' encoding to copy filtered resources.
[INFO] skip non existing resourceDirectory /home/jenkins/.jenkins/jobs/oxtrust-api_master/workspace/api-rest/src/test/resources
[INFO] 
[INFO] --- maven-compiler-plugin:2.3.2:testCompile (default-testCompile) @ api-rest ---
[INFO] Compiling 20 source files to /home/jenkins/.jenkins/jobs/oxtrust-api_master/workspace/api-rest/target/test-classes
[INFO] -------------------------------------------------------------
[ERROR] COMPILATION ERROR : 
[INFO] -------------------------------------------------------------
[ERROR] /home/jenkins/.jenkins/jobs/oxtrust-api_master/workspace/api-rest/src/test/java/org/api/server/OxtrustSettingWebResourceTest.java:[20,34] error: cannot find symbol
[INFO] 1 error
[INFO] -------------------------------------------------------------
[INFO] ------------------------------------------------------------------------
[INFO] Reactor Summary:
[INFO] 
[INFO] oxTrust API ........................................ SUCCESS [  2.446 s]
[INFO] oxTrust API Model library .......................... SUCCESS [  8.963 s]
[INFO] oxTrust API Client library ......................... SUCCESS [  0.961 s]
[INFO] API server rest .................................... FAILURE [  9.362 s]
[INFO] API Server ......................................... SKIPPED
[INFO] ------------------------------------------------------------------------
[INFO] BUILD FAILURE
[INFO] ------------------------------------------------------------------------
[INFO] Total time: 25.649 s
[INFO] Finished at: 2021-10-17T12:03:45+00:00
[INFO] Final Memory: 91M/576M
[INFO] ------------------------------------------------------------------------
[ERROR] Failed to execute goal org.apache.maven.plugins:maven-compiler-plugin:2.3.2:testCompile (default-testCompile) on project api-rest: Compilation failure
[ERROR] /home/jenkins/.jenkins/jobs/oxtrust-api_master/workspace/api-rest/src/test/java/org/api/server/OxtrustSettingWebResourceTest.java:[20,34] error: cannot find symbol
[ERROR] -> [Help 1]
[ERROR] 
[ERROR] To see the full stack trace of the errors, re-run Maven with the -e switch.
[ERROR] Re-run Maven using the -X switch to enable full debug logging.
[ERROR] 
[ERROR] For more information about the errors and possible solutions, please read the following articles:
[ERROR] [Help 1] http://cwiki.apache.org/confluence/display/MAVEN/MojoFailureException
[ERROR] 
[ERROR] After correcting the problems, you can resume the build with the command
[ERROR]   mvn <goals> -rf :api-rest
Build step 'Invoke top-level Maven targets' marked build as failure
TestNG Reports Processing: START
Looking for TestNG results report in workspace using pattern: **/testng-results.xml
Did not find any matching files.
Not sending mail to unregistered user 54212639+mo-auto@users.noreply.github.com
Not sending mail to unregistered user uprightech@gmail.com
Not sending mail to unregistered user Yuriy.Movchan@gmail.com
Not sending mail to unregistered user noreply@github.com
Sending e-mails to: support@gluu.org thomas@gluu.org jose@gluu.org
ERROR: Could not connect to SMTP host: webmail.gluu.org, port: 465
javax.mail.MessagingException: Could not connect to SMTP host: webmail.gluu.org, port: 465;
  nested exception is:
	javax.net.ssl.SSLHandshakeException: sun.security.validator.ValidatorException: PKIX path building failed: sun.security.provider.certpath.SunCertPathBuilderException: unable to find valid certification path to requested target
	at com.sun.mail.smtp.SMTPTransport.openServer(SMTPTransport.java:2212)
	at com.sun.mail.smtp.SMTPTransport.protocolConnect(SMTPTransport.java:722)
	at javax.mail.Service.connect(Service.java:310)
	at javax.mail.Service.connect(Service.java:169)
	at javax.mail.Service.connect(Service.java:118)
	at javax.mail.Transport.send0(Transport.java:188)
	at javax.mail.Transport.send(Transport.java:118)
	at hudson.tasks.MailSender.run(MailSender.java:130)
	at hudson.tasks.Mailer.perform(Mailer.java:176)
	at hudson.tasks.Mailer.perform(Mailer.java:139)
	at hudson.tasks.BuildStepMonitor$1.perform(BuildStepMonitor.java:20)
	at hudson.model.AbstractBuild$AbstractBuildExecution.perform(AbstractBuild.java:741)
	at hudson.model.AbstractBuild$AbstractBuildExecution.performAllBuildSteps(AbstractBuild.java:690)
	at hudson.model.Build$BuildExecution.post2(Build.java:186)
	at hudson.model.AbstractBuild$AbstractBuildExecution.post(AbstractBuild.java:635)
	at hudson.model.Run.execute(Run.java:1905)
	at hudson.model.FreeStyleBuild.run(FreeStyleBuild.java:43)
	at hudson.model.ResourceController.execute(ResourceController.java:97)
	at hudson.model.Executor.run(Executor.java:428)
Caused by: javax.net.ssl.SSLHandshakeException: sun.security.validator.ValidatorException: PKIX path building failed: sun.security.provider.certpath.SunCertPathBuilderException: unable to find valid certification path to requested target
	at sun.security.ssl.Alerts.getSSLException(Alerts.java:192)
	at sun.security.ssl.SSLSocketImpl.fatal(SSLSocketImpl.java:1949)
	at sun.security.ssl.Handshaker.fatalSE(Handshaker.java:302)
	at sun.security.ssl.Handshaker.fatalSE(Handshaker.java:296)
	at sun.security.ssl.ClientHandshaker.serverCertificate(ClientHandshaker.java:1514)
	at sun.security.ssl.ClientHandshaker.processMessage(ClientHandshaker.java:216)
	at sun.security.ssl.Handshaker.processLoop(Handshaker.java:1026)
	at sun.security.ssl.Handshaker.process_record(Handshaker.java:961)
	at sun.security.ssl.SSLSocketImpl.readRecord(SSLSocketImpl.java:1062)
	at sun.security.ssl.SSLSocketImpl.performInitialHandshake(SSLSocketImpl.java:1375)
	at sun.security.ssl.SSLSocketImpl.startHandshake(SSLSocketImpl.java:1403)
	at sun.security.ssl.SSLSocketImpl.startHandshake(SSLSocketImpl.java:1387)
	at com.sun.mail.util.SocketFetcher.configureSSLSocket(SocketFetcher.java:602)
	at com.sun.mail.util.SocketFetcher.createSocket(SocketFetcher.java:376)
	at com.sun.mail.util.SocketFetcher.getSocket(SocketFetcher.java:193)
	at com.sun.mail.smtp.SMTPTransport.openServer(SMTPTransport.java:2160)
	... 18 more
Caused by: sun.security.validator.ValidatorException: PKIX path building failed: sun.security.provider.certpath.SunCertPathBuilderException: unable to find valid certification path to requested target
	at sun.security.validator.PKIXValidator.doBuild(PKIXValidator.java:387)
	at sun.security.validator.PKIXValidator.engineValidate(PKIXValidator.java:230)
	at sun.security.validator.Validator.validate(Validator.java:260)
	at sun.security.ssl.X509TrustManagerImpl.validate(X509TrustManagerImpl.java:324)
	at sun.security.ssl.X509TrustManagerImpl.checkTrusted(X509TrustManagerImpl.java:229)
	at sun.security.ssl.X509TrustManagerImpl.checkServerTrusted(X509TrustManagerImpl.java:124)
	at sun.security.ssl.ClientHandshaker.serverCertificate(ClientHandshaker.java:1496)
	... 29 more
Caused by: sun.security.provider.certpath.SunCertPathBuilderException: unable to find valid certification path to requested target
	at sun.security.provider.certpath.SunCertPathBuilder.build(SunCertPathBuilder.java:141)
	at sun.security.provider.certpath.SunCertPathBuilder.engineBuild(SunCertPathBuilder.java:126)
	at java.security.cert.CertPathBuilder.build(CertPathBuilder.java:280)
	at sun.security.validator.PKIXValidator.doBuild(PKIXValidator.java:382)
	... 35 more
[Boolean condition] checking [true] against [^(1|y|yes|t|true|on|run)$] (origin token: $DEPLOY_BUILD)
Run condition [Boolean condition] enabling perform for step [Builder to mark whether executed]
Finished: FAILURE