FailedConsole Output

Skipping 28 KB.. Full Log
Downloading: https://repo1.maven.org/maven2/org/gluu/gluu-orm-ldap/4.4.0-SNAPSHOT/maven-metadata.xml
Downloading: https://maven.gluu.org/maven/org/gluu/gluu-orm-ldap/4.4.0-SNAPSHOT/maven-metadata.xml
Downloading: https://repository.jboss.org/nexus/content/groups/public-jboss/org/gluu/gluu-orm-ldap/4.4.0-SNAPSHOT/maven-metadata.xml
Downloading: https://build.shibboleth.net/nexus/content/repositories/releases/org/gluu/gluu-orm-ldap/4.4.0-SNAPSHOT/maven-metadata.xml




Downloading: https://repository.jboss.org/nexus/content/groups/public-jboss/org/gluu/gluu-orm-core/4.4.0-SNAPSHOT/maven-metadata.xml
Downloading: https://repo2.maven.org/maven2/org/bouncycastle/org/gluu/gluu-orm-core/4.4.0-SNAPSHOT/maven-metadata.xml
Downloading: https://build.shibboleth.net/nexus/content/repositories/releases/org/gluu/gluu-orm-core/4.4.0-SNAPSHOT/maven-metadata.xml



[WARNING] Could not transfer metadata org.gluu:gluu-orm-core:4.4.0-SNAPSHOT/maven-metadata.xml from/to bouncycastle (https://repo2.maven.org/maven2/org/bouncycastle): repo2.maven.org
[WARNING] Failure to transfer org.gluu:gluu-orm-core:4.4.0-SNAPSHOT/maven-metadata.xml from https://repo2.maven.org/maven2/org/bouncycastle was cached in the local repository, resolution will not be reattempted until the update interval of bouncycastle has elapsed or updates are forced. Original error: Could not transfer metadata org.gluu:gluu-orm-core:4.4.0-SNAPSHOT/maven-metadata.xml from/to bouncycastle (https://repo2.maven.org/maven2/org/bouncycastle): repo2.maven.org
Downloading: https://repository.jboss.org/nexus/content/groups/public-jboss/org/gluu/gluu-orm-filter/4.4.0-SNAPSHOT/maven-metadata.xml
Downloading: https://repo2.maven.org/maven2/org/bouncycastle/org/gluu/gluu-orm-filter/4.4.0-SNAPSHOT/maven-metadata.xml
Downloading: https://build.shibboleth.net/nexus/content/repositories/releases/org/gluu/gluu-orm-filter/4.4.0-SNAPSHOT/maven-metadata.xml



[WARNING] Could not transfer metadata org.gluu:gluu-orm-filter:4.4.0-SNAPSHOT/maven-metadata.xml from/to bouncycastle (https://repo2.maven.org/maven2/org/bouncycastle): repo2.maven.org
[WARNING] Failure to transfer org.gluu:gluu-orm-filter:4.4.0-SNAPSHOT/maven-metadata.xml from https://repo2.maven.org/maven2/org/bouncycastle was cached in the local repository, resolution will not be reattempted until the update interval of bouncycastle has elapsed or updates are forced. Original error: Could not transfer metadata org.gluu:gluu-orm-filter:4.4.0-SNAPSHOT/maven-metadata.xml from/to bouncycastle (https://repo2.maven.org/maven2/org/bouncycastle): repo2.maven.org
Downloading: https://maven.gluu.org/maven/org/gluu/oxcore-service/4.4.0-SNAPSHOT/maven-metadata.xml
Downloading: https://repository.jboss.org/nexus/content/groups/public-jboss/org/gluu/oxcore-service/4.4.0-SNAPSHOT/maven-metadata.xml
Downloading: https://repo1.maven.org/maven2/org/gluu/oxcore-service/4.4.0-SNAPSHOT/maven-metadata.xml
Downloading: https://build.shibboleth.net/nexus/content/repositories/releases/org/gluu/oxcore-service/4.4.0-SNAPSHOT/maven-metadata.xml




Downloading: https://repository.jboss.org/nexus/content/groups/public-jboss/org/gluu/gluu-orm-couchbase/4.4.0-SNAPSHOT/maven-metadata.xml
Downloading: https://repo1.maven.org/maven2/org/gluu/gluu-orm-couchbase/4.4.0-SNAPSHOT/maven-metadata.xml
Downloading: https://build.shibboleth.net/nexus/content/repositories/releases/org/gluu/gluu-orm-couchbase/4.4.0-SNAPSHOT/maven-metadata.xml
Downloading: https://maven.gluu.org/maven/org/gluu/gluu-orm-couchbase/4.4.0-SNAPSHOT/maven-metadata.xml


Downloading: https://repo2.maven.org/maven2/org/bouncycastle/org/gluu/gluu-orm-couchbase/4.4.0-SNAPSHOT/maven-metadata.xml



[WARNING] Could not transfer metadata org.gluu:gluu-orm-couchbase:4.4.0-SNAPSHOT/maven-metadata.xml from/to bouncycastle (https://repo2.maven.org/maven2/org/bouncycastle): repo2.maven.org
[WARNING] Failure to transfer org.gluu:gluu-orm-couchbase:4.4.0-SNAPSHOT/maven-metadata.xml from https://repo2.maven.org/maven2/org/bouncycastle was cached in the local repository, resolution will not be reattempted until the update interval of bouncycastle has elapsed or updates are forced. Original error: Could not transfer metadata org.gluu:gluu-orm-couchbase:4.4.0-SNAPSHOT/maven-metadata.xml from/to bouncycastle (https://repo2.maven.org/maven2/org/bouncycastle): repo2.maven.org
Downloading: https://repository.jboss.org/nexus/content/groups/public-jboss/org/gluu/gluu-orm-spanner/4.4.0-SNAPSHOT/maven-metadata.xml
Downloading: https://build.shibboleth.net/nexus/content/repositories/releases/org/gluu/gluu-orm-spanner/4.4.0-SNAPSHOT/maven-metadata.xml
Downloading: https://repo1.maven.org/maven2/org/gluu/gluu-orm-spanner/4.4.0-SNAPSHOT/maven-metadata.xml
Downloading: https://maven.gluu.org/maven/org/gluu/gluu-orm-spanner/4.4.0-SNAPSHOT/maven-metadata.xml


Downloading: https://repo2.maven.org/maven2/org/bouncycastle/org/gluu/gluu-orm-spanner/4.4.0-SNAPSHOT/maven-metadata.xml



[WARNING] Could not transfer metadata org.gluu:gluu-orm-spanner:4.4.0-SNAPSHOT/maven-metadata.xml from/to bouncycastle (https://repo2.maven.org/maven2/org/bouncycastle): repo2.maven.org
[WARNING] Failure to transfer org.gluu:gluu-orm-spanner:4.4.0-SNAPSHOT/maven-metadata.xml from https://repo2.maven.org/maven2/org/bouncycastle was cached in the local repository, resolution will not be reattempted until the update interval of bouncycastle has elapsed or updates are forced. Original error: Could not transfer metadata org.gluu:gluu-orm-spanner:4.4.0-SNAPSHOT/maven-metadata.xml from/to bouncycastle (https://repo2.maven.org/maven2/org/bouncycastle): repo2.maven.org
Downloading: https://repository.jboss.org/nexus/content/groups/public-jboss/com/google/cloud/google-cloud-spanner/6.17.3/google-cloud-spanner-6.17.3.pom

Downloading: https://maven.gluu.org/maven/com/google/cloud/google-cloud-spanner/6.17.3/google-cloud-spanner-6.17.3.pom
4/47 KB   
8/47 KB   
12/47 KB   
16/47 KB   
20/47 KB   
24/47 KB   
28/47 KB   
32/47 KB   
36/47 KB   
40/47 KB   
44/47 KB   
47/47 KB   
           
Downloaded: https://maven.gluu.org/maven/com/google/cloud/google-cloud-spanner/6.17.3/google-cloud-spanner-6.17.3.pom (47 KB at 1211.6 KB/sec)
Downloading: https://repository.jboss.org/nexus/content/groups/public-jboss/io/opencensus/opencensus-api/0.30.0/opencensus-api-0.30.0.pom
           
Downloading: https://maven.gluu.org/maven/io/opencensus/opencensus-api/0.30.0/opencensus-api-0.30.0.pom
3/3 KB     
         
Downloaded: https://maven.gluu.org/maven/io/opencensus/opencensus-api/0.30.0/opencensus-api-0.30.0.pom (3 KB at 198.6 KB/sec)
Downloading: https://repository.jboss.org/nexus/content/groups/public-jboss/io/opencensus/opencensus-contrib-grpc-util/0.30.0/opencensus-contrib-grpc-util-0.30.0.pom
         
Downloading: https://maven.gluu.org/maven/io/opencensus/opencensus-contrib-grpc-util/0.30.0/opencensus-contrib-grpc-util-0.30.0.pom
3/3 KB   
         
Downloaded: https://maven.gluu.org/maven/io/opencensus/opencensus-contrib-grpc-util/0.30.0/opencensus-contrib-grpc-util-0.30.0.pom (3 KB at 256.6 KB/sec)
Downloading: https://repository.jboss.org/nexus/content/groups/public-jboss/com/google/api/grpc/proto-google-cloud-spanner-admin-instance-v1/6.17.3/proto-google-cloud-spanner-admin-instance-v1-6.17.3.pom
         
Downloading: https://maven.gluu.org/maven/com/google/api/grpc/proto-google-cloud-spanner-admin-instance-v1/6.17.3/proto-google-cloud-spanner-admin-instance-v1-6.17.3.pom
4/7 KB   
7/7 KB   
         
Downloaded: https://maven.gluu.org/maven/com/google/api/grpc/proto-google-cloud-spanner-admin-instance-v1/6.17.3/proto-google-cloud-spanner-admin-instance-v1-6.17.3.pom (7 KB at 579.3 KB/sec)
Downloading: https://repository.jboss.org/nexus/content/groups/public-jboss/com/google/api/grpc/proto-google-cloud-spanner-v1/6.17.3/proto-google-cloud-spanner-v1-6.17.3.pom
         
Downloading: https://maven.gluu.org/maven/com/google/api/grpc/proto-google-cloud-spanner-v1/6.17.3/proto-google-cloud-spanner-v1-6.17.3.pom
4/7 KB   
7/7 KB   
         
Downloaded: https://maven.gluu.org/maven/com/google/api/grpc/proto-google-cloud-spanner-v1/6.17.3/proto-google-cloud-spanner-v1-6.17.3.pom (7 KB at 485.2 KB/sec)
Downloading: https://repository.jboss.org/nexus/content/groups/public-jboss/com/google/api/grpc/proto-google-cloud-spanner-admin-database-v1/6.17.3/proto-google-cloud-spanner-admin-database-v1-6.17.3.pom
         
Downloading: https://maven.gluu.org/maven/com/google/api/grpc/proto-google-cloud-spanner-admin-database-v1/6.17.3/proto-google-cloud-spanner-admin-database-v1-6.17.3.pom
4/7 KB   
7/7 KB   
         
Downloaded: https://maven.gluu.org/maven/com/google/api/grpc/proto-google-cloud-spanner-admin-database-v1/6.17.3/proto-google-cloud-spanner-admin-database-v1-6.17.3.pom (7 KB at 579.3 KB/sec)
Downloading: https://repository.jboss.org/nexus/content/groups/public-jboss/com/google/api/grpc/grpc-google-cloud-spanner-admin-instance-v1/6.17.3/grpc-google-cloud-spanner-admin-instance-v1-6.17.3.pom
         
Downloading: https://maven.gluu.org/maven/com/google/api/grpc/grpc-google-cloud-spanner-admin-instance-v1/6.17.3/grpc-google-cloud-spanner-admin-instance-v1-6.17.3.pom
4/12 KB   
8/12 KB   
12/12 KB   
           
Downloaded: https://maven.gluu.org/maven/com/google/api/grpc/grpc-google-cloud-spanner-admin-instance-v1/6.17.3/grpc-google-cloud-spanner-admin-instance-v1-6.17.3.pom (12 KB at 901.1 KB/sec)
Downloading: https://repository.jboss.org/nexus/content/groups/public-jboss/com/google/api/grpc/grpc-google-cloud-spanner-v1/6.17.3/grpc-google-cloud-spanner-v1-6.17.3.pom
           
Downloading: https://maven.gluu.org/maven/com/google/api/grpc/grpc-google-cloud-spanner-v1/6.17.3/grpc-google-cloud-spanner-v1-6.17.3.pom
4/11 KB    
8/11 KB   
11/11 KB   
           
Downloaded: https://maven.gluu.org/maven/com/google/api/grpc/grpc-google-cloud-spanner-v1/6.17.3/grpc-google-cloud-spanner-v1-6.17.3.pom (11 KB at 1091.5 KB/sec)
Downloading: https://repository.jboss.org/nexus/content/groups/public-jboss/com/google/api/grpc/grpc-google-cloud-spanner-admin-database-v1/6.17.3/grpc-google-cloud-spanner-admin-database-v1-6.17.3.pom
           
Downloading: https://maven.gluu.org/maven/com/google/api/grpc/grpc-google-cloud-spanner-admin-database-v1/6.17.3/grpc-google-cloud-spanner-admin-database-v1-6.17.3.pom
4/12 KB    
8/12 KB   
12/12 KB   
           
Downloaded: https://maven.gluu.org/maven/com/google/api/grpc/grpc-google-cloud-spanner-admin-database-v1/6.17.3/grpc-google-cloud-spanner-admin-database-v1-6.17.3.pom (12 KB at 976.2 KB/sec)
Downloading: https://repository.jboss.org/nexus/content/groups/public-jboss/org/gluu/gluu-orm-sql/4.4.0-SNAPSHOT/maven-metadata.xml
Downloading: https://maven.gluu.org/maven/org/gluu/gluu-orm-sql/4.4.0-SNAPSHOT/maven-metadata.xml
Downloading: https://build.shibboleth.net/nexus/content/repositories/releases/org/gluu/gluu-orm-sql/4.4.0-SNAPSHOT/maven-metadata.xml
Downloading: https://repo1.maven.org/maven2/org/gluu/gluu-orm-sql/4.4.0-SNAPSHOT/maven-metadata.xml
           
Downloading: https://repo2.maven.org/maven2/org/bouncycastle/org/gluu/gluu-orm-sql/4.4.0-SNAPSHOT/maven-metadata.xml
           
           
           
           
[WARNING] Could not transfer metadata org.gluu:gluu-orm-sql:4.4.0-SNAPSHOT/maven-metadata.xml from/to bouncycastle (https://repo2.maven.org/maven2/org/bouncycastle): repo2.maven.org
[WARNING] Failure to transfer org.gluu:gluu-orm-sql:4.4.0-SNAPSHOT/maven-metadata.xml from https://repo2.maven.org/maven2/org/bouncycastle was cached in the local repository, resolution will not be reattempted until the update interval of bouncycastle has elapsed or updates are forced. Original error: Could not transfer metadata org.gluu:gluu-orm-sql:4.4.0-SNAPSHOT/maven-metadata.xml from/to bouncycastle (https://repo2.maven.org/maven2/org/bouncycastle): repo2.maven.org
Downloading: https://repository.jboss.org/nexus/content/groups/public-jboss/org/gluu/gluu-orm-hybrid/4.4.0-SNAPSHOT/maven-metadata.xml
Downloading: https://build.shibboleth.net/nexus/content/repositories/releases/org/gluu/gluu-orm-hybrid/4.4.0-SNAPSHOT/maven-metadata.xml
Downloading: https://repo1.maven.org/maven2/org/gluu/gluu-orm-hybrid/4.4.0-SNAPSHOT/maven-metadata.xml
Downloading: https://maven.gluu.org/maven/org/gluu/gluu-orm-hybrid/4.4.0-SNAPSHOT/maven-metadata.xml
           
           
Downloading: https://repo2.maven.org/maven2/org/bouncycastle/org/gluu/gluu-orm-hybrid/4.4.0-SNAPSHOT/maven-metadata.xml
           
           
           
[WARNING] Could not transfer metadata org.gluu:gluu-orm-hybrid:4.4.0-SNAPSHOT/maven-metadata.xml from/to bouncycastle (https://repo2.maven.org/maven2/org/bouncycastle): repo2.maven.org
[WARNING] Failure to transfer org.gluu:gluu-orm-hybrid:4.4.0-SNAPSHOT/maven-metadata.xml from https://repo2.maven.org/maven2/org/bouncycastle was cached in the local repository, resolution will not be reattempted until the update interval of bouncycastle has elapsed or updates are forced. Original error: Could not transfer metadata org.gluu:gluu-orm-hybrid:4.4.0-SNAPSHOT/maven-metadata.xml from/to bouncycastle (https://repo2.maven.org/maven2/org/bouncycastle): repo2.maven.org
Downloading: https://repository.jboss.org/nexus/content/groups/public-jboss/org/gluu/gluu-orm-cdi/4.4.0-SNAPSHOT/maven-metadata.xml
Downloading: https://build.shibboleth.net/nexus/content/repositories/releases/org/gluu/gluu-orm-cdi/4.4.0-SNAPSHOT/maven-metadata.xml
Downloading: https://maven.gluu.org/maven/org/gluu/gluu-orm-cdi/4.4.0-SNAPSHOT/maven-metadata.xml
Downloading: https://repo1.maven.org/maven2/org/gluu/gluu-orm-cdi/4.4.0-SNAPSHOT/maven-metadata.xml
           
Downloading: https://repo2.maven.org/maven2/org/bouncycastle/org/gluu/gluu-orm-cdi/4.4.0-SNAPSHOT/maven-metadata.xml
           
           
           
           
[WARNING] Could not transfer metadata org.gluu:gluu-orm-cdi:4.4.0-SNAPSHOT/maven-metadata.xml from/to bouncycastle (https://repo2.maven.org/maven2/org/bouncycastle): repo2.maven.org
[WARNING] Failure to transfer org.gluu:gluu-orm-cdi:4.4.0-SNAPSHOT/maven-metadata.xml from https://repo2.maven.org/maven2/org/bouncycastle was cached in the local repository, resolution will not be reattempted until the update interval of bouncycastle has elapsed or updates are forced. Original error: Could not transfer metadata org.gluu:gluu-orm-cdi:4.4.0-SNAPSHOT/maven-metadata.xml from/to bouncycastle (https://repo2.maven.org/maven2/org/bouncycastle): repo2.maven.org
Downloading: https://maven.gluu.org/maven/org/gluu/oxcore-cache/4.4.0-SNAPSHOT/maven-metadata.xml
Downloading: https://repo1.maven.org/maven2/org/gluu/oxcore-cache/4.4.0-SNAPSHOT/maven-metadata.xml
Downloading: https://build.shibboleth.net/nexus/content/repositories/releases/org/gluu/oxcore-cache/4.4.0-SNAPSHOT/maven-metadata.xml
Downloading: https://repository.jboss.org/nexus/content/groups/public-jboss/org/gluu/oxcore-cache/4.4.0-SNAPSHOT/maven-metadata.xml
           
Downloading: https://repo2.maven.org/maven2/org/bouncycastle/org/gluu/oxcore-cache/4.4.0-SNAPSHOT/maven-metadata.xml
           
           
           
           
[WARNING] Could not transfer metadata org.gluu:oxcore-cache:4.4.0-SNAPSHOT/maven-metadata.xml from/to bouncycastle (https://repo2.maven.org/maven2/org/bouncycastle): repo2.maven.org
[WARNING] Failure to transfer org.gluu:oxcore-cache:4.4.0-SNAPSHOT/maven-metadata.xml from https://repo2.maven.org/maven2/org/bouncycastle was cached in the local repository, resolution will not be reattempted until the update interval of bouncycastle has elapsed or updates are forced. Original error: Could not transfer metadata org.gluu:oxcore-cache:4.4.0-SNAPSHOT/maven-metadata.xml from/to bouncycastle (https://repo2.maven.org/maven2/org/bouncycastle): repo2.maven.org
Downloading: https://repository.jboss.org/nexus/content/groups/public-jboss/redis/clients/jedis/3.7.0/jedis-3.7.0.pom
           
Downloading: https://maven.gluu.org/maven/redis/clients/jedis/3.7.0/jedis-3.7.0.pom
4/7 KB     
7/7 KB   
         
Downloaded: https://maven.gluu.org/maven/redis/clients/jedis/3.7.0/jedis-3.7.0.pom (7 KB at 353.5 KB/sec)
Downloading: https://repository.jboss.org/nexus/content/groups/public-jboss/org/gluu/oxcore-script/4.4.0-SNAPSHOT/maven-metadata.xml
Downloading: https://maven.gluu.org/maven/org/gluu/oxcore-script/4.4.0-SNAPSHOT/maven-metadata.xml
Downloading: https://repo1.maven.org/maven2/org/gluu/oxcore-script/4.4.0-SNAPSHOT/maven-metadata.xml
Downloading: https://build.shibboleth.net/nexus/content/repositories/releases/org/gluu/oxcore-script/4.4.0-SNAPSHOT/maven-metadata.xml
         
Downloading: https://repo2.maven.org/maven2/org/bouncycastle/org/gluu/oxcore-script/4.4.0-SNAPSHOT/maven-metadata.xml
         
         
         
         
[WARNING] Could not transfer metadata org.gluu:oxcore-script:4.4.0-SNAPSHOT/maven-metadata.xml from/to bouncycastle (https://repo2.maven.org/maven2/org/bouncycastle): repo2.maven.org
[WARNING] Failure to transfer org.gluu:oxcore-script:4.4.0-SNAPSHOT/maven-metadata.xml from https://repo2.maven.org/maven2/org/bouncycastle was cached in the local repository, resolution will not be reattempted until the update interval of bouncycastle has elapsed or updates are forced. Original error: Could not transfer metadata org.gluu:oxcore-script:4.4.0-SNAPSHOT/maven-metadata.xml from/to bouncycastle (https://repo2.maven.org/maven2/org/bouncycastle): repo2.maven.org
Downloading: https://repository.jboss.org/nexus/content/groups/public-jboss/org/gluu/oxcore-cdi/4.4.0-SNAPSHOT/maven-metadata.xml
Downloading: https://repo1.maven.org/maven2/org/gluu/oxcore-cdi/4.4.0-SNAPSHOT/maven-metadata.xml
Downloading: https://build.shibboleth.net/nexus/content/repositories/releases/org/gluu/oxcore-cdi/4.4.0-SNAPSHOT/maven-metadata.xml
Downloading: https://maven.gluu.org/maven/org/gluu/oxcore-cdi/4.4.0-SNAPSHOT/maven-metadata.xml
         
Downloading: https://repo2.maven.org/maven2/org/bouncycastle/org/gluu/oxcore-cdi/4.4.0-SNAPSHOT/maven-metadata.xml
         
         
         
         
[WARNING] Could not transfer metadata org.gluu:oxcore-cdi:4.4.0-SNAPSHOT/maven-metadata.xml from/to bouncycastle (https://repo2.maven.org/maven2/org/bouncycastle): repo2.maven.org
[WARNING] Failure to transfer org.gluu:oxcore-cdi:4.4.0-SNAPSHOT/maven-metadata.xml from https://repo2.maven.org/maven2/org/bouncycastle was cached in the local repository, resolution will not be reattempted until the update interval of bouncycastle has elapsed or updates are forced. Original error: Could not transfer metadata org.gluu:oxcore-cdi:4.4.0-SNAPSHOT/maven-metadata.xml from/to bouncycastle (https://repo2.maven.org/maven2/org/bouncycastle): repo2.maven.org
Downloading: https://repo1.maven.org/maven2/org/gluu/oxcore-server/4.4.0-SNAPSHOT/maven-metadata.xml
Downloading: https://build.shibboleth.net/nexus/content/repositories/releases/org/gluu/oxcore-server/4.4.0-SNAPSHOT/maven-metadata.xml
Downloading: https://maven.gluu.org/maven/org/gluu/oxcore-server/4.4.0-SNAPSHOT/maven-metadata.xml
Downloading: https://repository.jboss.org/nexus/content/groups/public-jboss/org/gluu/oxcore-server/4.4.0-SNAPSHOT/maven-metadata.xml
         
         
         
         
Downloading: https://maven.gluu.org/maven/org/gluu/oxcore-saml/4.4.0-SNAPSHOT/maven-metadata.xml
Downloading: https://build.shibboleth.net/nexus/content/repositories/releases/org/gluu/oxcore-saml/4.4.0-SNAPSHOT/maven-metadata.xml
Downloading: https://repo1.maven.org/maven2/org/gluu/oxcore-saml/4.4.0-SNAPSHOT/maven-metadata.xml
Downloading: https://repository.jboss.org/nexus/content/groups/public-jboss/org/gluu/oxcore-saml/4.4.0-SNAPSHOT/maven-metadata.xml
         
         
         
         
Downloading: https://repository.jboss.org/nexus/content/groups/public-jboss/org/gluu/oxcore-document-store/4.4.0-SNAPSHOT/maven-metadata.xml
Downloading: https://repo1.maven.org/maven2/org/gluu/oxcore-document-store/4.4.0-SNAPSHOT/maven-metadata.xml
Downloading: https://build.shibboleth.net/nexus/content/repositories/releases/org/gluu/oxcore-document-store/4.4.0-SNAPSHOT/maven-metadata.xml
Downloading: https://maven.gluu.org/maven/org/gluu/oxcore-document-store/4.4.0-SNAPSHOT/maven-metadata.xml
         
         
Downloading: https://repo2.maven.org/maven2/org/bouncycastle/org/gluu/oxcore-document-store/4.4.0-SNAPSHOT/maven-metadata.xml
         
         
         
[WARNING] Could not transfer metadata org.gluu:oxcore-document-store:4.4.0-SNAPSHOT/maven-metadata.xml from/to bouncycastle (https://repo2.maven.org/maven2/org/bouncycastle): repo2.maven.org
[WARNING] Failure to transfer org.gluu:oxcore-document-store:4.4.0-SNAPSHOT/maven-metadata.xml from https://repo2.maven.org/maven2/org/bouncycastle was cached in the local repository, resolution will not be reattempted until the update interval of bouncycastle has elapsed or updates are forced. Original error: Could not transfer metadata org.gluu:oxcore-document-store:4.4.0-SNAPSHOT/maven-metadata.xml from/to bouncycastle (https://repo2.maven.org/maven2/org/bouncycastle): repo2.maven.org
Downloading: https://repository.jboss.org/nexus/content/groups/public-jboss/org/gluu/oxauth-model/4.4.0-SNAPSHOT/maven-metadata.xml
Downloading: https://build.shibboleth.net/nexus/content/repositories/releases/org/gluu/oxauth-model/4.4.0-SNAPSHOT/maven-metadata.xml
Downloading: https://maven.gluu.org/maven/org/gluu/oxauth-model/4.4.0-SNAPSHOT/maven-metadata.xml
Downloading: https://repo1.maven.org/maven2/org/gluu/oxauth-model/4.4.0-SNAPSHOT/maven-metadata.xml
         
         
         
         
Downloading: https://repository.jboss.org/nexus/content/groups/public-jboss/org/gluu/oxauth/4.4.0-SNAPSHOT/maven-metadata.xml
Downloading: https://maven.gluu.org/maven/org/gluu/oxauth/4.4.0-SNAPSHOT/maven-metadata.xml
Downloading: https://build.shibboleth.net/nexus/content/repositories/releases/org/gluu/oxauth/4.4.0-SNAPSHOT/maven-metadata.xml
Downloading: https://repo1.maven.org/maven2/org/gluu/oxauth/4.4.0-SNAPSHOT/maven-metadata.xml
         
         
         
         
Downloading: https://repo1.maven.org/maven2/org/gluu/oxeleven-client/4.4.0-SNAPSHOT/maven-metadata.xml
Downloading: https://maven.gluu.org/maven/org/gluu/oxeleven-client/4.4.0-SNAPSHOT/maven-metadata.xml
Downloading: https://repository.jboss.org/nexus/content/groups/public-jboss/org/gluu/oxeleven-client/4.4.0-SNAPSHOT/maven-metadata.xml
Downloading: https://build.shibboleth.net/nexus/content/repositories/releases/org/gluu/oxeleven-client/4.4.0-SNAPSHOT/maven-metadata.xml
         
Downloading: https://repo2.maven.org/maven2/org/bouncycastle/org/gluu/oxeleven-client/4.4.0-SNAPSHOT/maven-metadata.xml
         
         
         
         
[WARNING] Could not transfer metadata org.gluu:oxeleven-client:4.4.0-SNAPSHOT/maven-metadata.xml from/to bouncycastle (https://repo2.maven.org/maven2/org/bouncycastle): repo2.maven.org
[WARNING] Failure to transfer org.gluu:oxeleven-client:4.4.0-SNAPSHOT/maven-metadata.xml from https://repo2.maven.org/maven2/org/bouncycastle was cached in the local repository, resolution will not be reattempted until the update interval of bouncycastle has elapsed or updates are forced. Original error: Could not transfer metadata org.gluu:oxeleven-client:4.4.0-SNAPSHOT/maven-metadata.xml from/to bouncycastle (https://repo2.maven.org/maven2/org/bouncycastle): repo2.maven.org
Downloading: https://repository.jboss.org/nexus/content/groups/public-jboss/org/gluu/oxeleven/4.4.0-SNAPSHOT/maven-metadata.xml
Downloading: https://maven.gluu.org/maven/org/gluu/oxeleven/4.4.0-SNAPSHOT/maven-metadata.xml
Downloading: https://repo1.maven.org/maven2/org/gluu/oxeleven/4.4.0-SNAPSHOT/maven-metadata.xml
Downloading: https://build.shibboleth.net/nexus/content/repositories/releases/org/gluu/oxeleven/4.4.0-SNAPSHOT/maven-metadata.xml
         
         
Downloading: https://repo2.maven.org/maven2/org/bouncycastle/org/gluu/oxeleven/4.4.0-SNAPSHOT/maven-metadata.xml
         
         
         
[WARNING] Could not transfer metadata org.gluu:oxeleven:4.4.0-SNAPSHOT/maven-metadata.xml from/to bouncycastle (https://repo2.maven.org/maven2/org/bouncycastle): repo2.maven.org
Downloading: https://repository.jboss.org/nexus/content/groups/public-jboss/org/gluu/oxeleven-model/4.4.0-SNAPSHOT/maven-metadata.xml
Downloading: https://maven.gluu.org/maven/org/gluu/oxeleven-model/4.4.0-SNAPSHOT/maven-metadata.xml
Downloading: https://build.shibboleth.net/nexus/content/repositories/releases/org/gluu/oxeleven-model/4.4.0-SNAPSHOT/maven-metadata.xml
Downloading: https://repo1.maven.org/maven2/org/gluu/oxeleven-model/4.4.0-SNAPSHOT/maven-metadata.xml
         
Downloading: https://repo2.maven.org/maven2/org/bouncycastle/org/gluu/oxeleven-model/4.4.0-SNAPSHOT/maven-metadata.xml
         
         
         
         
[WARNING] Could not transfer metadata org.gluu:oxeleven-model:4.4.0-SNAPSHOT/maven-metadata.xml from/to bouncycastle (https://repo2.maven.org/maven2/org/bouncycastle): repo2.maven.org
[WARNING] Failure to transfer org.gluu:oxeleven-model:4.4.0-SNAPSHOT/maven-metadata.xml from https://repo2.maven.org/maven2/org/bouncycastle was cached in the local repository, resolution will not be reattempted until the update interval of bouncycastle has elapsed or updates are forced. Original error: Could not transfer metadata org.gluu:oxeleven-model:4.4.0-SNAPSHOT/maven-metadata.xml from/to bouncycastle (https://repo2.maven.org/maven2/org/bouncycastle): repo2.maven.org
Downloading: https://repository.jboss.org/nexus/content/groups/public-jboss/org/gluu/oxauth-persistence-model/4.4.0-SNAPSHOT/maven-metadata.xml
Downloading: https://maven.gluu.org/maven/org/gluu/oxauth-persistence-model/4.4.0-SNAPSHOT/maven-metadata.xml
Downloading: https://build.shibboleth.net/nexus/content/repositories/releases/org/gluu/oxauth-persistence-model/4.4.0-SNAPSHOT/maven-metadata.xml
Downloading: https://repo1.maven.org/maven2/org/gluu/oxauth-persistence-model/4.4.0-SNAPSHOT/maven-metadata.xml
         
         
         
         
Downloading: https://repository.jboss.org/nexus/content/groups/public-jboss/com/google/cloud/google-cloud-spanner/6.17.3/google-cloud-spanner-6.17.3.jar
Downloading: https://repository.jboss.org/nexus/content/groups/public-jboss/io/opencensus/opencensus-api/0.30.0/opencensus-api-0.30.0.jar
Downloading: https://repository.jboss.org/nexus/content/groups/public-jboss/io/opencensus/opencensus-contrib-grpc-util/0.30.0/opencensus-contrib-grpc-util-0.30.0.jar
Downloading: https://repository.jboss.org/nexus/content/groups/public-jboss/com/google/api/grpc/proto-google-cloud-spanner-admin-instance-v1/6.17.3/proto-google-cloud-spanner-admin-instance-v1-6.17.3.jar
Downloading: https://repository.jboss.org/nexus/content/groups/public-jboss/com/google/api/grpc/proto-google-cloud-spanner-v1/6.17.3/proto-google-cloud-spanner-v1-6.17.3.jar
         
Downloading: https://repository.jboss.org/nexus/content/groups/public-jboss/com/google/api/grpc/proto-google-cloud-spanner-admin-database-v1/6.17.3/proto-google-cloud-spanner-admin-database-v1-6.17.3.jar
         
Downloading: https://repository.jboss.org/nexus/content/groups/public-jboss/com/google/api/grpc/grpc-google-cloud-spanner-admin-instance-v1/6.17.3/grpc-google-cloud-spanner-admin-instance-v1-6.17.3.jar
         
Downloading: https://repository.jboss.org/nexus/content/groups/public-jboss/com/google/api/grpc/grpc-google-cloud-spanner-v1/6.17.3/grpc-google-cloud-spanner-v1-6.17.3.jar
         
Downloading: https://repository.jboss.org/nexus/content/groups/public-jboss/com/google/api/grpc/grpc-google-cloud-spanner-admin-database-v1/6.17.3/grpc-google-cloud-spanner-admin-database-v1-6.17.3.jar
         
Downloading: https://repository.jboss.org/nexus/content/groups/public-jboss/redis/clients/jedis/3.7.0/jedis-3.7.0.jar
         
         
         
         
         
Downloading: https://maven.gluu.org/maven/com/google/cloud/google-cloud-spanner/6.17.3/google-cloud-spanner-6.17.3.jar
Downloading: https://maven.gluu.org/maven/io/opencensus/opencensus-api/0.30.0/opencensus-api-0.30.0.jar
Downloading: https://maven.gluu.org/maven/io/opencensus/opencensus-contrib-grpc-util/0.30.0/opencensus-contrib-grpc-util-0.30.0.jar
Downloading: https://maven.gluu.org/maven/com/google/api/grpc/proto-google-cloud-spanner-admin-instance-v1/6.17.3/proto-google-cloud-spanner-admin-instance-v1-6.17.3.jar
Downloading: https://maven.gluu.org/maven/com/google/api/grpc/proto-google-cloud-spanner-v1/6.17.3/proto-google-cloud-spanner-v1-6.17.3.jar
4/198 KB   
4/932 KB   4/198 KB   
8/932 KB   4/198 KB   
8/932 KB   8/198 KB   
12/932 KB   8/198 KB   
12/932 KB   12/198 KB   
16/932 KB   12/198 KB   
4/348 KB   16/932 KB   12/198 KB   
4/348 KB   16/932 KB   16/198 KB   
8/348 KB   16/932 KB   16/198 KB   
12/348 KB   16/932 KB   16/198 KB   
12/348 KB   20/932 KB   16/198 KB   
16/348 KB   24/932 KB   16/198 KB   
16/348 KB   28/932 KB   16/198 KB   
16/348 KB   32/932 KB   16/198 KB   
16/348 KB   32/932 KB   20/198 KB   
16/348 KB   32/932 KB   24/198 KB   
16/348 KB   36/932 KB   24/198 KB   
16/348 KB   36/932 KB   28/198 KB   
16/348 KB   36/932 KB   32/198 KB   
16/348 KB   40/932 KB   32/198 KB   
16/348 KB   44/932 KB   32/198 KB   
16/348 KB   48/932 KB   32/198 KB   
16/348 KB   4/5 KB   48/932 KB   32/198 KB   
16/348 KB   5/5 KB   48/932 KB   32/198 KB   
16/348 KB   5/5 KB   52/932 KB   32/198 KB   
16/348 KB   5/5 KB   56/932 KB   32/198 KB   
16/348 KB   5/5 KB   56/932 KB   36/198 KB   
16/348 KB   5/5 KB   60/932 KB   36/198 KB   
16/348 KB   5/5 KB   64/932 KB   40/198 KB   
16/348 KB   5/5 KB   60/932 KB   40/198 KB   
16/348 KB   5/5 KB   64/932 KB   44/198 KB   
16/348 KB   5/5 KB   64/932 KB   48/198 KB   
16/348 KB   20/932 KB   16/198 KB   
16/348 KB   5/5 KB   68/932 KB   48/198 KB   
16/348 KB   5/5 KB   72/932 KB   48/198 KB   
16/348 KB   5/5 KB   76/932 KB   48/198 KB   
16/348 KB   5/5 KB   76/932 KB   52/198 KB   
16/348 KB   5/5 KB   80/932 KB   52/198 KB   
16/348 KB   5/5 KB   80/932 KB   56/198 KB   
16/348 KB   5/5 KB   80/932 KB   60/198 KB   
16/348 KB   5/5 KB   80/932 KB   64/198 KB   
20/348 KB   5/5 KB   80/932 KB   64/198 KB   
24/348 KB   5/5 KB   80/932 KB   64/198 KB   
24/348 KB   5/5 KB   84/932 KB   64/198 KB   
28/348 KB   5/5 KB   84/932 KB   64/198 KB   
28/348 KB   5/5 KB   88/932 KB   64/198 KB   
32/348 KB   5/5 KB   88/932 KB   64/198 KB   
32/348 KB   5/5 KB   88/932 KB   68/198 KB   
32/348 KB   5/5 KB   92/932 KB   68/198 KB   
32/348 KB   5/5 KB   92/932 KB   72/198 KB   
32/348 KB   5/5 KB   96/932 KB   72/198 KB   
32/348 KB   5/5 KB   96/932 KB   76/198 KB   
32/348 KB   5/5 KB   96/932 KB   80/198 KB   
32/348 KB   5/5 KB   100/932 KB   84/198 KB   
32/348 KB   5/5 KB   100/932 KB   84/198 KB   
36/348 KB   5/5 KB   104/932 KB   84/198 KB   
36/348 KB   5/5 KB   104/932 KB   88/198 KB   
36/348 KB   5/5 KB   108/932 KB   92/198 KB   
36/348 KB   5/5 KB   112/932 KB   92/198 KB   
36/348 KB   5/5 KB   100/932 KB   84/198 KB   
36/348 KB   5/5 KB   108/932 KB   92/198 KB   
40/348 KB   5/5 KB   112/932 KB   92/198 KB   
40/348 KB   5/5 KB   112/932 KB   96/198 KB   
44/348 KB   5/5 KB   112/932 KB   96/198 KB   
44/348 KB   5/5 KB   116/932 KB   96/198 KB   
48/348 KB   5/5 KB   116/932 KB   96/198 KB   
48/348 KB   5/5 KB   120/932 KB   100/198 KB   
48/348 KB   5/5 KB   120/932 KB   96/198 KB   
48/348 KB   5/5 KB   120/932 KB   104/198 KB   
48/348 KB   5/5 KB   120/932 KB   108/198 KB   
48/348 KB   5/5 KB   124/932 KB   108/198 KB   
52/348 KB   5/5 KB   124/932 KB   108/198 KB   
52/348 KB   5/5 KB   128/932 KB   108/198 KB   
52/348 KB   5/5 KB   128/932 KB   112/198 KB   
56/348 KB   5/5 KB   128/932 KB   112/198 KB   
60/348 KB   5/5 KB   128/932 KB   112/198 KB   
64/348 KB   5/5 KB   128/932 KB   112/198 KB   
64/348 KB   5/5 KB   132/932 KB   112/198 KB   
64/348 KB   5/5 KB   4/662 KB   132/932 KB   112/198 KB   
64/348 KB   5/5 KB   4/662 KB   136/932 KB   116/198 KB   
64/348 KB   5/5 KB   4/662 KB   136/932 KB   116/198 KB   
64/348 KB   5/5 KB   8/662 KB   136/932 KB   116/198 KB   
64/348 KB   5/5 KB   8/662 KB   140/932 KB   116/198 KB   
64/348 KB   5/5 KB   8/662 KB   140/932 KB   120/198 KB   
64/348 KB   5/5 KB   12/662 KB   140/932 KB   120/198 KB   
64/348 KB   5/5 KB   12/662 KB   144/932 KB   120/198 KB   
64/348 KB   5/5 KB   12/662 KB   144/932 KB   124/198 KB   
64/348 KB   5/5 KB   16/662 KB   144/932 KB   124/198 KB   
64/348 KB   5/5 KB   16/662 KB   144/932 KB   128/198 KB   
68/348 KB   5/5 KB   16/662 KB   144/932 KB   128/198 KB   
72/348 KB   5/5 KB   16/662 KB   144/932 KB   128/198 KB   
76/348 KB   5/5 KB   16/662 KB   144/932 KB   128/198 KB   
80/348 KB   5/5 KB   16/662 KB   144/932 KB   128/198 KB   
80/348 KB   5/5 KB   20/662 KB   144/932 KB   128/198 KB   
80/348 KB   5/5 KB   20/662 KB   148/932 KB   128/198 KB   
80/348 KB   5/5 KB   24/662 KB   148/932 KB   128/198 KB   
80/348 KB   5/5 KB   24/662 KB   152/932 KB   128/198 KB   
80/348 KB   5/5 KB   28/662 KB   152/932 KB   128/198 KB   
80/348 KB   5/5 KB   28/662 KB   152/932 KB   132/198 KB   
80/348 KB   5/5 KB   28/662 KB   156/932 KB   132/198 KB   
80/348 KB   5/5 KB   32/662 KB   156/932 KB   132/198 KB   
80/348 KB   5/5 KB   32/662 KB   156/932 KB   136/198 KB   
80/348 KB   5/5 KB   32/662 KB   160/932 KB   136/198 KB   
80/348 KB   5/5 KB   32/662 KB   160/932 KB   140/198 KB   
80/348 KB   5/5 KB   32/662 KB   160/932 KB   144/198 KB   
84/348 KB   5/5 KB   32/662 KB   160/932 KB   144/198 KB   
88/348 KB   5/5 KB   32/662 KB   160/932 KB   144/198 KB   
92/348 KB   5/5 KB   32/662 KB   160/932 KB   144/198 KB   
96/348 KB   5/5 KB   32/662 KB   160/932 KB   144/198 KB   
96/348 KB   5/5 KB   36/662 KB   160/932 KB   144/198 KB   
96/348 KB   5/5 KB   40/662 KB   160/932 KB   144/198 KB   
96/348 KB   5/5 KB   44/662 KB   160/932 KB   144/198 KB   
96/348 KB   5/5 KB   48/662 KB   160/932 KB   144/198 KB   
96/348 KB   5/5 KB   48/662 KB   164/932 KB   144/198 KB   
96/348 KB   5/5 KB   48/662 KB   164/932 KB   148/198 KB   
96/348 KB   5/5 KB   48/662 KB   168/932 KB   148/198 KB   
96/348 KB   5/5 KB   48/662 KB   168/932 KB   152/198 KB   
96/348 KB   5/5 KB   48/662 KB   172/932 KB   152/198 KB   
96/348 KB   5/5 KB   48/662 KB   172/932 KB   156/198 KB   
96/348 KB   5/5 KB   48/662 KB   176/932 KB   156/198 KB   
96/348 KB   5/5 KB   48/662 KB   176/932 KB   160/198 KB   
96/348 KB   5/5 KB   52/662 KB   176/932 KB   160/198 KB   
96/348 KB   5/5 KB   56/662 KB   176/932 KB   160/198 KB   
96/348 KB   5/5 KB   60/662 KB   176/932 KB   160/198 KB   
100/348 KB   5/5 KB   60/662 KB   176/932 KB   160/198 KB   
100/348 KB   5/5 KB   64/662 KB   176/932 KB   160/198 KB   
104/348 KB   5/5 KB   64/662 KB   176/932 KB   160/198 KB   
108/348 KB   5/5 KB   64/662 KB   176/932 KB   160/198 KB   
112/348 KB   5/5 KB   64/662 KB   176/932 KB   160/198 KB   
112/348 KB   5/5 KB   64/662 KB   180/932 KB   160/198 KB   
112/348 KB   5/5 KB   64/662 KB   180/932 KB   164/198 KB   
112/348 KB   5/5 KB   64/662 KB   184/932 KB   164/198 KB   
112/348 KB   5/5 KB   64/662 KB   184/932 KB   168/198 KB   
112/348 KB   5/5 KB   68/662 KB   184/932 KB   168/198 KB   
112/348 KB   5/5 KB   68/662 KB   188/932 KB   168/198 KB   
112/348 KB   5/5 KB   68/662 KB   188/932 KB   172/198 KB   
112/348 KB   5/5 KB   72/662 KB   188/932 KB   172/198 KB   
112/348 KB   5/5 KB   72/662 KB   192/932 KB   172/198 KB   
112/348 KB   5/5 KB   72/662 KB   192/932 KB   176/198 KB   
116/348 KB   5/5 KB   76/662 KB   192/932 KB   176/198 KB   
120/348 KB   5/5 KB   76/662 KB   192/932 KB   176/198 KB   
124/348 KB   5/5 KB   76/662 KB   192/932 KB   176/198 KB   
128/348 KB   5/5 KB   76/662 KB   192/932 KB   176/198 KB   
128/348 KB   5/5 KB   76/662 KB   192/932 KB   180/198 KB   
128/348 KB   5/5 KB   76/662 KB   192/932 KB   184/198 KB   
128/348 KB   5/5 KB   76/662 KB   196/932 KB   184/198 KB   
128/348 KB   5/5 KB   76/662 KB   196/932 KB   188/198 KB   
128/348 KB   76/662 KB   196/932 KB   192/198 KB            
                                                            
Downloaded: https://maven.gluu.org/maven/io/opencensus/opencensus-contrib-grpc-util/0.30.0/opencensus-contrib-grpc-util-0.30.0.jar (5 KB at 109.7 KB/sec)
128/348 KB   76/662 KB   200/932 KB   196/198 KB   
Downloading: https://maven.gluu.org/maven/com/google/api/grpc/proto-google-cloud-spanner-admin-database-v1/6.17.3/proto-google-cloud-spanner-admin-database-v1-6.17.3.jar
112/348 KB   5/5 KB   76/662 KB   192/932 KB   176/198 KB   
128/348 KB   76/662 KB   200/932 KB   198/198 KB   
128/348 KB   80/662 KB   200/932 KB   198/198 KB   
132/348 KB   80/662 KB   200/932 KB   198/198 KB   
136/348 KB   80/662 KB   200/932 KB   198/198 KB   
140/348 KB   80/662 KB   200/932 KB   198/198 KB   
128/348 KB   76/662 KB   200/932 KB   192/198 KB   
144/348 KB   80/662 KB   200/932 KB   198/198 KB   
144/348 KB   80/662 KB   204/932 KB   198/198 KB   
144/348 KB   84/662 KB   204/932 KB   198/198 KB   
144/348 KB   84/662 KB   208/932 KB   198/198 KB   
144/348 KB   88/662 KB   208/932 KB   198/198 KB   
144/348 KB   92/662 KB   208/932 KB   198/198 KB   
144/348 KB   96/662 KB   208/932 KB   198/198 KB   
144/348 KB   96/662 KB   212/932 KB   198/198 KB   
144/348 KB   96/662 KB   216/932 KB   198/198 KB   
144/348 KB   96/662 KB   220/932 KB   198/198 KB   
144/348 KB   96/662 KB   224/932 KB   198/198 KB   
148/348 KB   96/662 KB   224/932 KB   198/198 KB   
148/348 KB   100/662 KB   224/932 KB   198/198 KB   
152/348 KB   100/662 KB   224/932 KB   198/198 KB   
152/348 KB   104/662 KB   224/932 KB   198/198 KB   
152/348 KB   108/662 KB   224/932 KB   198/198 KB   
156/348 KB   108/662 KB   224/932 KB   198/198 KB   
156/348 KB   112/662 KB   224/932 KB   198/198 KB   
160/348 KB   112/662 KB   224/932 KB   198/198 KB   
160/348 KB   112/662 KB   228/932 KB   198/198 KB   
160/348 KB   112/662 KB   232/932 KB   198/198 KB   
160/348 KB   112/662 KB   236/932 KB   198/198 KB   
160/348 KB   112/662 KB   240/932 KB   198/198 KB   
160/348 KB   116/662 KB   240/932 KB   198/198 KB   
160/348 KB   120/662 KB   240/932 KB   198/198 KB   
160/348 KB   120/662 KB   244/932 KB   198/198 KB   
160/348 KB   124/662 KB   244/932 KB   198/198 KB   
164/348 KB   124/662 KB   244/932 KB   198/198 KB   
164/348 KB   124/662 KB   248/932 KB   198/198 KB   
164/348 KB   128/662 KB   248/932 KB   198/198 KB   
168/348 KB   128/662 KB   248/932 KB   198/198 KB   
168/348 KB   128/662 KB   252/932 KB   198/198 KB   
168/348 KB   128/662 KB   256/932 KB   198/198 KB   
172/348 KB   128/662 KB   256/932 KB   198/198 KB   
176/348 KB   128/662 KB   256/932 KB   198/198 KB   
                                                    
176/348 KB   128/662 KB   260/932 KB                
176/348 KB   128/662 KB   264/932 KB   
Downloaded: https://maven.gluu.org/maven/com/google/api/grpc/proto-google-cloud-spanner-admin-instance-v1/6.17.3/proto-google-cloud-spanner-admin-instance-v1-6.17.3.jar (198 KB at 4701.3 KB/sec)
176/348 KB   128/662 KB   268/932 KB   
176/348 KB   128/662 KB   272/932 KB   
Downloading: https://maven.gluu.org/maven/com/google/api/grpc/grpc-google-cloud-spanner-admin-instance-v1/6.17.3/grpc-google-cloud-spanner-admin-instance-v1-6.17.3.jar
176/348 KB   132/662 KB   272/932 KB   
176/348 KB   136/662 KB   272/932 KB   
176/348 KB   140/662 KB   272/932 KB   
176/348 KB   144/662 KB   272/932 KB   
180/348 KB   144/662 KB   272/932 KB   
184/348 KB   144/662 KB   272/932 KB   
184/348 KB   144/662 KB   276/932 KB   
188/348 KB   144/662 KB   276/932 KB   
188/348 KB   144/662 KB   280/932 KB   
188/348 KB   144/662 KB   284/932 KB   
192/348 KB   144/662 KB   284/932 KB   
192/348 KB   144/662 KB   288/932 KB   
192/348 KB   148/662 KB   288/932 KB   
192/348 KB   152/662 KB   288/932 KB   
192/348 KB   156/662 KB   288/932 KB   
192/348 KB   160/662 KB   288/932 KB   
192/348 KB   160/662 KB   292/932 KB   
192/348 KB   160/662 KB   296/932 KB   
192/348 KB   160/662 KB   300/932 KB   
192/348 KB   160/662 KB   304/932 KB   
196/348 KB   160/662 KB   304/932 KB   
200/348 KB   160/662 KB   304/932 KB   
200/348 KB   164/662 KB   304/932 KB   
204/348 KB   164/662 KB   304/932 KB   
204/348 KB   164/662 KB   308/932 KB   
204/348 KB   168/662 KB   308/932 KB   
204/348 KB   168/662 KB   312/932 KB   
208/348 KB   168/662 KB   312/932 KB   
208/348 KB   172/662 KB   312/932 KB   
208/348 KB   172/662 KB   316/932 KB   
208/348 KB   176/662 KB   316/932 KB   
208/348 KB   176/662 KB   320/932 KB   
208/348 KB   180/662 KB   320/932 KB   
212/348 KB   180/662 KB   324/932 KB   
208/348 KB   180/662 KB   324/932 KB   
212/348 KB   184/662 KB   324/932 KB   
216/348 KB   184/662 KB   324/932 KB   
216/348 KB   188/662 KB   324/932 KB   
220/348 KB   188/662 KB   324/932 KB   
220/348 KB   188/662 KB   328/932 KB   
220/348 KB   192/662 KB   328/932 KB   
220/348 KB   192/662 KB   332/932 KB   
224/348 KB   192/662 KB   332/932 KB   
224/348 KB   192/662 KB   336/932 KB   
224/348 KB   196/662 KB   336/932 KB   
224/348 KB   200/662 KB   336/932 KB   
224/348 KB   204/662 KB   336/932 KB   
224/348 KB   208/662 KB   336/932 KB   
224/348 KB   208/662 KB   340/932 KB   
224/348 KB   208/662 KB   344/932 KB   
224/348 KB   208/662 KB   348/932 KB   
224/348 KB   208/662 KB   4/21 KB   348/932 KB   
228/348 KB   208/662 KB   4/21 KB   352/932 KB   
232/348 KB   208/662 KB   4/21 KB   352/932 KB   
236/348 KB   208/662 KB   8/21 KB   352/932 KB   
236/348 KB   208/662 KB   8/21 KB   352/932 KB   
236/348 KB   208/662 KB   12/21 KB   352/932 KB   
240/348 KB   208/662 KB   12/21 KB   352/932 KB   
240/348 KB   208/662 KB   16/21 KB   352/932 KB   
240/348 KB   212/662 KB   16/21 KB   352/932 KB   
240/348 KB   216/662 KB   16/21 KB   352/932 KB   
240/348 KB   220/662 KB   16/21 KB   352/932 KB   
240/348 KB   220/662 KB   20/21 KB   352/932 KB   
240/348 KB   224/662 KB   20/21 KB   352/932 KB   
240/348 KB   224/662 KB   21/21 KB   352/932 KB   
244/348 KB   224/662 KB   21/21 KB   352/932 KB   
244/348 KB   224/662 KB   21/21 KB   352/932 KB   4/463 KB   
224/348 KB   208/662 KB   4/21 KB   352/932 KB   
248/348 KB   228/662 KB   21/21 KB   352/932 KB   8/463 KB   
248/348 KB   228/662 KB   21/21 KB   352/932 KB   8/463 KB   
252/348 KB   228/662 KB   21/21 KB   352/932 KB   8/463 KB   
252/348 KB   232/662 KB   21/21 KB   352/932 KB   8/463 KB   
256/348 KB   232/662 KB   21/21 KB   352/932 KB   8/463 KB   
256/348 KB   236/662 KB   21/21 KB   352/932 KB   8/463 KB   
256/348 KB   240/662 KB   21/21 KB   352/932 KB   8/463 KB   
256/348 KB   240/662 KB   21/21 KB   356/932 KB   8/463 KB   
256/348 KB   240/662 KB   21/21 KB   360/932 KB   8/463 KB   
256/348 KB   240/662 KB   21/21 KB   364/932 KB   8/463 KB   
256/348 KB   240/662 KB   21/21 KB   368/932 KB   8/463 KB   
256/348 KB   244/662 KB   21/21 KB   368/932 KB   8/463 KB   
256/348 KB   248/662 KB   21/21 KB   368/932 KB   8/463 KB   
260/348 KB   248/662 KB   21/21 KB   368/932 KB   8/463 KB   
260/348 KB   252/662 KB   21/21 KB   368/932 KB   8/463 KB   
264/348 KB   252/662 KB   21/21 KB   368/932 KB   8/463 KB   
264/348 KB   256/662 KB   21/21 KB   368/932 KB   8/463 KB   
264/348 KB   256/662 KB   21/21 KB   372/932 KB   8/463 KB   
268/348 KB   256/662 KB   21/21 KB   372/932 KB   8/463 KB   
268/348 KB   256/662 KB   21/21 KB   376/932 KB   8/463 KB   
272/348 KB   256/662 KB   21/21 KB   376/932 KB   8/463 KB   
272/348 KB   256/662 KB   21/21 KB   380/932 KB   8/463 KB   
272/348 KB   256/662 KB   21/21 KB   384/932 KB   8/463 KB   
272/348 KB   260/662 KB   21/21 KB   384/932 KB   8/463 KB   
272/348 KB   264/662 KB   21/21 KB   384/932 KB   8/463 KB   
272/348 KB   268/662 KB   21/21 KB   384/932 KB   8/463 KB   
272/348 KB   272/662 KB   21/21 KB   384/932 KB   8/463 KB   
272/348 KB   272/662 KB   21/21 KB   388/932 KB   8/463 KB   
272/348 KB   272/662 KB   21/21 KB   392/932 KB   8/463 KB   
272/348 KB   272/662 KB   21/21 KB   396/932 KB   8/463 KB   
272/348 KB   272/662 KB   21/21 KB   400/932 KB   8/463 KB   
276/348 KB   272/662 KB   21/21 KB   400/932 KB   8/463 KB   
280/348 KB   272/662 KB   21/21 KB   400/932 KB   8/463 KB   
284/348 KB   272/662 KB   21/21 KB   400/932 KB   8/463 KB   
288/348 KB   272/662 KB   21/21 KB   400/932 KB   8/463 KB   
                                                             
288/348 KB   276/662 KB   400/932 KB   8/463 KB              
288/348 KB   280/662 KB   400/932 KB   8/463 KB   
288/348 KB   284/662 KB   400/932 KB   8/463 KB   
Downloaded: https://maven.gluu.org/maven/com/google/api/grpc/grpc-google-cloud-spanner-admin-instance-v1/6.17.3/grpc-google-cloud-spanner-admin-instance-v1-6.17.3.jar (21 KB at 390.8 KB/sec)
Downloading: https://maven.gluu.org/maven/com/google/api/grpc/grpc-google-cloud-spanner-v1/6.17.3/grpc-google-cloud-spanner-v1-6.17.3.jar
288/348 KB   284/662 KB   404/932 KB   8/463 KB   
288/348 KB   288/662 KB   404/932 KB   8/463 KB   
288/348 KB   288/662 KB   408/932 KB   8/463 KB   
288/348 KB   288/662 KB   412/932 KB   8/463 KB   
288/348 KB   288/662 KB   416/932 KB   8/463 KB   
292/348 KB   288/662 KB   416/932 KB   8/463 KB   
296/348 KB   288/662 KB   416/932 KB   8/463 KB   
300/348 KB   288/662 KB   416/932 KB   8/463 KB   
304/348 KB   288/662 KB   416/932 KB   8/463 KB   
304/348 KB   292/662 KB   416/932 KB   8/463 KB   
304/348 KB   292/662 KB   420/932 KB   8/463 KB   
304/348 KB   296/662 KB   420/932 KB   8/463 KB   
248/348 KB   228/662 KB   21/21 KB   352/932 KB   8/463 KB   
304/348 KB   300/662 KB   424/932 KB   8/463 KB   
304/348 KB   300/662 KB   424/932 KB   12/463 KB   
304/348 KB   304/662 KB   424/932 KB   12/463 KB   
304/348 KB   304/662 KB   424/932 KB   16/463 KB   
308/348 KB   304/662 KB   424/932 KB   16/463 KB   
312/348 KB   304/662 KB   424/932 KB   16/463 KB   
316/348 KB   304/662 KB   424/932 KB   16/463 KB   
320/348 KB   304/662 KB   424/932 KB   16/463 KB   
320/348 KB   308/662 KB   424/932 KB   16/463 KB   
320/348 KB   308/662 KB   424/932 KB   20/463 KB   
320/348 KB   312/662 KB   424/932 KB   20/463 KB   
320/348 KB   312/662 KB   424/932 KB   24/463 KB   
320/348 KB   312/662 KB   424/932 KB   28/463 KB   
320/348 KB   316/662 KB   424/932 KB   28/463 KB   
320/348 KB   316/662 KB   424/932 KB   32/463 KB   
320/348 KB   320/662 KB   424/932 KB   32/463 KB   
324/348 KB   320/662 KB   424/932 KB   32/463 KB   
328/348 KB   320/662 KB   424/932 KB   32/463 KB   
332/348 KB   320/662 KB   424/932 KB   32/463 KB   
336/348 KB   320/662 KB   424/932 KB   32/463 KB   
336/348 KB   320/662 KB   424/932 KB   36/463 KB   
336/348 KB   320/662 KB   424/932 KB   40/463 KB   
336/348 KB   324/662 KB   424/932 KB   40/463 KB   
336/348 KB   324/662 KB   424/932 KB   44/463 KB   
336/348 KB   328/662 KB   424/932 KB   44/463 KB   
336/348 KB   328/662 KB   424/932 KB   48/463 KB   
336/348 KB   332/662 KB   424/932 KB   48/463 KB   
340/348 KB   332/662 KB   424/932 KB   48/463 KB   
340/348 KB   336/662 KB   424/932 KB   48/463 KB   
344/348 KB   336/662 KB   424/932 KB   48/463 KB   
348/348 KB   336/662 KB   424/932 KB   48/463 KB   
348/348 KB   336/662 KB   424/932 KB   4/23 KB   48/463 KB   
348/348 KB   336/662 KB   424/932 KB   4/23 KB   52/463 KB   
348/348 KB   336/662 KB   424/932 KB   4/23 KB   56/463 KB   
348/348 KB   336/662 KB   424/932 KB   8/23 KB   56/463 KB   
348/348 KB   340/662 KB   424/932 KB   8/23 KB   56/463 KB   
348/348 KB   340/662 KB   424/932 KB   8/23 KB   60/463 KB   
348/348 KB   344/662 KB   424/932 KB   8/23 KB   60/463 KB   
348/348 KB   344/662 KB   424/932 KB   12/23 KB   64/463 KB   
348/348 KB   348/662 KB   424/932 KB   12/23 KB   64/463 KB   
348/348 KB   348/662 KB   424/932 KB   16/23 KB   64/463 KB   
348/348 KB   352/662 KB   424/932 KB   16/23 KB   64/463 KB   
348/348 KB   352/662 KB   424/932 KB   20/23 KB   64/463 KB   
348/348 KB   352/662 KB   424/932 KB   23/23 KB   64/463 KB   
348/348 KB   356/662 KB   424/932 KB   23/23 KB   64/463 KB   
348/348 KB   360/662 KB   424/932 KB   23/23 KB   64/463 KB   
348/348 KB   364/662 KB   424/932 KB   23/23 KB   64/463 KB   
348/348 KB   368/662 KB   424/932 KB   23/23 KB   64/463 KB   
304/348 KB   296/662 KB   424/932 KB   8/463 KB   
348/348 KB   344/662 KB   424/932 KB   12/23 KB   64/463 KB   
348/348 KB   368/662 KB   428/932 KB   23/23 KB   64/463 KB   
348/348 KB   368/662 KB   432/932 KB   23/23 KB   64/463 KB   
348/348 KB   368/662 KB   432/932 KB   23/23 KB   68/463 KB   
348/348 KB   368/662 KB   436/932 KB   23/23 KB   68/463 KB   
348/348 KB   368/662 KB   436/932 KB   23/23 KB   72/463 KB   
348/348 KB   368/662 KB   440/932 KB   23/23 KB   72/463 KB   
348/348 KB   368/662 KB   440/932 KB   23/23 KB   76/463 KB   
348/348 KB   368/662 KB   444/932 KB   23/23 KB   80/463 KB   
348/348 KB   368/662 KB   448/932 KB   23/23 KB   80/463 KB   
348/348 KB   372/662 KB   448/932 KB   23/23 KB   80/463 KB   
348/348 KB   376/662 KB   448/932 KB   23/23 KB   80/463 KB   
348/348 KB   380/662 KB   448/932 KB   23/23 KB   80/463 KB   
348/348 KB   384/662 KB   448/932 KB   23/23 KB   80/463 KB   
348/348 KB   384/662 KB   452/932 KB   23/23 KB   80/463 KB   
348/348 KB   384/662 KB   456/932 KB   23/23 KB   80/463 KB   
348/348 KB   384/662 KB   460/932 KB   23/23 KB   80/463 KB   
                                                              
384/662 KB   464/932 KB   23/23 KB   80/463 KB                
388/662 KB   464/932 KB   23/23 KB   80/463 KB   
392/662 KB   464/932 KB   23/23 KB   80/463 KB   
Downloaded: https://maven.gluu.org/maven/io/opencensus/opencensus-api/0.30.0/opencensus-api-0.30.0.jar (348 KB at 5258.9 KB/sec)
396/662 KB   464/932 KB   23/23 KB   80/463 KB   
Downloading: https://maven.gluu.org/maven/com/google/api/grpc/grpc-google-cloud-spanner-admin-database-v1/6.17.3/grpc-google-cloud-spanner-admin-database-v1-6.17.3.jar
400/662 KB   464/932 KB   23/23 KB   80/463 KB   
400/662 KB   468/932 KB   23/23 KB   80/463 KB   
400/662 KB   472/932 KB   23/23 KB   80/463 KB   
404/662 KB   472/932 KB   23/23 KB   80/463 KB   
404/662 KB   476/932 KB   23/23 KB   80/463 KB   
408/662 KB   476/932 KB   23/23 KB   80/463 KB   
408/662 KB   480/932 KB   23/23 KB   80/463 KB   
412/662 KB   480/932 KB   23/23 KB   80/463 KB   
416/662 KB   480/932 KB   23/23 KB   80/463 KB   
348/348 KB   368/662 KB   444/932 KB   23/23 KB   80/463 KB   
                                                 
Downloaded: https://maven.gluu.org/maven/com/google/api/grpc/grpc-google-cloud-spanner-v1/6.17.3/grpc-google-cloud-spanner-v1-6.17.3.jar (23 KB at 335.3 KB/sec)
Downloading: https://maven.gluu.org/maven/redis/clients/jedis/3.7.0/jedis-3.7.0.jar
420/662 KB   480/932 KB   80/463 KB              
420/662 KB   484/932 KB   80/463 KB   
424/662 KB   484/932 KB   80/463 KB   
424/662 KB   488/932 KB   80/463 KB   
428/662 KB   488/932 KB   80/463 KB   
428/662 KB   492/932 KB   80/463 KB   
432/662 KB   492/932 KB   80/463 KB   
432/662 KB   496/932 KB   80/463 KB   
432/662 KB   496/932 KB   84/463 KB   
432/662 KB   496/932 KB   88/463 KB   
432/662 KB   496/932 KB   92/463 KB   
432/662 KB   496/932 KB   96/463 KB   
436/662 KB   496/932 KB   96/463 KB   
436/662 KB   500/932 KB   96/463 KB   
440/662 KB   500/932 KB   96/463 KB   
440/662 KB   504/932 KB   96/463 KB   
444/662 KB   504/932 KB   96/463 KB   
444/662 KB   508/932 KB   96/463 KB   
444/662 KB   508/932 KB   100/463 KB   
448/662 KB   508/932 KB   100/463 KB   
448/662 KB   512/932 KB   100/463 KB   
448/662 KB   512/932 KB   104/463 KB   
448/662 KB   512/932 KB   108/463 KB   
448/662 KB   512/932 KB   112/463 KB   
452/662 KB   512/932 KB   112/463 KB   
456/662 KB   512/932 KB   112/463 KB   
456/662 KB   516/932 KB   112/463 KB   
460/662 KB   516/932 KB   112/463 KB   
464/662 KB   516/932 KB   112/463 KB   
464/662 KB   520/932 KB   112/463 KB   
464/662 KB   520/932 KB   116/463 KB   
464/662 KB   524/932 KB   116/463 KB   
464/662 KB   528/932 KB   116/463 KB   
464/662 KB   528/932 KB   120/463 KB   
464/662 KB   528/932 KB   124/463 KB   
464/662 KB   528/932 KB   128/463 KB   
468/662 KB   528/932 KB   128/463 KB   
472/662 KB   528/932 KB   128/463 KB   
476/662 KB   528/932 KB   128/463 KB   
480/662 KB   528/932 KB   128/463 KB   
480/662 KB   532/932 KB   128/463 KB   
480/662 KB   536/932 KB   128/463 KB   
480/662 KB   540/932 KB   128/463 KB   
480/662 KB   544/932 KB   128/463 KB   
480/662 KB   544/932 KB   132/463 KB   
480/662 KB   544/932 KB   136/463 KB   
480/662 KB   544/932 KB   140/463 KB   
480/662 KB   544/932 KB   144/463 KB   
484/662 KB   544/932 KB   144/463 KB   
488/662 KB   544/932 KB   144/463 KB   
492/662 KB   544/932 KB   144/463 KB   
496/662 KB   544/932 KB   144/463 KB   
496/662 KB   548/932 KB   144/463 KB   
496/662 KB   548/932 KB   148/463 KB   
496/662 KB   552/932 KB   148/463 KB   
496/662 KB   552/932 KB   152/463 KB   
496/662 KB   556/932 KB   152/463 KB   
496/662 KB   556/932 KB   156/463 KB   
500/662 KB   556/932 KB   156/463 KB   
500/662 KB   556/932 KB   4/880 KB   156/463 KB   
500/662 KB   560/932 KB   4/880 KB   156/463 KB   
504/662 KB   560/932 KB   4/880 KB   160/463 KB   
508/662 KB   560/932 KB   4/880 KB   160/463 KB   
508/662 KB   560/932 KB   8/880 KB   160/463 KB   
512/662 KB   560/932 KB   8/880 KB   160/463 KB   
512/662 KB   560/932 KB   12/880 KB   160/463 KB   
512/662 KB   560/932 KB   16/880 KB   160/463 KB   
512/662 KB   564/932 KB   16/880 KB   160/463 KB   
512/662 KB   568/932 KB   16/880 KB   160/463 KB   
516/662 KB   568/932 KB   16/880 KB   160/463 KB   
516/662 KB   572/932 KB   16/880 KB   160/463 KB   
520/662 KB   572/932 KB   16/880 KB   160/463 KB   
520/662 KB   576/932 KB   16/880 KB   160/463 KB   
524/662 KB   576/932 KB   16/880 KB   160/463 KB   
524/662 KB   576/932 KB   16/880 KB   4/25 KB   160/463 KB   
528/662 KB   576/932 KB   16/880 KB   4/25 KB   160/463 KB   
528/662 KB   576/932 KB   16/880 KB   8/25 KB   160/463 KB   
528/662 KB   576/932 KB   16/880 KB   12/25 KB   160/463 KB   
528/662 KB   576/932 KB   16/880 KB   16/25 KB   160/463 KB   
528/662 KB   576/932 KB   20/880 KB   16/25 KB   160/463 KB   
528/662 KB   576/932 KB   24/880 KB   16/25 KB   160/463 KB   
528/662 KB   576/932 KB   28/880 KB   16/25 KB   160/463 KB   
528/662 KB   576/932 KB   32/880 KB   16/25 KB   160/463 KB   
528/662 KB   576/932 KB   32/880 KB   20/25 KB   160/463 KB   
528/662 KB   576/932 KB   32/880 KB   24/25 KB   160/463 KB   
528/662 KB   576/932 KB   32/880 KB   25/25 KB   160/463 KB   
528/662 KB   580/932 KB   32/880 KB   25/25 KB   160/463 KB   
528/662 KB   584/932 KB   32/880 KB   25/25 KB   160/463 KB   
532/662 KB   584/932 KB   32/880 KB   25/25 KB   160/463 KB   
532/662 KB   588/932 KB   32/880 KB   25/25 KB   160/463 KB   
536/662 KB   588/932 KB   32/880 KB   25/25 KB   160/463 KB   
536/662 KB   592/932 KB   32/880 KB   25/25 KB   160/463 KB   
500/662 KB   560/932 KB   4/880 KB   160/463 KB   
540/662 KB   592/932 KB   36/880 KB   25/25 KB   160/463 KB   
540/662 KB   592/932 KB   40/880 KB   25/25 KB   160/463 KB   
540/662 KB   592/932 KB   44/880 KB   25/25 KB   160/463 KB   
540/662 KB   592/932 KB   48/880 KB   25/25 KB   160/463 KB   
540/662 KB   592/932 KB   32/880 KB   25/25 KB   160/463 KB   
540/662 KB   596/932 KB   48/880 KB   25/25 KB   160/463 KB   
540/662 KB   596/932 KB   48/880 KB   25/25 KB   164/463 KB   
540/662 KB   600/932 KB   48/880 KB   25/25 KB   164/463 KB   
540/662 KB   600/932 KB   48/880 KB   25/25 KB   168/463 KB   
544/662 KB   600/932 KB   48/880 KB   25/25 KB   168/463 KB   
544/662 KB   604/932 KB   48/880 KB   25/25 KB   168/463 KB   
544/662 KB   604/932 KB   48/880 KB   25/25 KB   172/463 KB   
544/662 KB   608/932 KB   48/880 KB   25/25 KB   172/463 KB   
544/662 KB   608/932 KB   48/880 KB   25/25 KB   176/463 KB   
544/662 KB   608/932 KB   52/880 KB   25/25 KB   176/463 KB   
544/662 KB   608/932 KB   56/880 KB   25/25 KB   176/463 KB   
544/662 KB   608/932 KB   60/880 KB   25/25 KB   176/463 KB   
544/662 KB   608/932 KB   64/880 KB   25/25 KB   176/463 KB   
548/662 KB   608/932 KB   64/880 KB   25/25 KB   176/463 KB   
552/662 KB   608/932 KB   64/880 KB   25/25 KB   176/463 KB   
556/662 KB   608/932 KB   64/880 KB   25/25 KB   176/463 KB   
560/662 KB   608/932 KB   64/880 KB   25/25 KB   176/463 KB   
560/662 KB   612/932 KB   64/880 KB   25/25 KB   176/463 KB   
560/662 KB   612/932 KB   64/880 KB   25/25 KB   180/463 KB   
560/662 KB   616/932 KB   64/880 KB   25/25 KB   180/463 KB   
560/662 KB   620/932 KB   64/880 KB   25/25 KB   180/463 KB   
560/662 KB   620/932 KB   64/880 KB   25/25 KB   184/463 KB   
560/662 KB   624/932 KB   64/880 KB   25/25 KB   184/463 KB   
560/662 KB   624/932 KB   64/880 KB   25/25 KB   188/463 KB   
560/662 KB   624/932 KB   64/880 KB   25/25 KB   192/463 KB   
560/662 KB   624/932 KB   68/880 KB   25/25 KB   192/463 KB   
564/662 KB   624/932 KB   68/880 KB   25/25 KB   192/463 KB   
564/662 KB   624/932 KB   72/880 KB   25/25 KB   192/463 KB   
568/662 KB   624/932 KB   72/880 KB   25/25 KB   192/463 KB   
572/662 KB   624/932 KB   72/880 KB   25/25 KB   192/463 KB   
572/662 KB   624/932 KB   76/880 KB   25/25 KB   192/463 KB   
576/662 KB   624/932 KB   76/880 KB   25/25 KB   192/463 KB   
576/662 KB   624/932 KB   80/880 KB   25/25 KB   192/463 KB   
576/662 KB   628/932 KB   80/880 KB   25/25 KB   192/463 KB   
576/662 KB   632/932 KB   80/880 KB   25/25 KB   192/463 KB   
576/662 KB   632/932 KB   80/880 KB   25/25 KB   196/463 KB   
576/662 KB   636/932 KB   80/880 KB   25/25 KB   196/463 KB   
576/662 KB   640/932 KB   80/880 KB   25/25 KB   196/463 KB   
576/662 KB   640/932 KB   80/880 KB   25/25 KB   200/463 KB   
576/662 KB   640/932 KB   80/880 KB   25/25 KB   204/463 KB   
580/662 KB   640/932 KB   80/880 KB   25/25 KB   204/463 KB   
580/662 KB   640/932 KB   80/880 KB   25/25 KB   208/463 KB   
584/662 KB   640/932 KB   80/880 KB   25/25 KB   208/463 KB   
588/662 KB   640/932 KB   80/880 KB   25/25 KB   208/463 KB   
588/662 KB   640/932 KB   84/880 KB   25/25 KB   208/463 KB   
592/662 KB   640/932 KB   84/880 KB   25/25 KB   208/463 KB   
592/662 KB   640/932 KB   88/880 KB   25/25 KB   208/463 KB   
592/662 KB   640/932 KB   92/880 KB   25/25 KB   208/463 KB   
592/662 KB   640/932 KB   96/880 KB   25/25 KB   208/463 KB   
                                                              
592/662 KB   644/932 KB   96/880 KB   208/463 KB              
592/662 KB   648/932 KB   96/880 KB   208/463 KB   
Downloaded: https://maven.gluu.org/maven/com/google/api/grpc/grpc-google-cloud-spanner-admin-database-v1/6.17.3/grpc-google-cloud-spanner-admin-database-v1-6.17.3.jar (25 KB at 306.5 KB/sec)
592/662 KB   652/932 KB   96/880 KB   208/463 KB   
592/662 KB   656/932 KB   96/880 KB   208/463 KB   
592/662 KB   656/932 KB   96/880 KB   212/463 KB   
592/662 KB   656/932 KB   96/880 KB   216/463 KB   
592/662 KB   656/932 KB   96/880 KB   220/463 KB   
596/662 KB   656/932 KB   96/880 KB   220/463 KB   
596/662 KB   656/932 KB   96/880 KB   224/463 KB   
600/662 KB   656/932 KB   96/880 KB   224/463 KB   
604/662 KB   656/932 KB   96/880 KB   224/463 KB   
608/662 KB   656/932 KB   96/880 KB   224/463 KB   
608/662 KB   656/932 KB   100/880 KB   224/463 KB   
608/662 KB   656/932 KB   104/880 KB   224/463 KB   
608/662 KB   656/932 KB   108/880 KB   224/463 KB   
608/662 KB   656/932 KB   112/880 KB   224/463 KB   
608/662 KB   660/932 KB   112/880 KB   224/463 KB   
608/662 KB   664/932 KB   112/880 KB   224/463 KB   
608/662 KB   668/932 KB   112/880 KB   224/463 KB   
608/662 KB   672/932 KB   112/880 KB   224/463 KB   
608/662 KB   672/932 KB   112/880 KB   228/463 KB   
608/662 KB   672/932 KB   112/880 KB   232/463 KB   
608/662 KB   672/932 KB   112/880 KB   236/463 KB   
612/662 KB   672/932 KB   112/880 KB   236/463 KB   
612/662 KB   672/932 KB   112/880 KB   240/463 KB   
616/662 KB   672/932 KB   112/880 KB   240/463 KB   
620/662 KB   672/932 KB   112/880 KB   240/463 KB   
624/662 KB   672/932 KB   112/880 KB   240/463 KB   
624/662 KB   672/932 KB   116/880 KB   240/463 KB   
624/662 KB   676/932 KB   116/880 KB   240/463 KB   
624/662 KB   676/932 KB   120/880 KB   240/463 KB   
624/662 KB   680/932 KB   120/880 KB   240/463 KB   
624/662 KB   680/932 KB   124/880 KB   240/463 KB   
624/662 KB   684/932 KB   124/880 KB   240/463 KB   
624/662 KB   684/932 KB   128/880 KB   240/463 KB   
624/662 KB   688/932 KB   128/880 KB   244/463 KB   
624/662 KB   688/932 KB   128/880 KB   244/463 KB   
624/662 KB   688/932 KB   128/880 KB   248/463 KB   
624/662 KB   688/932 KB   128/880 KB   252/463 KB   
628/662 KB   688/932 KB   128/880 KB   252/463 KB   
628/662 KB   688/932 KB   128/880 KB   256/463 KB   
632/662 KB   688/932 KB   128/880 KB   256/463 KB   
636/662 KB   688/932 KB   128/880 KB   256/463 KB   
640/662 KB   688/932 KB   128/880 KB   256/463 KB   
640/662 KB   692/932 KB   128/880 KB   256/463 KB   
640/662 KB   696/932 KB   128/880 KB   256/463 KB   
640/662 KB   700/932 KB   128/880 KB   256/463 KB   
640/662 KB   704/932 KB   128/880 KB   256/463 KB   
640/662 KB   704/932 KB   128/880 KB   260/463 KB   
640/662 KB   704/932 KB   132/880 KB   260/463 KB   
644/662 KB   704/932 KB   132/880 KB   260/463 KB   
644/662 KB   704/932 KB   136/880 KB   264/463 KB   
648/662 KB   704/932 KB   136/880 KB   264/463 KB   
648/662 KB   704/932 KB   140/880 KB   264/463 KB   
652/662 KB   704/932 KB   140/880 KB   264/463 KB   
644/662 KB   704/932 KB   132/880 KB   264/463 KB   
656/662 KB   704/932 KB   140/880 KB   264/463 KB   
656/662 KB   704/932 KB   140/880 KB   268/463 KB   
656/662 KB   704/932 KB   144/880 KB   268/463 KB   
656/662 KB   704/932 KB   144/880 KB   272/463 KB   
656/662 KB   708/932 KB   144/880 KB   272/463 KB   
660/662 KB   708/932 KB   144/880 KB   272/463 KB   
662/662 KB   708/932 KB   144/880 KB   272/463 KB   
662/662 KB   712/932 KB   144/880 KB   272/463 KB   
662/662 KB   716/932 KB   144/880 KB   272/463 KB   
662/662 KB   720/932 KB   144/880 KB   272/463 KB   
662/662 KB   720/932 KB   144/880 KB   276/463 KB   
662/662 KB   720/932 KB   144/880 KB   280/463 KB   
662/662 KB   720/932 KB   144/880 KB   284/463 KB   
662/662 KB   720/932 KB   144/880 KB   288/463 KB   
662/662 KB   724/932 KB   144/880 KB   288/463 KB   
662/662 KB   724/932 KB   148/880 KB   288/463 KB   
662/662 KB   728/932 KB   148/880 KB   288/463 KB   
662/662 KB   732/932 KB   148/880 KB   288/463 KB   
662/662 KB   732/932 KB   152/880 KB   288/463 KB   
662/662 KB   736/932 KB   152/880 KB   288/463 KB   
662/662 KB   736/932 KB   156/880 KB   288/463 KB   
662/662 KB   736/932 KB   160/880 KB   288/463 KB   
662/662 KB   736/932 KB   160/880 KB   292/463 KB   
662/662 KB   736/932 KB   160/880 KB   296/463 KB   
662/662 KB   736/932 KB   160/880 KB   300/463 KB   
662/662 KB   736/932 KB   160/880 KB   304/463 KB   
662/662 KB   740/932 KB   160/880 KB   304/463 KB   
662/662 KB   744/932 KB   160/880 KB   304/463 KB   
662/662 KB   748/932 KB   160/880 KB   304/463 KB   
662/662 KB   752/932 KB   160/880 KB   304/463 KB   
662/662 KB   752/932 KB   164/880 KB   304/463 KB   
662/662 KB   752/932 KB   164/880 KB   308/463 KB   
662/662 KB   756/932 KB   164/880 KB   308/463 KB   
662/662 KB   756/932 KB   168/880 KB   308/463 KB   
662/662 KB   760/932 KB   168/880 KB   308/463 KB   
662/662 KB   760/932 KB   168/880 KB   312/463 KB   
662/662 KB   760/932 KB   172/880 KB   312/463 KB   
662/662 KB   764/932 KB   172/880 KB   312/463 KB   
662/662 KB   764/932 KB   172/880 KB   316/463 KB   
662/662 KB   764/932 KB   176/880 KB   316/463 KB   
662/662 KB   768/932 KB   176/880 KB   320/463 KB   
662/662 KB   768/932 KB   176/880 KB   320/463 KB   
662/662 KB   772/932 KB   176/880 KB   320/463 KB   
662/662 KB   776/932 KB   176/880 KB   320/463 KB   
662/662 KB   776/932 KB   176/880 KB   324/463 KB   
662/662 KB   780/932 KB   176/880 KB   324/463 KB   
662/662 KB   784/932 KB   176/880 KB   324/463 KB   
662/662 KB   784/932 KB   176/880 KB   328/463 KB   
662/662 KB   784/932 KB   180/880 KB   328/463 KB   
662/662 KB   784/932 KB   180/880 KB   332/463 KB   
662/662 KB   784/932 KB   184/880 KB   332/463 KB   
662/662 KB   784/932 KB   184/880 KB   336/463 KB   
662/662 KB   784/932 KB   188/880 KB   336/463 KB   
662/662 KB   784/932 KB   192/880 KB   336/463 KB   
662/662 KB   788/932 KB   192/880 KB   336/463 KB   
662/662 KB   792/932 KB   192/880 KB   336/463 KB   
662/662 KB   796/932 KB   192/880 KB   336/463 KB   
662/662 KB   800/932 KB   192/880 KB   336/463 KB   
662/662 KB   800/932 KB   192/880 KB   340/463 KB   
662/662 KB   800/932 KB   192/880 KB   344/463 KB   
662/662 KB   800/932 KB   192/880 KB   348/463 KB   
                                                    
800/932 KB   192/880 KB   352/463 KB                
804/932 KB   192/880 KB   352/463 KB   
808/932 KB   192/880 KB   352/463 KB   
812/932 KB   192/880 KB   352/463 KB   
Downloaded: https://maven.gluu.org/maven/com/google/api/grpc/proto-google-cloud-spanner-v1/6.17.3/proto-google-cloud-spanner-v1-6.17.3.jar (662 KB at 7188.7 KB/sec)
816/932 KB   192/880 KB   352/463 KB   
816/932 KB   196/880 KB   352/463 KB   
816/932 KB   200/880 KB   352/463 KB   
816/932 KB   204/880 KB   352/463 KB   
816/932 KB   208/880 KB   352/463 KB   
816/932 KB   208/880 KB   356/463 KB   
816/932 KB   208/880 KB   360/463 KB   
816/932 KB   208/880 KB   364/463 KB   
816/932 KB   208/880 KB   368/463 KB   
820/932 KB   208/880 KB   368/463 KB   
824/932 KB   208/880 KB   368/463 KB   
828/932 KB   208/880 KB   368/463 KB   
832/932 KB   208/880 KB   368/463 KB   
832/932 KB   212/880 KB   368/463 KB   
832/932 KB   212/880 KB   372/463 KB   
832/932 KB   216/880 KB   372/463 KB   
832/932 KB   216/880 KB   376/463 KB   
832/932 KB   220/880 KB   376/463 KB   
832/932 KB   220/880 KB   380/463 KB   
832/932 KB   224/880 KB   380/463 KB   
836/932 KB   224/880 KB   384/463 KB   
836/932 KB   224/880 KB   384/463 KB   
840/932 KB   224/880 KB   384/463 KB   
844/932 KB   224/880 KB   384/463 KB   
848/932 KB   224/880 KB   384/463 KB   
852/932 KB   224/880 KB   384/463 KB   
852/932 KB   224/880 KB   388/463 KB   
852/932 KB   228/880 KB   388/463 KB   
856/932 KB   228/880 KB   388/463 KB   
856/932 KB   228/880 KB   392/463 KB   
856/932 KB   232/880 KB   392/463 KB   
860/932 KB   232/880 KB   396/463 KB   
860/932 KB   232/880 KB   396/463 KB   
860/932 KB   236/880 KB   396/463 KB   
864/932 KB   236/880 KB   396/463 KB   
864/932 KB   236/880 KB   400/463 KB   
864/932 KB   240/880 KB   400/463 KB   
868/932 KB   240/880 KB   400/463 KB   
872/932 KB   240/880 KB   400/463 KB   
876/932 KB   240/880 KB   400/463 KB   
880/932 KB   240/880 KB   400/463 KB   
880/932 KB   240/880 KB   404/463 KB   
880/932 KB   240/880 KB   408/463 KB   
880/932 KB   240/880 KB   412/463 KB   
880/932 KB   240/880 KB   416/463 KB   
880/932 KB   244/880 KB   416/463 KB   
880/932 KB   248/880 KB   416/463 KB   
884/932 KB   248/880 KB   416/463 KB   
884/932 KB   252/880 KB   416/463 KB   
888/932 KB   252/880 KB   416/463 KB   
888/932 KB   256/880 KB   416/463 KB   
892/932 KB   256/880 KB   416/463 KB   
896/932 KB   256/880 KB   416/463 KB   
896/932 KB   256/880 KB   420/463 KB   
896/932 KB   256/880 KB   424/463 KB   
896/932 KB   256/880 KB   428/463 KB   
896/932 KB   256/880 KB   432/463 KB   
900/932 KB   256/880 KB   432/463 KB   
904/932 KB   256/880 KB   432/463 KB   
908/932 KB   256/880 KB   432/463 KB   
912/932 KB   256/880 KB   432/463 KB   
912/932 KB   256/880 KB   436/463 KB   
912/932 KB   260/880 KB   436/463 KB   
916/932 KB   260/880 KB   436/463 KB   
916/932 KB   260/880 KB   440/463 KB   
920/932 KB   260/880 KB   440/463 KB   
920/932 KB   264/880 KB   440/463 KB   
920/932 KB   264/880 KB   444/463 KB   
924/932 KB   264/880 KB   444/463 KB   
924/932 KB   268/880 KB   444/463 KB   
924/932 KB   268/880 KB   448/463 KB   
928/932 KB   268/880 KB   448/463 KB   
928/932 KB   272/880 KB   448/463 KB   
932/932 KB   272/880 KB   448/463 KB   
932/932 KB   272/880 KB   452/463 KB   
932/932 KB   272/880 KB   456/463 KB   
932/932 KB   272/880 KB   460/463 KB   
932/932 KB   272/880 KB   463/463 KB   
932/932 KB   276/880 KB   463/463 KB   
932/932 KB   280/880 KB   463/463 KB   
932/932 KB   284/880 KB   463/463 KB   
932/932 KB   288/880 KB   463/463 KB   
932/932 KB   292/880 KB   463/463 KB   
932/932 KB   296/880 KB   463/463 KB   
932/932 KB   300/880 KB   463/463 KB   
932/932 KB   304/880 KB   463/463 KB   
932/932 KB   308/880 KB   463/463 KB   
932/932 KB   312/880 KB   463/463 KB   
932/932 KB   316/880 KB   463/463 KB   
932/932 KB   320/880 KB   463/463 KB   
932/932 KB   324/880 KB   463/463 KB   
932/932 KB   328/880 KB   463/463 KB   
932/932 KB   332/880 KB   463/463 KB   
932/932 KB   336/880 KB   463/463 KB   
932/932 KB   340/880 KB   463/463 KB   
932/932 KB   344/880 KB   463/463 KB   
932/932 KB   348/880 KB   463/463 KB   
932/932 KB   352/880 KB   463/463 KB   
932/932 KB   356/880 KB   463/463 KB   
932/932 KB   360/880 KB   463/463 KB   
932/932 KB   364/880 KB   463/463 KB   
932/932 KB   368/880 KB   463/463 KB   
                                       
372/880 KB   463/463 KB                
376/880 KB   463/463 KB   
380/880 KB   463/463 KB   
Downloaded: https://maven.gluu.org/maven/com/google/cloud/google-cloud-spanner/6.17.3/google-cloud-spanner-6.17.3.jar (932 KB at 8465.2 KB/sec)
384/880 KB   463/463 KB   
388/880 KB   463/463 KB   
392/880 KB   463/463 KB   
396/880 KB   463/463 KB   
400/880 KB   463/463 KB   
                          
Downloaded: https://maven.gluu.org/maven/com/google/api/grpc/proto-google-cloud-spanner-admin-database-v1/6.17.3/proto-google-cloud-spanner-admin-database-v1-6.17.3.jar (463 KB at 4243.3 KB/sec)
404/880 KB                
408/880 KB   
412/880 KB   
416/880 KB   
420/880 KB   
424/880 KB   
428/880 KB   
432/880 KB   
436/880 KB   
440/880 KB   
444/880 KB   
448/880 KB   
452/880 KB   
456/880 KB   
460/880 KB   
464/880 KB   
468/880 KB   
472/880 KB   
476/880 KB   
480/880 KB   
484/880 KB   
488/880 KB   
492/880 KB   
496/880 KB   
500/880 KB   
504/880 KB   
508/880 KB   
512/880 KB   
516/880 KB   
520/880 KB   
524/880 KB   
528/880 KB   
532/880 KB   
536/880 KB   
540/880 KB   
544/880 KB   
548/880 KB   
552/880 KB   
556/880 KB   
560/880 KB   
564/880 KB   
568/880 KB   
572/880 KB   
576/880 KB   
580/880 KB   
584/880 KB   
588/880 KB   
592/880 KB   
596/880 KB   
600/880 KB   
604/880 KB   
608/880 KB   
612/880 KB   
616/880 KB   
620/880 KB   
624/880 KB   
628/880 KB   
632/880 KB   
636/880 KB   
640/880 KB   
644/880 KB   
648/880 KB   
652/880 KB   
656/880 KB   
660/880 KB   
664/880 KB   
668/880 KB   
672/880 KB   
676/880 KB   
680/880 KB   
684/880 KB   
688/880 KB   
692/880 KB   
696/880 KB   
700/880 KB   
704/880 KB   
708/880 KB   
712/880 KB   
716/880 KB   
720/880 KB   
724/880 KB   
728/880 KB   
732/880 KB   
736/880 KB   
740/880 KB   
744/880 KB   
748/880 KB   
752/880 KB   
756/880 KB   
760/880 KB   
764/880 KB   
768/880 KB   
772/880 KB   
776/880 KB   
780/880 KB   
784/880 KB   
788/880 KB   
792/880 KB   
796/880 KB   
800/880 KB   
804/880 KB   
808/880 KB   
812/880 KB   
816/880 KB   
820/880 KB   
824/880 KB   
828/880 KB   
832/880 KB   
836/880 KB   
840/880 KB   
844/880 KB   
848/880 KB   
852/880 KB   
856/880 KB   
860/880 KB   
864/880 KB   
868/880 KB   
872/880 KB   
876/880 KB   
880/880 KB   
             
Downloaded: https://maven.gluu.org/maven/redis/clients/jedis/3.7.0/jedis-3.7.0.jar (880 KB at 6373.5 KB/sec)
[INFO] 
[INFO] --- maven-clean-plugin:2.5:clean (default-clean) @ oxtrust-model ---
[INFO] Deleting /home/jenkins/.jenkins/jobs/oxTrust/workspace/model/target
[INFO] 
[INFO] --- maven-resources-plugin:2.6:resources (default-resources) @ oxtrust-model ---
[INFO] Using 'UTF-8' encoding to copy filtered resources.
[INFO] skip non existing resourceDirectory /home/jenkins/.jenkins/jobs/oxTrust/workspace/model/src/main/resources
[INFO] 
[INFO] --- maven-compiler-plugin:2.3.2:compile (default-compile) @ oxtrust-model ---
[INFO] Compiling 84 source files to /home/jenkins/.jenkins/jobs/oxTrust/workspace/model/target/classes
[INFO] 
[INFO] --- maven-resources-plugin:2.6:resources (default-resources) @ oxtrust-model ---
[INFO] Using 'UTF-8' encoding to copy filtered resources.
[INFO] skip non existing resourceDirectory /home/jenkins/.jenkins/jobs/oxTrust/workspace/model/src/main/resources
[INFO] 
[INFO] --- maven-compiler-plugin:2.3.2:compile (default-compile) @ oxtrust-model ---
[INFO] Nothing to compile - all classes are up to date
[INFO] 
[INFO] --- maven-resources-plugin:2.6:testResources (default-testResources) @ oxtrust-model ---
[INFO] Using 'UTF-8' encoding to copy filtered resources.
[INFO] skip non existing resourceDirectory /home/jenkins/.jenkins/jobs/oxTrust/workspace/model/src/test/resources
[INFO] 
[INFO] --- maven-compiler-plugin:2.3.2:testCompile (default-testCompile) @ oxtrust-model ---
[INFO] No sources to compile
[INFO] 
[INFO] --- maven-surefire-plugin:2.19.1:test (default-test) @ oxtrust-model ---
[INFO] No tests to run.
[INFO] 
[INFO] --- maven-jar-plugin:2.4:jar (default-jar) @ oxtrust-model ---
[INFO] Building jar: /home/jenkins/.jenkins/jobs/oxTrust/workspace/model/target/oxtrust-model-4.4.0-SNAPSHOT.jar
[INFO] 
[INFO] --- maven-jar-plugin:2.4:test-jar (default) @ oxtrust-model ---
[WARNING] JAR will be empty - no content was marked for inclusion!
[INFO] Building jar: /home/jenkins/.jenkins/jobs/oxTrust/workspace/model/target/oxtrust-model-4.4.0-SNAPSHOT-tests.jar
[INFO] 
[INFO] --- maven-install-plugin:2.3.1:install (default-install) @ oxtrust-model ---
[INFO] Installing /home/jenkins/.jenkins/jobs/oxTrust/workspace/model/target/oxtrust-model-4.4.0-SNAPSHOT.jar to /var/www/html/maven/org/gluu/oxtrust-model/4.4.0-SNAPSHOT/oxtrust-model-4.4.0-SNAPSHOT.jar
[INFO] Installing /home/jenkins/.jenkins/jobs/oxTrust/workspace/model/pom.xml to /var/www/html/maven/org/gluu/oxtrust-model/4.4.0-SNAPSHOT/oxtrust-model-4.4.0-SNAPSHOT.pom
[INFO] Installing /home/jenkins/.jenkins/jobs/oxTrust/workspace/model/target/oxtrust-model-4.4.0-SNAPSHOT-tests.jar to /var/www/html/maven/org/gluu/oxtrust-model/4.4.0-SNAPSHOT/oxtrust-model-4.4.0-SNAPSHOT-tests.jar
[INFO] 
[INFO] --- findbugs-maven-plugin:3.0.4:findbugs (default-cli) @ oxtrust-model ---
[INFO] Fork Value is true
     [java] The following classes needed for analysis were missing:
     [java]   java.lang.Object
     [java]   java.lang.Enum
     [java]   java.io.Serializable
     [java]   java.lang.Cloneable
     [java]   java.lang.Comparable
     [java]   java.lang.String
     [java]   java.util.Date
     [java]   java.lang.StringBuilder
     [java]   java.util.List
     [java]   java.util.Map
     [java]   java.lang.StringBuffer
     [java]   java.util.HashMap
     [java]   java.util.ArrayList
     [java]   java.util.Iterator
     [java]   java.util.Arrays
     [java]   java.lang.Integer
     [java]   java.util.Set
     [java]   java.util.Collection
     [java]   java.lang.Boolean
     [java]   java.security.cert.X509Certificate
     [java]   java.security.Principal
     [java]   java.lang.System
     [java]   java.io.File
     [java]   java.util.TreeSet
     [java]   java.lang.IllegalArgumentException
     [java]   java.lang.Math
     [java]   java.time.LocalDate
     [java]   java.time.ZoneId
     [java]   java.time.ZonedDateTime
     [java]   java.lang.Long
     [java]   java.lang.NoSuchFieldError
     [java]   java.lang.UnsatisfiedLinkError
     [java]   java.lang.NoClassDefFoundError
     [java]   java.lang.CloneNotSupportedException
     [java]   java.lang.IllegalAccessError
     [java] Warnings generated: 90
     [java] Missing classes: 29
[INFO] Done FindBugs Analysis....
[INFO] 
[INFO] --- maven-site-plugin:2.1.1:site (default-site) @ oxtrust-model ---
[INFO]                                                                         
[INFO] ------------------------------------------------------------------------
[INFO] Building oxTrust Client library 4.4.0-SNAPSHOT
[INFO] ------------------------------------------------------------------------
Downloading: https://repo1.maven.org/maven2/org/gluu/oxauth-client/4.4.0-SNAPSHOT/maven-metadata.xml
Downloading: https://maven.gluu.org/maven/org/gluu/oxauth-client/4.4.0-SNAPSHOT/maven-metadata.xml
Downloading: https://repository.jboss.org/nexus/content/groups/public-jboss/org/gluu/oxauth-client/4.4.0-SNAPSHOT/maven-metadata.xml
Downloading: https://build.shibboleth.net/nexus/content/repositories/releases/org/gluu/oxauth-client/4.4.0-SNAPSHOT/maven-metadata.xml
             
             
             
             
[INFO] 
[INFO] --- maven-clean-plugin:2.5:clean (default-clean) @ oxtrust-client ---
[INFO] Deleting /home/jenkins/.jenkins/jobs/oxTrust/workspace/client/target
[INFO] 
[INFO] --- maven-resources-plugin:2.6:resources (default-resources) @ oxtrust-client ---
[INFO] Using 'UTF-8' encoding to copy filtered resources.
[INFO] skip non existing resourceDirectory /home/jenkins/.jenkins/jobs/oxTrust/workspace/client/src/main/resources
[INFO] 
[INFO] --- maven-compiler-plugin:2.3.2:compile (default-compile) @ oxtrust-client ---
[INFO] No sources to compile
[INFO] 
[INFO] --- maven-resources-plugin:2.6:resources (default-resources) @ oxtrust-client ---
[INFO] Using 'UTF-8' encoding to copy filtered resources.
[INFO] skip non existing resourceDirectory /home/jenkins/.jenkins/jobs/oxTrust/workspace/client/src/main/resources
[INFO] 
[INFO] --- maven-compiler-plugin:2.3.2:compile (default-compile) @ oxtrust-client ---
[INFO] No sources to compile
[INFO] 
[INFO] --- maven-resources-plugin:2.6:testResources (default-testResources) @ oxtrust-client ---
[INFO] Using 'UTF-8' encoding to copy filtered resources.
[INFO] skip non existing resourceDirectory /home/jenkins/.jenkins/jobs/oxTrust/workspace/client/src/test/resources
[INFO] 
[INFO] --- maven-compiler-plugin:2.3.2:testCompile (default-testCompile) @ oxtrust-client ---
[INFO] No sources to compile
[INFO] 
[INFO] --- maven-surefire-plugin:2.19.1:test (default-test) @ oxtrust-client ---
[INFO] No tests to run.
[INFO] 
[INFO] --- maven-jar-plugin:2.4:jar (default-jar) @ oxtrust-client ---
[WARNING] JAR will be empty - no content was marked for inclusion!
[INFO] Building jar: /home/jenkins/.jenkins/jobs/oxTrust/workspace/client/target/oxtrust-client-4.4.0-SNAPSHOT.jar
[INFO] 
[INFO] --- maven-jar-plugin:2.4:test-jar (default) @ oxtrust-client ---
[WARNING] JAR will be empty - no content was marked for inclusion!
[INFO] Building jar: /home/jenkins/.jenkins/jobs/oxTrust/workspace/client/target/oxtrust-client-4.4.0-SNAPSHOT-tests.jar
[INFO] 
[INFO] --- maven-install-plugin:2.3.1:install (default-install) @ oxtrust-client ---
[INFO] Installing /home/jenkins/.jenkins/jobs/oxTrust/workspace/client/target/oxtrust-client-4.4.0-SNAPSHOT.jar to /var/www/html/maven/org/gluu/oxtrust-client/4.4.0-SNAPSHOT/oxtrust-client-4.4.0-SNAPSHOT.jar
[INFO] Installing /home/jenkins/.jenkins/jobs/oxTrust/workspace/client/pom.xml to /var/www/html/maven/org/gluu/oxtrust-client/4.4.0-SNAPSHOT/oxtrust-client-4.4.0-SNAPSHOT.pom
[INFO] Installing /home/jenkins/.jenkins/jobs/oxTrust/workspace/client/target/oxtrust-client-4.4.0-SNAPSHOT-tests.jar to /var/www/html/maven/org/gluu/oxtrust-client/4.4.0-SNAPSHOT/oxtrust-client-4.4.0-SNAPSHOT-tests.jar
[INFO] 
[INFO] --- findbugs-maven-plugin:3.0.4:findbugs (default-cli) @ oxtrust-client ---
[INFO] 
[INFO] --- maven-site-plugin:2.1.1:site (default-site) @ oxtrust-client ---
[INFO]                                                                         
[INFO] ------------------------------------------------------------------------
[INFO] Building oxTrust Service 4.4.0-SNAPSHOT
[INFO] ------------------------------------------------------------------------
Downloading: https://repository.jboss.org/nexus/content/groups/public-jboss/org/gluu/oxcore-radius/4.4.0-SNAPSHOT/maven-metadata.xml
Downloading: https://maven.gluu.org/maven/org/gluu/oxcore-radius/4.4.0-SNAPSHOT/maven-metadata.xml
Downloading: https://repo1.maven.org/maven2/org/gluu/oxcore-radius/4.4.0-SNAPSHOT/maven-metadata.xml
Downloading: https://build.shibboleth.net/nexus/content/repositories/releases/org/gluu/oxcore-radius/4.4.0-SNAPSHOT/maven-metadata.xml
             
             
             
             
[INFO] 
[INFO] --- maven-clean-plugin:2.5:clean (default-clean) @ oxtrust-service ---
[INFO] Deleting /home/jenkins/.jenkins/jobs/oxTrust/workspace/service/target
[INFO] 
[INFO] --- maven-resources-plugin:2.6:resources (default-resources) @ oxtrust-service ---
[INFO] Using 'UTF-8' encoding to copy filtered resources.
[INFO] Copying 1 resource
[INFO] 
[INFO] --- maven-compiler-plugin:2.3.2:compile (default-compile) @ oxtrust-service ---
[INFO] Compiling 87 source files to /home/jenkins/.jenkins/jobs/oxTrust/workspace/service/target/classes
[INFO] 
[INFO] --- maven-resources-plugin:2.6:resources (default-resources) @ oxtrust-service ---
[INFO] Using 'UTF-8' encoding to copy filtered resources.
[INFO] Copying 1 resource
[INFO] 
[INFO] --- maven-compiler-plugin:2.3.2:compile (default-compile) @ oxtrust-service ---
[INFO] Nothing to compile - all classes are up to date
[INFO] 
[INFO] --- maven-resources-plugin:2.6:testResources (default-testResources) @ oxtrust-service ---
[INFO] Using 'UTF-8' encoding to copy filtered resources.
[INFO] skip non existing resourceDirectory /home/jenkins/.jenkins/jobs/oxTrust/workspace/service/src/test/resources
[INFO] 
[INFO] --- maven-compiler-plugin:2.3.2:testCompile (default-testCompile) @ oxtrust-service ---
[INFO] No sources to compile
[INFO] 
[INFO] --- maven-surefire-plugin:2.19.1:test (default-test) @ oxtrust-service ---
[INFO] No tests to run.
[INFO] 
[INFO] --- maven-jar-plugin:2.4:jar (default-jar) @ oxtrust-service ---
[INFO] Building jar: /home/jenkins/.jenkins/jobs/oxTrust/workspace/service/target/oxtrust-service-4.4.0-SNAPSHOT.jar
[INFO] 
[INFO] --- maven-jar-plugin:2.4:test-jar (default) @ oxtrust-service ---
[WARNING] JAR will be empty - no content was marked for inclusion!
[INFO] Building jar: /home/jenkins/.jenkins/jobs/oxTrust/workspace/service/target/oxtrust-service-4.4.0-SNAPSHOT-tests.jar
[INFO] 
[INFO] --- maven-install-plugin:2.3.1:install (default-install) @ oxtrust-service ---
[INFO] Installing /home/jenkins/.jenkins/jobs/oxTrust/workspace/service/target/oxtrust-service-4.4.0-SNAPSHOT.jar to /var/www/html/maven/org/gluu/oxtrust-service/4.4.0-SNAPSHOT/oxtrust-service-4.4.0-SNAPSHOT.jar
[INFO] Installing /home/jenkins/.jenkins/jobs/oxTrust/workspace/service/pom.xml to /var/www/html/maven/org/gluu/oxtrust-service/4.4.0-SNAPSHOT/oxtrust-service-4.4.0-SNAPSHOT.pom
[INFO] Installing /home/jenkins/.jenkins/jobs/oxTrust/workspace/service/target/oxtrust-service-4.4.0-SNAPSHOT-tests.jar to /var/www/html/maven/org/gluu/oxtrust-service/4.4.0-SNAPSHOT/oxtrust-service-4.4.0-SNAPSHOT-tests.jar
[INFO] 
[INFO] --- findbugs-maven-plugin:3.0.4:findbugs (default-cli) @ oxtrust-service ---
[INFO] Fork Value is true
     [java] The following classes needed for analysis were missing:
     [java]   java.lang.Object
     [java]   java.io.Serializable
     [java]   java.io.FilenameFilter
     [java]   java.lang.annotation.Annotation
     [java]   java.lang.Exception
     [java]   java.lang.RuntimeException
     [java]   java.lang.Enum
     [java]   java.util.function.Function
     [java]   java.util.function.Supplier
     [java]   java.util.function.Predicate
     [java]   java.lang.Cloneable
     [java]   java.lang.Class
     [java]   java.lang.StringBuilder
     [java]   java.util.Arrays
     [java]   java.util.List
     [java]   java.util.ArrayList
     [java]   java.util.Date
     [java]   java.lang.Throwable
     [java]   java.lang.String
     [java]   java.time.Instant
     [java]   java.util.Iterator
     [java]   java.util.UUID
     [java]   java.lang.Integer
     [java]   java.lang.Boolean
     [java]   java.io.File
     [java]   java.util.Properties
     [java]   java.io.StringWriter
     [java]   java.io.IOException
     [java]   java.lang.ClassLoader
     [java]   java.io.InputStream
     [java]   java.lang.Thread
     [java]   java.net.URLClassLoader
     [java]   java.net.URL
     [java]   java.util.HashSet
     [java]   java.util.Set
     [java]   java.net.JarURLConnection
     [java]   java.util.jar.JarFile
     [java]   java.util.Enumeration
     [java]   java.util.jar.JarEntry
     [java]   java.lang.System
     [java]   java.security.KeyStore
     [java]   java.io.FileInputStream
     [java]   javax.net.ssl.SSLContext
     [java]   java.util.Map
     [java]   java.util.Objects
     [java]   java.util.stream.Stream
     [java]   java.util.Optional
     [java]   java.util.HashMap
     [java]   java.util.Collections
     [java]   java.lang.Iterable
     [java]   java.security.SecureRandom
     [java]   java.lang.Math
     [java]   java.lang.IllegalArgumentException
     [java]   java.io.ByteArrayInputStream
     [java]   java.io.FileOutputStream
     [java]   java.io.ByteArrayOutputStream
     [java]   java.lang.StringBuffer
     [java]   java.time.format.DateTimeFormatter
     [java]   java.time.LocalDateTime
     [java]   java.lang.Package
     [java]   java.text.SimpleDateFormat
     [java]   java.util.LinkedList
     [java]   java.util.Collection
     [java]   java.lang.Long
     [java]   java.lang.reflect.AnnotatedElement
     [java]   java.util.Comparator
     [java]   java.nio.charset.Charset
     [java]   java.io.InputStreamReader
     [java]   java.net.HttpURLConnection
     [java]   java.util.stream.Collectors
     [java]   java.util.concurrent.atomic.AtomicBoolean
     [java]   java.util.concurrent.locks.ReentrantLock
     [java]   java.util.Calendar
     [java]   java.lang.reflect.Method
     [java]   java.security.cert.Certificate
     [java]   java.io.Reader
     [java]   java.security.cert.CertificateFactory
     [java]   java.security.cert.CertPath
     [java]   java.lang.NoSuchFieldError
     [java]   java.lang.UnsatisfiedLinkError
     [java]   java.lang.IllegalAccessError
     [java]   java.lang.IncompatibleClassChangeError
     [java]   java.lang.AbstractMethodError
     [java]   java.lang.ClassFormatError
     [java]   java.lang.VerifyError
     [java]   java.lang.ExceptionInInitializerError
     [java]   java.lang.Error
     [java]   java.lang.NegativeArraySizeException
     [java]   java.lang.ArrayIndexOutOfBoundsException
     [java]   java.lang.NullPointerException
     [java]   java.net.MalformedURLException
     [java]   java.lang.InterruptedException
     [java]   java.lang.invoke.LambdaMetafactory
     [java]   java.lang.invoke.MethodHandles$Lookup
     [java]   java.lang.invoke.MethodHandles
     [java]   java.io.BufferedReader
     [java]   java.security.cert.X509CRL
     [java]   java.security.KeyStoreException
     [java]   java.security.KeyManagementException
     [java]   java.util.Arrays$ArrayList
     [java]   java.lang.NoClassDefFoundError
     [java] Warnings generated: 39
     [java] Missing classes: 82
[INFO] Done FindBugs Analysis....
[INFO] 
[INFO] --- maven-site-plugin:2.1.1:site (default-site) @ oxtrust-service ---
[INFO]                                                                         
[INFO] ------------------------------------------------------------------------
[INFO] Building OpenId authentication module 4.4.0-SNAPSHOT
[INFO] ------------------------------------------------------------------------
Downloading: https://repository.jboss.org/nexus/content/groups/public-jboss/org/gluu/gluu-orm-standalone/4.4.0-SNAPSHOT/maven-metadata.xml
Downloading: https://repo1.maven.org/maven2/org/gluu/gluu-orm-standalone/4.4.0-SNAPSHOT/maven-metadata.xml
Downloading: https://maven.gluu.org/maven/org/gluu/gluu-orm-standalone/4.4.0-SNAPSHOT/maven-metadata.xml
Downloading: https://build.shibboleth.net/nexus/content/repositories/releases/org/gluu/gluu-orm-standalone/4.4.0-SNAPSHOT/maven-metadata.xml
             
             
             
             
Downloading: https://repository.jboss.org/nexus/content/groups/public-jboss/org/gluu/oxcore-standalone/4.4.0-SNAPSHOT/maven-metadata.xml
Downloading: https://maven.gluu.org/maven/org/gluu/oxcore-standalone/4.4.0-SNAPSHOT/maven-metadata.xml
Downloading: https://build.shibboleth.net/nexus/content/repositories/releases/org/gluu/oxcore-standalone/4.4.0-SNAPSHOT/maven-metadata.xml
Downloading: https://repo1.maven.org/maven2/org/gluu/oxcore-standalone/4.4.0-SNAPSHOT/maven-metadata.xml
             
             
             
             
Downloading: https://repo2.maven.org/maven2/org/bouncycastle/org/gluu/gluu-orm-ldap/4.4.0-SNAPSHOT/maven-metadata.xml
             
[WARNING] Could not transfer metadata org.gluu:gluu-orm-ldap:4.4.0-SNAPSHOT/maven-metadata.xml from/to bouncycastle (https://repo2.maven.org/maven2/org/bouncycastle): repo2.maven.org: Name or service not known
[INFO] 
[INFO] --- maven-clean-plugin:2.5:clean (default-clean) @ oxtrust-openid-auth-client ---
[INFO] Deleting /home/jenkins/.jenkins/jobs/oxTrust/workspace/openid-auth-client/target
[INFO] 
[INFO] --- maven-resources-plugin:2.6:resources (default-resources) @ oxtrust-openid-auth-client ---
[INFO] Using 'UTF-8' encoding to copy filtered resources.
[INFO] skip non existing resourceDirectory /home/jenkins/.jenkins/jobs/oxTrust/workspace/openid-auth-client/src/main/resources
[INFO] 
[INFO] --- maven-compiler-plugin:2.3.2:compile (default-compile) @ oxtrust-openid-auth-client ---
[INFO] Compiling 6 source files to /home/jenkins/.jenkins/jobs/oxTrust/workspace/openid-auth-client/target/classes
[INFO] 
[INFO] --- maven-resources-plugin:2.6:resources (default-resources) @ oxtrust-openid-auth-client ---
[INFO] Using 'UTF-8' encoding to copy filtered resources.
[INFO] skip non existing resourceDirectory /home/jenkins/.jenkins/jobs/oxTrust/workspace/openid-auth-client/src/main/resources
[INFO] 
[INFO] --- maven-compiler-plugin:2.3.2:compile (default-compile) @ oxtrust-openid-auth-client ---
[INFO] Nothing to compile - all classes are up to date
[INFO] 
[INFO] --- maven-resources-plugin:2.6:testResources (default-testResources) @ oxtrust-openid-auth-client ---
[INFO] Using 'UTF-8' encoding to copy filtered resources.
[INFO] skip non existing resourceDirectory /home/jenkins/.jenkins/jobs/oxTrust/workspace/openid-auth-client/src/test/resources
[INFO] 
[INFO] --- maven-compiler-plugin:2.3.2:testCompile (default-testCompile) @ oxtrust-openid-auth-client ---
[INFO] No sources to compile
[INFO] 
[INFO] --- maven-surefire-plugin:2.19.1:test (default-test) @ oxtrust-openid-auth-client ---
[INFO] No tests to run.
[INFO] 
[INFO] --- maven-jar-plugin:2.4:jar (default-jar) @ oxtrust-openid-auth-client ---
[INFO] Building jar: /home/jenkins/.jenkins/jobs/oxTrust/workspace/openid-auth-client/target/oxtrust-openid-auth-client-4.4.0-SNAPSHOT.jar
[INFO] 
[INFO] --- maven-jar-plugin:2.4:test-jar (default) @ oxtrust-openid-auth-client ---
[WARNING] JAR will be empty - no content was marked for inclusion!
[INFO] Building jar: /home/jenkins/.jenkins/jobs/oxTrust/workspace/openid-auth-client/target/oxtrust-openid-auth-client-4.4.0-SNAPSHOT-tests.jar
[INFO] 
[INFO] --- maven-install-plugin:2.3.1:install (default-install) @ oxtrust-openid-auth-client ---
[INFO] Installing /home/jenkins/.jenkins/jobs/oxTrust/workspace/openid-auth-client/target/oxtrust-openid-auth-client-4.4.0-SNAPSHOT.jar to /var/www/html/maven/org/gluu/oxtrust-openid-auth-client/4.4.0-SNAPSHOT/oxtrust-openid-auth-client-4.4.0-SNAPSHOT.jar
[INFO] Installing /home/jenkins/.jenkins/jobs/oxTrust/workspace/openid-auth-client/pom.xml to /var/www/html/maven/org/gluu/oxtrust-openid-auth-client/4.4.0-SNAPSHOT/oxtrust-openid-auth-client-4.4.0-SNAPSHOT.pom
[INFO] Installing /home/jenkins/.jenkins/jobs/oxTrust/workspace/openid-auth-client/target/oxtrust-openid-auth-client-4.4.0-SNAPSHOT-tests.jar to /var/www/html/maven/org/gluu/oxtrust-openid-auth-client/4.4.0-SNAPSHOT/oxtrust-openid-auth-client-4.4.0-SNAPSHOT-tests.jar
[INFO] 
[INFO] --- findbugs-maven-plugin:3.0.4:findbugs (default-cli) @ oxtrust-openid-auth-client ---
[INFO] Fork Value is true
     [java] The following classes needed for analysis were missing:
     [java]   java.lang.Object
     [java]   java.lang.RuntimeException
     [java]   java.io.Serializable
     [java]   java.util.HashMap
     [java]   java.util.Collections
     [java]   java.util.Map
     [java]   java.lang.StringBuilder
     [java]   java.util.concurrent.locks.ReentrantLock
     [java]   java.lang.System
     [java]   java.util.Date
     [java]   java.util.Arrays
     [java]   java.lang.Class
     [java]   java.util.Set
     [java]   java.util.Iterator
     [java]   java.util.Map$Entry
     [java]   java.lang.Boolean
     [java]   java.lang.Integer
     [java]   java.util.List
     [java]   java.lang.NoSuchFieldError
     [java]   java.lang.UnsatisfiedLinkError
     [java]   java.lang.String
     [java]   java.lang.IllegalAccessError
     [java]   java.lang.IncompatibleClassChangeError
     [java]   java.lang.AbstractMethodError
     [java]   java.lang.Error
     [java]   java.lang.Exception
     [java]   java.lang.Enum
     [java]   java.io.IOException
     [java] Missing classes: 24
[INFO] Done FindBugs Analysis....
[INFO] 
[INFO] --- maven-site-plugin:2.1.1:site (default-site) @ oxtrust-openid-auth-client ---
[INFO]                                                                         
[INFO] ------------------------------------------------------------------------
[INFO] Building oxTrust Server 4.4.0-SNAPSHOT
[INFO] ------------------------------------------------------------------------
Downloading: https://repository.jboss.org/nexus/content/groups/public-jboss/org/gluu/scim-model/4.4.0-SNAPSHOT/maven-metadata.xml
Downloading: https://build.shibboleth.net/nexus/content/repositories/releases/org/gluu/scim-model/4.4.0-SNAPSHOT/maven-metadata.xml
Downloading: https://maven.gluu.org/maven/org/gluu/scim-model/4.4.0-SNAPSHOT/maven-metadata.xml
Downloading: https://repo1.maven.org/maven2/org/gluu/scim-model/4.4.0-SNAPSHOT/maven-metadata.xml
             
             
             
             
Downloading: https://repository.jboss.org/nexus/content/groups/public-jboss/org/gluu/scim/4.4.0-SNAPSHOT/maven-metadata.xml
Downloading: https://maven.gluu.org/maven/org/gluu/scim/4.4.0-SNAPSHOT/maven-metadata.xml
Downloading: https://repo1.maven.org/maven2/org/gluu/scim/4.4.0-SNAPSHOT/maven-metadata.xml
Downloading: https://build.shibboleth.net/nexus/content/repositories/releases/org/gluu/scim/4.4.0-SNAPSHOT/maven-metadata.xml
             
             
             
             
Downloading: https://maven.gluu.org/maven/org/gluu/oxcore-jsf-util/4.4.0-SNAPSHOT/maven-metadata.xml
Downloading: https://repository.jboss.org/nexus/content/groups/public-jboss/org/gluu/oxcore-jsf-util/4.4.0-SNAPSHOT/maven-metadata.xml
Downloading: https://repo1.maven.org/maven2/org/gluu/oxcore-jsf-util/4.4.0-SNAPSHOT/maven-metadata.xml
Downloading: https://build.shibboleth.net/nexus/content/repositories/releases/org/gluu/oxcore-jsf-util/4.4.0-SNAPSHOT/maven-metadata.xml
             
             
             
             
Downloading: https://repository.jboss.org/nexus/content/groups/public-jboss/org/gluu/oxcore-timer-weld/4.4.0-SNAPSHOT/maven-metadata.xml
Downloading: https://maven.gluu.org/maven/org/gluu/oxcore-timer-weld/4.4.0-SNAPSHOT/maven-metadata.xml
Downloading: https://build.shibboleth.net/nexus/content/repositories/releases/org/gluu/oxcore-timer-weld/4.4.0-SNAPSHOT/maven-metadata.xml
Downloading: https://repo1.maven.org/maven2/org/gluu/oxcore-timer-weld/4.4.0-SNAPSHOT/maven-metadata.xml
             
             
             
             
Downloading: https://maven.gluu.org/maven/org/gluu/security-extension-cdi/4.4.0-SNAPSHOT/maven-metadata.xml
Downloading: https://repository.jboss.org/nexus/content/groups/public-jboss/org/gluu/security-extension-cdi/4.4.0-SNAPSHOT/maven-metadata.xml
Downloading: https://build.shibboleth.net/nexus/content/repositories/releases/org/gluu/security-extension-cdi/4.4.0-SNAPSHOT/maven-metadata.xml
Downloading: https://repo1.maven.org/maven2/org/gluu/security-extension-cdi/4.4.0-SNAPSHOT/maven-metadata.xml
             
             
             
             
Downloading: https://maven.gluu.org/maven/org/gluu/exception-extension-cdi/4.4.0-SNAPSHOT/maven-metadata.xml
Downloading: https://repo1.maven.org/maven2/org/gluu/exception-extension-cdi/4.4.0-SNAPSHOT/maven-metadata.xml
Downloading: https://repository.jboss.org/nexus/content/groups/public-jboss/org/gluu/exception-extension-cdi/4.4.0-SNAPSHOT/maven-metadata.xml
Downloading: https://build.shibboleth.net/nexus/content/repositories/releases/org/gluu/exception-extension-cdi/4.4.0-SNAPSHOT/maven-metadata.xml
             
             
             
             
[INFO] 
[INFO] --- maven-clean-plugin:2.5:clean (default-clean) @ oxtrust-server ---
[INFO] Deleting /home/jenkins/.jenkins/jobs/oxTrust/workspace/server/target
[INFO] 
[INFO] --- buildnumber-maven-plugin:1.1:create (default) @ oxtrust-server ---
[INFO] Checking for local modifications: skipped.
[INFO] Updating project files from SCM: skipped.
[INFO] Executing: /bin/sh -c cd /home/jenkins/.jenkins/jobs/oxTrust/workspace/server && git rev-parse --verify HEAD
[INFO] Working directory: /home/jenkins/.jenkins/jobs/oxTrust/workspace/server
[INFO] Storing buildNumber: 1c748d71b019c4317d167431ffb26bf3c7bfe2d5 at timestamp: 1640111935774
[INFO] Executing: /bin/sh -c cd /home/jenkins/.jenkins/jobs/oxTrust/workspace/server && git rev-parse --verify HEAD
[INFO] Working directory: /home/jenkins/.jenkins/jobs/oxTrust/workspace/server
[INFO] Storing buildScmBranch: UNKNOWN
[INFO] 
[INFO] --- git-commit-id-plugin:2.2.6:revision (get-the-git-infos) @ oxtrust-server ---
[INFO] 
[INFO] --- maven-resources-plugin:2.6:resources (default-resources) @ oxtrust-server ---
[INFO] Using 'UTF-8' encoding to copy filtered resources.
[INFO] Copying 109 resources
[INFO] 
[INFO] --- maven-compiler-plugin:2.3.2:compile (default-compile) @ oxtrust-server ---
[INFO] Compiling 179 source files to /home/jenkins/.jenkins/jobs/oxTrust/workspace/server/target/classes
[INFO] 
[INFO] --- maven-jar-plugin:2.4:jar (make-a-jar) @ oxtrust-server ---
[INFO] Building jar: /home/jenkins/.jenkins/jobs/oxTrust/workspace/server/target/oxtrust-server.jar
[INFO] 
[INFO] --- buildnumber-maven-plugin:1.1:create (default) @ oxtrust-server ---
[INFO] Checking for local modifications: skipped.
[INFO] Updating project files from SCM: skipped.
[INFO] Executing: /bin/sh -c cd /home/jenkins/.jenkins/jobs/oxTrust/workspace/server && git rev-parse --verify HEAD
[INFO] Working directory: /home/jenkins/.jenkins/jobs/oxTrust/workspace/server
[INFO] Storing buildNumber: 1c748d71b019c4317d167431ffb26bf3c7bfe2d5 at timestamp: 1640111939978
[INFO] Executing: /bin/sh -c cd /home/jenkins/.jenkins/jobs/oxTrust/workspace/server && git rev-parse --verify HEAD
[INFO] Working directory: /home/jenkins/.jenkins/jobs/oxTrust/workspace/server
[INFO] Storing buildScmBranch: UNKNOWN
[INFO] 
[INFO] --- git-commit-id-plugin:2.2.6:revision (get-the-git-infos) @ oxtrust-server ---
[INFO] 
[INFO] --- maven-resources-plugin:2.6:resources (default-resources) @ oxtrust-server ---
[INFO] Using 'UTF-8' encoding to copy filtered resources.
[INFO] Copying 109 resources
[INFO] 
[INFO] --- maven-compiler-plugin:2.3.2:compile (default-compile) @ oxtrust-server ---
[INFO] Nothing to compile - all classes are up to date
[INFO] 
[INFO] --- maven-jar-plugin:2.4:jar (make-a-jar) @ oxtrust-server ---
[INFO] Building jar: /home/jenkins/.jenkins/jobs/oxTrust/workspace/server/target/oxtrust-server.jar
[INFO] 
[INFO] --- maven-resources-plugin:2.6:testResources (default-testResources) @ oxtrust-server ---
[INFO] Using 'UTF-8' encoding to copy filtered resources.
[INFO] Copying 96 resources
[INFO] Copying 6 resources
[INFO] 
[INFO] --- maven-resources-plugin:2.6:copy-resources (prepare-configuration-files) @ oxtrust-server ---
[INFO] Using 'UTF-8' encoding to copy filtered resources.
[INFO] Copying 98 resources
[INFO] 
[INFO] --- maven-compiler-plugin:2.3.2:testCompile (default-testCompile) @ oxtrust-server ---
[INFO] Compiling 13 source files to /home/jenkins/.jenkins/jobs/oxTrust/workspace/server/target/test-classes
[INFO] 
[INFO] --- maven-surefire-plugin:2.19.1:test (default-test) @ oxtrust-server ---

-------------------------------------------------------
 T E S T S
-------------------------------------------------------
Running TestSuite
Invoked init test suite method
2021-12-21 18:39:06,777 INFO  [main] [org.reflections.Reflections] (Reflections.java:229) - Reflections took 115 ms to scan 1 urls, producing 8 keys and 13 values 
Dec 21, 2021 6:39:06 PM org.eu.ingwar.tools.arquillian.extension.suite.DeploymentClassFinder getDeploymentClassFromAnnotation
INFO: arquillian-suite-deployment: Found class annotated with @ArquillianSuiteDeployment: org.gluu.oxtrust.action.ConfigurableTest
Dec 21, 2021 6:39:06 PM org.jboss.arquillian.container.impl.MapObject populate
WARNING: Configuration contain properties not supported by the backing object org.jboss.arquillian.container.jetty.embedded_9.JettyEmbeddedConfiguration
Unused property entries: {javaVmArguments=-Xms256m -Xmx512m -XX:MaxPermSize=256m}
Supported property names: [tempDirectory, dumpServerAfterStart, mimeTypes, bindHttpPort, idleTimeoutMillis, headerBufferSize, defaultsDescriptor, classloaderBehavior, configurationClasses, bindAddress, realmProperties, httpConfiguration]
Dec 21, 2021 6:39:06 PM org.eclipse.jetty.util.log.Log initialized
INFO: Logging initialized @4118ms to org.eclipse.jetty.util.log.JavaUtilLog
Dec 21, 2021 6:39:07 PM org.jboss.arquillian.container.jetty.embedded_9.JettyEmbeddedContainer start
INFO: Starting Jetty Embedded Server 9.4.9.v20180320 [id:1013620810]
Dec 21, 2021 6:39:07 PM org.eclipse.jetty.server.Server doStart
INFO: jetty-9.4.9.v20180320; built: 2018-03-20T12:21:10Z; git: 1f8159b1e4a42d3f79997021ea1609f2fbac6de5; jvm 11.0.7+10-LTS
Dec 21, 2021 6:39:07 PM org.eclipse.jetty.server.AbstractConnector doStart
INFO: Started ServerConnector@71dfcf21{HTTP/1.1,[http/1.1]}{localhost:9980}
Dec 21, 2021 6:39:07 PM org.eclipse.jetty.server.Server doStart
INFO: Started @4415ms
Dec 21, 2021 6:39:11 PM org.jboss.arquillian.container.jetty.embedded_9.ArquillianAppProvider createApp
INFO: Webapp archive location: file:/home/jenkins/.jenkins/jobs/oxTrust/workspace/server/target/arquillian-jetty-temp/export5010157106166431948oxtrust.war
Dec 21, 2021 6:39:12 PM org.eclipse.jetty.annotations.AnnotationConfiguration scanForAnnotations
INFO: Scanning elapsed time=200ms
Dec 21, 2021 6:39:12 PM org.eclipse.jetty.webapp.StandardDescriptorProcessor visitServlet
INFO: NO JSP Support for /export5010157106166431948oxtrust, did not find org.eclipse.jetty.jsp.JettyJspServlet
Dec 21, 2021 6:39:13 PM org.eclipse.jetty.webapp.WebAppContext doStart
WARNING: Failed startup of context o.e.j.w.WebAppContext@246df37b{/export5010157106166431948oxtrust,file:///tmp/jetty-localhost-9980-export5010157106166431948oxtrust.war-_export5010157106166431948oxtrust-any-12599462194015910140.dir/webapp/,UNAVAILABLE}{/home/jenkins/.jenkins/jobs/oxTrust/workspace/server/target/arquillian-jetty-temp/export5010157106166431948oxtrust.war}
javax.xml.stream.FactoryConfigurationError: Provider for class javax.xml.stream.XMLInputFactory cannot be created
	at java.xml/javax.xml.stream.FactoryFinder.findServiceProvider(FactoryFinder.java:366)
	at java.xml/javax.xml.stream.FactoryFinder.find(FactoryFinder.java:309)
	at java.xml/javax.xml.stream.FactoryFinder.find(FactoryFinder.java:222)
	at java.xml/javax.xml.stream.XMLInputFactory.newInstance(XMLInputFactory.java:161)
	at org.jboss.weld.xml.BeansXmlStreamParser.parse(BeansXmlStreamParser.java:136)
	at org.jboss.weld.bootstrap.WeldBootstrap.parse(WeldBootstrap.java:136)
	at org.jboss.weld.environment.deployment.discovery.AbstractBeanArchiveScanner.parseBeansXml(AbstractBeanArchiveScanner.java:46)
	at org.jboss.weld.environment.deployment.discovery.DefaultBeanArchiveScanner.scan(DefaultBeanArchiveScanner.java:76)
	at org.jboss.weld.environment.servlet.deployment.WebAppBeanArchiveScanner.scan(WebAppBeanArchiveScanner.java:73)
	at org.jboss.weld.environment.deployment.discovery.AbstractDiscoveryStrategy.performDiscovery(AbstractDiscoveryStrategy.java:113)
	at org.jboss.weld.environment.servlet.WeldServletLifecycle.createDeployment(WeldServletLifecycle.java:303)
	at org.jboss.weld.environment.servlet.WeldServletLifecycle.initialize(WeldServletLifecycle.java:157)
	at org.jboss.weld.environment.servlet.EnhancedListener.onStartup(EnhancedListener.java:62)
	at org.eclipse.jetty.plus.annotation.ContainerInitializer.callStartup(ContainerInitializer.java:140)
	at org.eclipse.jetty.annotations.ServletContainerInitializersStarter.doStart(ServletContainerInitializersStarter.java:64)
	at org.eclipse.jetty.util.component.AbstractLifeCycle.start(AbstractLifeCycle.java:68)
	at org.eclipse.jetty.servlet.ServletContextHandler.startContext(ServletContextHandler.java:355)
	at org.eclipse.jetty.webapp.WebAppContext.startWebapp(WebAppContext.java:1497)
	at org.eclipse.jetty.webapp.WebAppContext.startContext(WebAppContext.java:1459)
	at org.eclipse.jetty.server.handler.ContextHandler.doStart(ContextHandler.java:785)
	at org.eclipse.jetty.servlet.ServletContextHandler.doStart(ServletContextHandler.java:287)
	at org.eclipse.jetty.webapp.WebAppContext.doStart(WebAppContext.java:545)
	at org.eclipse.jetty.util.component.AbstractLifeCycle.start(AbstractLifeCycle.java:68)
	at org.eclipse.jetty.deploy.bindings.StandardStarter.processBinding(StandardStarter.java:46)
	at org.eclipse.jetty.deploy.AppLifeCycle.runBindings(AppLifeCycle.java:192)
	at org.eclipse.jetty.deploy.DeploymentManager.requestAppGoal(DeploymentManager.java:505)
	at org.eclipse.jetty.deploy.DeploymentManager.addApp(DeploymentManager.java:151)
	at org.jboss.arquillian.container.jetty.embedded_9.JettyEmbeddedContainer.deploy(JettyEmbeddedContainer.java:295)
	at org.jboss.arquillian.container.impl.client.container.ContainerDeployController$3.call(ContainerDeployController.java:151)
	at org.jboss.arquillian.container.impl.client.container.ContainerDeployController$3.call(ContainerDeployController.java:118)
	at org.jboss.arquillian.container.impl.client.container.ContainerDeployController.executeOperation(ContainerDeployController.java:239)
	at org.jboss.arquillian.container.impl.client.container.ContainerDeployController.deploy(ContainerDeployController.java:118)
	at java.base/jdk.internal.reflect.NativeMethodAccessorImpl.invoke0(Native Method)
	at java.base/jdk.internal.reflect.NativeMethodAccessorImpl.invoke(NativeMethodAccessorImpl.java:62)
	at java.base/jdk.internal.reflect.DelegatingMethodAccessorImpl.invoke(DelegatingMethodAccessorImpl.java:43)
	at java.base/java.lang.reflect.Method.invoke(Method.java:566)
	at org.jboss.arquillian.core.impl.ObserverImpl.invoke(ObserverImpl.java:86)
	at org.jboss.arquillian.core.impl.EventContextImpl.invokeObservers(EventContextImpl.java:103)
	at org.jboss.arquillian.core.impl.EventContextImpl.proceed(EventContextImpl.java:90)
	at org.jboss.arquillian.container.impl.client.ContainerDeploymentContextHandler.createDeploymentContext(ContainerDeploymentContextHandler.java:71)
	at java.base/jdk.internal.reflect.NativeMethodAccessorImpl.invoke0(Native Method)
	at java.base/jdk.internal.reflect.NativeMethodAccessorImpl.invoke(NativeMethodAccessorImpl.java:62)
	at java.base/jdk.internal.reflect.DelegatingMethodAccessorImpl.invoke(DelegatingMethodAccessorImpl.java:43)
	at java.base/java.lang.reflect.Method.invoke(Method.java:566)
	at org.jboss.arquillian.core.impl.ObserverImpl.invoke(ObserverImpl.java:86)
	at org.jboss.arquillian.core.impl.EventContextImpl.proceed(EventContextImpl.java:95)
	at org.jboss.arquillian.container.impl.client.ContainerDeploymentContextHandler.createContainerContext(ContainerDeploymentContextHandler.java:54)
	at java.base/jdk.internal.reflect.NativeMethodAccessorImpl.invoke0(Native Method)
	at java.base/jdk.internal.reflect.NativeMethodAccessorImpl.invoke(NativeMethodAccessorImpl.java:62)
	at java.base/jdk.internal.reflect.DelegatingMethodAccessorImpl.invoke(DelegatingMethodAccessorImpl.java:43)
	at java.base/java.lang.reflect.Method.invoke(Method.java:566)
	at org.jboss.arquillian.core.impl.ObserverImpl.invoke(ObserverImpl.java:86)
	at org.jboss.arquillian.core.impl.EventContextImpl.proceed(EventContextImpl.java:95)
	at org.jboss.arquillian.container.impl.client.container.DeploymentExceptionHandler.verifyExpectedExceptionDuringDeploy(DeploymentExceptionHandler.java:47)
	at java.base/jdk.internal.reflect.NativeMethodAccessorImpl.invoke0(Native Method)
	at java.base/jdk.internal.reflect.NativeMethodAccessorImpl.invoke(NativeMethodAccessorImpl.java:62)
	at java.base/jdk.internal.reflect.DelegatingMethodAccessorImpl.invoke(DelegatingMethodAccessorImpl.java:43)
	at java.base/java.lang.reflect.Method.invoke(Method.java:566)
	at org.jboss.arquillian.core.impl.ObserverImpl.invoke(ObserverImpl.java:86)
	at org.jboss.arquillian.core.impl.EventContextImpl.proceed(EventContextImpl.java:95)
	at org.jboss.arquillian.core.impl.ManagerImpl.fire(ManagerImpl.java:133)
	at org.jboss.arquillian.core.impl.ManagerImpl.fire(ManagerImpl.java:105)
	at org.jboss.arquillian.core.impl.EventImpl.fire(EventImpl.java:62)
	at org.jboss.arquillian.container.impl.client.container.ContainerDeployController$1.perform(ContainerDeployController.java:92)
	at org.jboss.arquillian.container.impl.client.container.ContainerDeployController$1.perform(ContainerDeployController.java:77)
	at org.jboss.arquillian.container.impl.client.container.ContainerDeployController.forEachDeployment(ContainerDeployController.java:232)
	at org.jboss.arquillian.container.impl.client.container.ContainerDeployController.forEachManagedDeployment(ContainerDeployController.java:212)
	at org.jboss.arquillian.container.impl.client.container.ContainerDeployController.deployManaged(ContainerDeployController.java:77)
	at java.base/jdk.internal.reflect.NativeMethodAccessorImpl.invoke0(Native Method)
	at java.base/jdk.internal.reflect.NativeMethodAccessorImpl.invoke(NativeMethodAccessorImpl.java:62)
	at java.base/jdk.internal.reflect.DelegatingMethodAccessorImpl.invoke(DelegatingMethodAccessorImpl.java:43)
	at java.base/java.lang.reflect.Method.invoke(Method.java:566)
	at org.jboss.arquillian.core.impl.ObserverImpl.invoke(ObserverImpl.java:86)
	at org.jboss.arquillian.core.impl.EventContextImpl.invokeObservers(EventContextImpl.java:103)
	at org.jboss.arquillian.core.impl.EventContextImpl.proceed(EventContextImpl.java:90)
	at org.eu.ingwar.tools.arquillian.extension.suite.SuiteDeployer.blockDeployManagedDeploymentsWhenNeeded(SuiteDeployer.java:95)
	at java.base/jdk.internal.reflect.NativeMethodAccessorImpl.invoke0(Native Method)
	at java.base/jdk.internal.reflect.NativeMethodAccessorImpl.invoke(NativeMethodAccessorImpl.java:62)
	at java.base/jdk.internal.reflect.DelegatingMethodAccessorImpl.invoke(DelegatingMethodAccessorImpl.java:43)
	at java.base/java.lang.reflect.Method.invoke(Method.java:566)
	at org.jboss.arquillian.core.impl.ObserverImpl.invoke(ObserverImpl.java:86)
	at org.jboss.arquillian.core.impl.EventContextImpl.proceed(EventContextImpl.java:95)
	at org.jboss.arquillian.core.impl.ManagerImpl.fire(ManagerImpl.java:133)
	at org.jboss.arquillian.core.impl.ManagerImpl.fire(ManagerImpl.java:105)
	at org.jboss.arquillian.core.impl.EventImpl.fire(EventImpl.java:62)
	at org.jboss.arquillian.container.test.impl.client.ContainerEventController.execute(ContainerEventController.java:96)
	at java.base/jdk.internal.reflect.NativeMethodAccessorImpl.invoke0(Native Method)
	at java.base/jdk.internal.reflect.NativeMethodAccessorImpl.invoke(NativeMethodAccessorImpl.java:62)
	at java.base/jdk.internal.reflect.DelegatingMethodAccessorImpl.invoke(DelegatingMethodAccessorImpl.java:43)
	at java.base/java.lang.reflect.Method.invoke(Method.java:566)
	at org.jboss.arquillian.core.impl.ObserverImpl.invoke(ObserverImpl.java:86)
	at org.jboss.arquillian.core.impl.EventContextImpl.invokeObservers(EventContextImpl.java:103)
	at org.jboss.arquillian.core.impl.EventContextImpl.proceed(EventContextImpl.java:90)
	at org.jboss.arquillian.test.impl.TestContextHandler.createClassContext(TestContextHandler.java:83)
	at java.base/jdk.internal.reflect.NativeMethodAccessorImpl.invoke0(Native Method)
	at java.base/jdk.internal.reflect.NativeMethodAccessorImpl.invoke(NativeMethodAccessorImpl.java:62)
	at java.base/jdk.internal.reflect.DelegatingMethodAccessorImpl.invoke(DelegatingMethodAccessorImpl.java:43)
	at java.base/java.lang.reflect.Method.invoke(Method.java:566)
	at org.jboss.arquillian.core.impl.ObserverImpl.invoke(ObserverImpl.java:86)
	at org.jboss.arquillian.core.impl.EventContextImpl.proceed(EventContextImpl.java:95)
	at org.jboss.arquillian.test.impl.TestContextHandler.createSuiteContext(TestContextHandler.java:69)
	at java.base/jdk.internal.reflect.NativeMethodAccessorImpl.invoke0(Native Method)
	at java.base/jdk.internal.reflect.NativeMethodAccessorImpl.invoke(NativeMethodAccessorImpl.java:62)
	at java.base/jdk.internal.reflect.DelegatingMethodAccessorImpl.invoke(DelegatingMethodAccessorImpl.java:43)
	at java.base/java.lang.reflect.Method.invoke(Method.java:566)
	at org.jboss.arquillian.core.impl.ObserverImpl.invoke(ObserverImpl.java:86)
	at org.jboss.arquillian.core.impl.EventContextImpl.proceed(EventContextImpl.java:95)
	at org.jboss.arquillian.core.impl.ManagerImpl.fire(ManagerImpl.java:133)
	at org.jboss.arquillian.core.impl.ManagerImpl.fire(ManagerImpl.java:105)
	at org.jboss.arquillian.test.impl.EventTestRunnerAdaptor.beforeClass(EventTestRunnerAdaptor.java:89)
	at org.jboss.arquillian.testng.Arquillian.arquillianBeforeClass(Arquillian.java:99)
	at java.base/jdk.internal.reflect.NativeMethodAccessorImpl.invoke0(Native Method)
	at java.base/jdk.internal.reflect.NativeMethodAccessorImpl.invoke(NativeMethodAccessorImpl.java:62)
	at java.base/jdk.internal.reflect.DelegatingMethodAccessorImpl.invoke(DelegatingMethodAccessorImpl.java:43)
	at java.base/java.lang.reflect.Method.invoke(Method.java:566)
	at org.testng.internal.MethodInvocationHelper.invokeMethod(MethodInvocationHelper.java:124)
	at org.testng.internal.MethodInvocationHelper.invokeMethodConsideringTimeout(MethodInvocationHelper.java:59)
	at org.testng.internal.Invoker.invokeConfigurationMethod(Invoker.java:458)
	at org.testng.internal.Invoker.invokeConfigurations(Invoker.java:222)
	at org.testng.internal.Invoker.invokeConfigurations(Invoker.java:142)
	at org.testng.internal.TestMethodWorker.invokeBeforeClassMethods(TestMethodWorker.java:168)
	at org.testng.internal.TestMethodWorker.run(TestMethodWorker.java:105)
	at org.testng.TestRunner.privateRun(TestRunner.java:648)
	at org.testng.TestRunner.run(TestRunner.java:505)
	at org.testng.SuiteRunner.runTest(SuiteRunner.java:455)
	at org.testng.SuiteRunner.runSequentially(SuiteRunner.java:450)
	at org.testng.SuiteRunner.privateRun(SuiteRunner.java:415)
	at org.testng.SuiteRunner.run(SuiteRunner.java:364)
	at org.testng.SuiteRunnerWorker.runSuite(SuiteRunnerWorker.java:52)
	at org.testng.SuiteRunnerWorker.run(SuiteRunnerWorker.java:84)
	at org.testng.TestNG.runSuitesSequentially(TestNG.java:1208)
	at org.testng.TestNG.runSuitesLocally(TestNG.java:1137)
	at org.testng.TestNG.runSuites(TestNG.java:1049)
	at org.testng.TestNG.run(TestNG.java:1017)
	at org.apache.maven.surefire.testng.TestNGExecutor.run(TestNGExecutor.java:281)
	at org.apache.maven.surefire.testng.TestNGXmlTestSuite.execute(TestNGXmlTestSuite.java:75)
	at org.apache.maven.surefire.testng.TestNGProvider.invoke(TestNGProvider.java:121)
	at org.apache.maven.surefire.booter.ForkedBooter.invokeProviderInSameClassLoader(ForkedBooter.java:290)
	at org.apache.maven.surefire.booter.ForkedBooter.runSuitesInProcess(ForkedBooter.java:242)
	at org.apache.maven.surefire.booter.ForkedBooter.main(ForkedBooter.java:121)
Caused by: java.lang.RuntimeException: Provider for class javax.xml.stream.XMLInputFactory cannot be created
	at java.xml/javax.xml.stream.FactoryFinder.findServiceProvider(FactoryFinder.java:363)
	... 139 more
Caused by: java.util.ServiceConfigurationError: javax.xml.stream.XMLInputFactory: Provider com.fasterxml.aalto.stax.InputFactoryImpl not found
	at java.base/java.util.ServiceLoader.fail(ServiceLoader.java:588)
	at java.base/java.util.ServiceLoader$LazyClassPathLookupIterator.nextProviderClass(ServiceLoader.java:1211)
	at java.base/java.util.ServiceLoader$LazyClassPathLookupIterator.hasNextService(ServiceLoader.java:1220)
	at java.base/java.util.ServiceLoader$LazyClassPathLookupIterator.hasNext(ServiceLoader.java:1264)
	at java.base/java.util.ServiceLoader$2.hasNext(ServiceLoader.java:1299)
	at java.base/java.util.ServiceLoader$3.hasNext(ServiceLoader.java:1384)
	at java.xml/javax.xml.stream.FactoryFinder$1.run(FactoryFinder.java:348)
	at java.base/java.security.AccessController.doPrivileged(Native Method)
	at java.xml/javax.xml.stream.FactoryFinder.findServiceProvider(FactoryFinder.java:337)
	... 139 more

Dec 21, 2021 6:39:13 PM org.eclipse.jetty.server.handler.ContextHandler doStop
INFO: Stopped o.e.j.w.WebAppContext@246df37b{/export5010157106166431948oxtrust,null,UNAVAILABLE}{/home/jenkins/.jenkins/jobs/oxTrust/workspace/server/target/arquillian-jetty-temp/export5010157106166431948oxtrust.war}
Dec 21, 2021 6:39:13 PM org.jboss.arquillian.container.jetty.embedded_9.JettyEmbeddedContainer stop
INFO: Stopping Jetty Embedded Server [id:1013620810]
Dec 21, 2021 6:39:13 PM org.eclipse.jetty.server.AbstractConnector doStop
INFO: Stopped ServerConnector@71dfcf21{HTTP/1.1,[http/1.1]}{localhost:9980}
Tests run: 9, Failures: 1, Errors: 0, Skipped: 4, Time elapsed: 10.073 sec <<< FAILURE! - in TestSuite
arquillianBeforeClass(org.gluu.oxtrust.action.ConfigurationStatusTest)  Time elapsed: 9.709 sec  <<< FAILURE!
org.jboss.arquillian.container.spi.client.container.DeploymentException: Could not deploy oxtrust.war
	at org.jboss.arquillian.container.jetty.embedded_9.JettyEmbeddedContainer.deploy(JettyEmbeddedContainer.java:311)
	at org.jboss.arquillian.container.impl.client.container.ContainerDeployController$3.call(ContainerDeployController.java:151)
	at org.jboss.arquillian.container.impl.client.container.ContainerDeployController$3.call(ContainerDeployController.java:118)
	at org.jboss.arquillian.container.impl.client.container.ContainerDeployController.executeOperation(ContainerDeployController.java:239)
	at org.jboss.arquillian.container.impl.client.container.ContainerDeployController.deploy(ContainerDeployController.java:118)
	at java.base/jdk.internal.reflect.NativeMethodAccessorImpl.invoke0(Native Method)
	at java.base/jdk.internal.reflect.NativeMethodAccessorImpl.invoke(NativeMethodAccessorImpl.java:62)
	at java.base/jdk.internal.reflect.DelegatingMethodAccessorImpl.invoke(DelegatingMethodAccessorImpl.java:43)
	at java.base/java.lang.reflect.Method.invoke(Method.java:566)
	at org.jboss.arquillian.core.impl.ObserverImpl.invoke(ObserverImpl.java:86)
	at org.jboss.arquillian.core.impl.EventContextImpl.invokeObservers(EventContextImpl.java:103)
	at org.jboss.arquillian.core.impl.EventContextImpl.proceed(EventContextImpl.java:90)
	at org.jboss.arquillian.container.impl.client.ContainerDeploymentContextHandler.createDeploymentContext(ContainerDeploymentContextHandler.java:71)
	at java.base/jdk.internal.reflect.NativeMethodAccessorImpl.invoke0(Native Method)
	at java.base/jdk.internal.reflect.NativeMethodAccessorImpl.invoke(NativeMethodAccessorImpl.java:62)
	at java.base/jdk.internal.reflect.DelegatingMethodAccessorImpl.invoke(DelegatingMethodAccessorImpl.java:43)
	at java.base/java.lang.reflect.Method.invoke(Method.java:566)
	at org.jboss.arquillian.core.impl.ObserverImpl.invoke(ObserverImpl.java:86)
	at org.jboss.arquillian.core.impl.EventContextImpl.proceed(EventContextImpl.java:95)
	at org.jboss.arquillian.container.impl.client.ContainerDeploymentContextHandler.createContainerContext(ContainerDeploymentContextHandler.java:54)
	at java.base/jdk.internal.reflect.NativeMethodAccessorImpl.invoke0(Native Method)
	at java.base/jdk.internal.reflect.NativeMethodAccessorImpl.invoke(NativeMethodAccessorImpl.java:62)
	at java.base/jdk.internal.reflect.DelegatingMethodAccessorImpl.invoke(DelegatingMethodAccessorImpl.java:43)
	at java.base/java.lang.reflect.Method.invoke(Method.java:566)
	at org.jboss.arquillian.core.impl.ObserverImpl.invoke(ObserverImpl.java:86)
	at org.jboss.arquillian.core.impl.EventContextImpl.proceed(EventContextImpl.java:95)
	at org.jboss.arquillian.container.impl.client.container.DeploymentExceptionHandler.verifyExpectedExceptionDuringDeploy(DeploymentExceptionHandler.java:47)
	at java.base/jdk.internal.reflect.NativeMethodAccessorImpl.invoke0(Native Method)
	at java.base/jdk.internal.reflect.NativeMethodAccessorImpl.invoke(NativeMethodAccessorImpl.java:62)
	at java.base/jdk.internal.reflect.DelegatingMethodAccessorImpl.invoke(DelegatingMethodAccessorImpl.java:43)
	at java.base/java.lang.reflect.Method.invoke(Method.java:566)
	at org.jboss.arquillian.core.impl.ObserverImpl.invoke(ObserverImpl.java:86)
	at org.jboss.arquillian.core.impl.EventContextImpl.proceed(EventContextImpl.java:95)
	at org.jboss.arquillian.core.impl.ManagerImpl.fire(ManagerImpl.java:133)
	at org.jboss.arquillian.core.impl.ManagerImpl.fire(ManagerImpl.java:105)
	at org.jboss.arquillian.core.impl.EventImpl.fire(EventImpl.java:62)
	at org.jboss.arquillian.container.impl.client.container.ContainerDeployController$1.perform(ContainerDeployController.java:92)
	at org.jboss.arquillian.container.impl.client.container.ContainerDeployController$1.perform(ContainerDeployController.java:77)
	at org.jboss.arquillian.container.impl.client.container.ContainerDeployController.forEachDeployment(ContainerDeployController.java:232)
	at org.jboss.arquillian.container.impl.client.container.ContainerDeployController.forEachManagedDeployment(ContainerDeployController.java:212)
	at org.jboss.arquillian.container.impl.client.container.ContainerDeployController.deployManaged(ContainerDeployController.java:77)
	at java.base/jdk.internal.reflect.NativeMethodAccessorImpl.invoke0(Native Method)
	at java.base/jdk.internal.reflect.NativeMethodAccessorImpl.invoke(NativeMethodAccessorImpl.java:62)
	at java.base/jdk.internal.reflect.DelegatingMethodAccessorImpl.invoke(DelegatingMethodAccessorImpl.java:43)
	at java.base/java.lang.reflect.Method.invoke(Method.java:566)
	at org.jboss.arquillian.core.impl.ObserverImpl.invoke(ObserverImpl.java:86)
	at org.jboss.arquillian.core.impl.EventContextImpl.invokeObservers(EventContextImpl.java:103)
	at org.jboss.arquillian.core.impl.EventContextImpl.proceed(EventContextImpl.java:90)
	at org.eu.ingwar.tools.arquillian.extension.suite.SuiteDeployer.blockDeployManagedDeploymentsWhenNeeded(SuiteDeployer.java:95)
	at java.base/jdk.internal.reflect.NativeMethodAccessorImpl.invoke0(Native Method)
	at java.base/jdk.internal.reflect.NativeMethodAccessorImpl.invoke(NativeMethodAccessorImpl.java:62)
	at java.base/jdk.internal.reflect.DelegatingMethodAccessorImpl.invoke(DelegatingMethodAccessorImpl.java:43)
	at java.base/java.lang.reflect.Method.invoke(Method.java:566)
	at org.jboss.arquillian.core.impl.ObserverImpl.invoke(ObserverImpl.java:86)
	at org.jboss.arquillian.core.impl.EventContextImpl.proceed(EventContextImpl.java:95)
	at org.jboss.arquillian.core.impl.ManagerImpl.fire(ManagerImpl.java:133)
	at org.jboss.arquillian.core.impl.ManagerImpl.fire(ManagerImpl.java:105)
	at org.jboss.arquillian.core.impl.EventImpl.fire(EventImpl.java:62)
	at org.jboss.arquillian.container.test.impl.client.ContainerEventController.execute(ContainerEventController.java:96)
	at java.base/jdk.internal.reflect.NativeMethodAccessorImpl.invoke0(Native Method)
	at java.base/jdk.internal.reflect.NativeMethodAccessorImpl.invoke(NativeMethodAccessorImpl.java:62)
	at java.base/jdk.internal.reflect.DelegatingMethodAccessorImpl.invoke(DelegatingMethodAccessorImpl.java:43)
	at java.base/java.lang.reflect.Method.invoke(Method.java:566)
	at org.jboss.arquillian.core.impl.ObserverImpl.invoke(ObserverImpl.java:86)
	at org.jboss.arquillian.core.impl.EventContextImpl.invokeObservers(EventContextImpl.java:103)
	at org.jboss.arquillian.core.impl.EventContextImpl.proceed(EventContextImpl.java:90)
	at org.jboss.arquillian.test.impl.TestContextHandler.createClassContext(TestContextHandler.java:83)
	at java.base/jdk.internal.reflect.NativeMethodAccessorImpl.invoke0(Native Method)
	at java.base/jdk.internal.reflect.NativeMethodAccessorImpl.invoke(NativeMethodAccessorImpl.java:62)
	at java.base/jdk.internal.reflect.DelegatingMethodAccessorImpl.invoke(DelegatingMethodAccessorImpl.java:43)
	at java.base/java.lang.reflect.Method.invoke(Method.java:566)
	at org.jboss.arquillian.core.impl.ObserverImpl.invoke(ObserverImpl.java:86)
	at org.jboss.arquillian.core.impl.EventContextImpl.proceed(EventContextImpl.java:95)
	at org.jboss.arquillian.test.impl.TestContextHandler.createSuiteContext(TestContextHandler.java:69)
	at java.base/jdk.internal.reflect.NativeMethodAccessorImpl.invoke0(Native Method)
	at java.base/jdk.internal.reflect.NativeMethodAccessorImpl.invoke(NativeMethodAccessorImpl.java:62)
	at java.base/jdk.internal.reflect.DelegatingMethodAccessorImpl.invoke(DelegatingMethodAccessorImpl.java:43)
	at java.base/java.lang.reflect.Method.invoke(Method.java:566)
	at org.jboss.arquillian.core.impl.ObserverImpl.invoke(ObserverImpl.java:86)
	at org.jboss.arquillian.core.impl.EventContextImpl.proceed(EventContextImpl.java:95)
	at org.jboss.arquillian.core.impl.ManagerImpl.fire(ManagerImpl.java:133)
	at org.jboss.arquillian.core.impl.ManagerImpl.fire(ManagerImpl.java:105)
	at org.jboss.arquillian.test.impl.EventTestRunnerAdaptor.beforeClass(EventTestRunnerAdaptor.java:89)
	at org.jboss.arquillian.testng.Arquillian.arquillianBeforeClass(Arquillian.java:99)
	at java.base/jdk.internal.reflect.NativeMethodAccessorImpl.invoke0(Native Method)
	at java.base/jdk.internal.reflect.NativeMethodAccessorImpl.invoke(NativeMethodAccessorImpl.java:62)
	at java.base/jdk.internal.reflect.DelegatingMethodAccessorImpl.invoke(DelegatingMethodAccessorImpl.java:43)
	at java.base/java.lang.reflect.Method.invoke(Method.java:566)
	at org.testng.internal.MethodInvocationHelper.invokeMethod(MethodInvocationHelper.java:124)
	at org.testng.internal.MethodInvocationHelper.invokeMethodConsideringTimeout(MethodInvocationHelper.java:59)
	at org.testng.internal.Invoker.invokeConfigurationMethod(Invoker.java:458)
	at org.testng.internal.Invoker.invokeConfigurations(Invoker.java:222)
	at org.testng.internal.Invoker.invokeConfigurations(Invoker.java:142)
	at org.testng.internal.TestMethodWorker.invokeBeforeClassMethods(TestMethodWorker.java:168)
	at org.testng.internal.TestMethodWorker.run(TestMethodWorker.java:105)
	at org.testng.TestRunner.privateRun(TestRunner.java:648)
	at org.testng.TestRunner.run(TestRunner.java:505)
	at org.testng.SuiteRunner.runTest(SuiteRunner.java:455)
	at org.testng.SuiteRunner.runSequentially(SuiteRunner.java:450)
	at org.testng.SuiteRunner.privateRun(SuiteRunner.java:415)
	at org.testng.SuiteRunner.run(SuiteRunner.java:364)
	at org.testng.SuiteRunnerWorker.runSuite(SuiteRunnerWorker.java:52)
	at org.testng.SuiteRunnerWorker.run(SuiteRunnerWorker.java:84)
	at org.testng.TestNG.runSuitesSequentially(TestNG.java:1208)
	at org.testng.TestNG.runSuitesLocally(TestNG.java:1137)
	at org.testng.TestNG.runSuites(TestNG.java:1049)
	at org.testng.TestNG.run(TestNG.java:1017)
	at org.apache.maven.surefire.testng.TestNGExecutor.run(TestNGExecutor.java:281)
	at org.apache.maven.surefire.testng.TestNGXmlTestSuite.execute(TestNGXmlTestSuite.java:75)
	at org.apache.maven.surefire.testng.TestNGProvider.invoke(TestNGProvider.java:121)
	at org.apache.maven.surefire.booter.ForkedBooter.invokeProviderInSameClassLoader(ForkedBooter.java:290)
	at org.apache.maven.surefire.booter.ForkedBooter.runSuitesInProcess(ForkedBooter.java:242)
	at org.apache.maven.surefire.booter.ForkedBooter.main(ForkedBooter.java:121)
Caused by: java.lang.NullPointerException
	at org.eclipse.jetty.servlet.ServletHolder.getContextPath(ServletHolder.java:763)
	at org.jboss.arquillian.container.jetty.embedded_9.JettyEmbeddedContainer.deploy(JettyEmbeddedContainer.java:305)
	... 112 more


Results :

Failed tests: 
  ConfigurationStatusTest>Arquillian.arquillianBeforeClass:99 ยป Deployment Could...

Tests run: 9, Failures: 1, Errors: 0, Skipped: 4

[INFO] ------------------------------------------------------------------------
[INFO] Reactor Summary:
[INFO] 
[INFO] oxTrust ............................................ SUCCESS [  2.851 s]
[INFO] oxTrust static resources ........................... SUCCESS [  1.240 s]
[INFO] oxTrust configuration .............................. SUCCESS [  0.523 s]
[INFO] oxTrust Model library .............................. SUCCESS [ 17.539 s]
[INFO] oxTrust Client library ............................. SUCCESS [  0.368 s]
[INFO] oxTrust Service .................................... SUCCESS [ 11.088 s]
[INFO] OpenId authentication module ....................... SUCCESS [  4.374 s]
[INFO] oxTrust Server ..................................... FAILURE [ 20.251 s]
[INFO] OpenId authentication module for Saml .............. SKIPPED
[INFO] OpenId authentication module for CAS ............... SKIPPED
[INFO] oxTrust Server Test ................................ SKIPPED
[INFO] API Server ......................................... SKIPPED
[INFO] ------------------------------------------------------------------------
[INFO] BUILD FAILURE
[INFO] ------------------------------------------------------------------------
[INFO] Total time: 59.712 s
[INFO] Finished at: 2021-12-21T18:39:13+00:00
[INFO] Final Memory: 83M/290M
[INFO] ------------------------------------------------------------------------
[ERROR] Failed to execute goal org.apache.maven.plugins:maven-surefire-plugin:2.19.1:test (default-test) on project oxtrust-server: There are test failures.
[ERROR] 
[ERROR] Please refer to /home/jenkins/.jenkins/jobs/oxTrust/workspace/server/target/surefire-reports for the individual test results.
[ERROR] -> [Help 1]
[ERROR] 
[ERROR] To see the full stack trace of the errors, re-run Maven with the -e switch.
[ERROR] Re-run Maven using the -X switch to enable full debug logging.
[ERROR] 
[ERROR] For more information about the errors and possible solutions, please read the following articles:
[ERROR] [Help 1] http://cwiki.apache.org/confluence/display/MAVEN/MojoFailureException
[ERROR] 
[ERROR] After correcting the problems, you can resume the build with the command
[ERROR]   mvn <goals> -rf :oxtrust-server
Build step 'Invoke top-level Maven targets' marked build as failure
[FINDBUGS] Skipping publisher since build result is FAILURE
Publishing Javadoc
TestNG Reports Processing: START
Looking for TestNG results report in workspace using pattern: **/testng-results.xml
Saving reports...
Processing '/home/jenkins/.jenkins/jobs/oxTrust/builds/524/testng/testng-results.xml'
TestNG Reports Processing: FINISH
Not sending mail to unregistered user noreply@github.com
Sending e-mails to: support@gluu.org
ERROR: Couldn't connect to host, port: webmail.gluu.org, 465; timeout 60000
com.sun.mail.util.MailConnectException: Couldn't connect to host, port: webmail.gluu.org, 465; timeout 60000;
  nested exception is:
	java.net.SocketTimeoutException: connect timed out
	at com.sun.mail.smtp.SMTPTransport.openServer(SMTPTransport.java:2210)
	at com.sun.mail.smtp.SMTPTransport.protocolConnect(SMTPTransport.java:722)
	at javax.mail.Service.connect(Service.java:310)
	at javax.mail.Service.connect(Service.java:169)
	at javax.mail.Service.connect(Service.java:118)
	at javax.mail.Transport.send0(Transport.java:188)
	at javax.mail.Transport.send(Transport.java:118)
	at hudson.tasks.MailSender.run(MailSender.java:130)
	at hudson.tasks.Mailer.perform(Mailer.java:176)
	at hudson.tasks.Mailer.perform(Mailer.java:139)
	at hudson.tasks.BuildStepMonitor$1.perform(BuildStepMonitor.java:20)
	at hudson.model.AbstractBuild$AbstractBuildExecution.perform(AbstractBuild.java:741)
	at hudson.model.AbstractBuild$AbstractBuildExecution.performAllBuildSteps(AbstractBuild.java:690)
	at hudson.model.Build$BuildExecution.post2(Build.java:186)
	at hudson.model.AbstractBuild$AbstractBuildExecution.post(AbstractBuild.java:635)
	at hudson.model.Run.execute(Run.java:1905)
	at hudson.model.FreeStyleBuild.run(FreeStyleBuild.java:43)
	at hudson.model.ResourceController.execute(ResourceController.java:97)
	at hudson.model.Executor.run(Executor.java:428)
Caused by: java.net.SocketTimeoutException: connect timed out
	at java.net.PlainSocketImpl.socketConnect(Native Method)
	at java.net.AbstractPlainSocketImpl.doConnect(AbstractPlainSocketImpl.java:350)
	at java.net.AbstractPlainSocketImpl.connectToAddress(AbstractPlainSocketImpl.java:206)
	at java.net.AbstractPlainSocketImpl.connect(AbstractPlainSocketImpl.java:188)
	at java.net.SocksSocketImpl.connect(SocksSocketImpl.java:392)
	at java.net.Socket.connect(Socket.java:589)
	at com.sun.mail.util.SocketFetcher.createSocket(SocketFetcher.java:333)
	at com.sun.mail.util.SocketFetcher.getSocket(SocketFetcher.java:193)
	at com.sun.mail.smtp.SMTPTransport.openServer(SMTPTransport.java:2160)
	... 18 more
[Boolean condition] checking [true] against [^(1|y|yes|t|true|on|run)$] (origin token: $DEPLOY_BUILD)
Run condition [Boolean condition] enabling perform for step [Builder to mark whether executed]
Finished: FAILURE