FailedConsole Output

Started by upstream project "oxCore" build number 1413
originally caused by:
 Started by upstream project "CE Build 4.2.3.sp2" build number 7
 originally caused by:
  Started by user Yuriy Movchan
Running as SYSTEM
Building on master in workspace /home/jenkins/.jenkins/jobs/oxTrust/workspace
The recommended git tool is: NONE
No credentials specified
 > git rev-parse --is-inside-work-tree # timeout=10
Fetching changes from the remote Git repository
 > git config remote.origin.url https://github.com/GluuFederation/oxTrust # timeout=10
Fetching upstream changes from https://github.com/GluuFederation/oxTrust
 > git --version # timeout=10
 > git --version # 'git version 1.8.3.1'
 > git fetch --tags --progress https://github.com/GluuFederation/oxTrust +refs/heads/*:refs/remotes/origin/* # timeout=10
 > git rev-parse refs/remotes/origin/master^{commit} # timeout=10
 > git rev-parse refs/remotes/origin/origin/master^{commit} # timeout=10
Checking out Revision 82cb5bfba301ebb96f61e6417e9ba4c707bcc00c (refs/remotes/origin/master)
 > git config core.sparsecheckout # timeout=10
 > git checkout -f 82cb5bfba301ebb96f61e6417e9ba4c707bcc00c # timeout=10
Commit message: "chore: update libs"
 > git rev-list --no-walk 82cb5bfba301ebb96f61e6417e9ba4c707bcc00c # timeout=10
Run condition [Boolean condition] enabling prebuild for step [Trigger/call builds on other projects]
[workspace] $ /bin/bash /opt/jetty/temp/jenkins4060265176258138636.sh
Cloning into 'oxHudsonProfiles'...
[workspace] $ /home/jenkins/.jenkins/tools/hudson.tasks.Maven_MavenInstallation/maven_3.3.9/bin/mvn -DDEPLOY_BUILD=true -DVERSION_NAME=master -DPROFILE_NAME=ce-dev5.gluu.org -DDEVELOPMENT_BUILD=false -DMAVEN_SKIP_TESTS=false -Dpython.import.site=false -DPYTHON_HOME=/opt/jython -Dcfg=ce-dev5.gluu.org -Dmaven.test.skip=false -Ddevelopment-build=false -Dskip.qa.test=true clean compile install findbugs:findbugs site
[INFO] Scanning for projects...
[WARNING] 
[WARNING] Some problems were encountered while building the effective model for org.gluu:oxtrust-model:jar:4.4.0-SNAPSHOT
[WARNING] 'dependencies.dependency.(groupId:artifactId:type:classifier)' must be unique: com.fasterxml.jackson.core:jackson-annotations:jar -> duplicate declaration of version (?) @ org.gluu:oxtrust-model:[unknown-version], /home/jenkins/.jenkins/jobs/oxTrust/workspace/model/pom.xml, line 85, column 15
[WARNING] 'dependencies.dependency.(groupId:artifactId:type:classifier)' must be unique: com.fasterxml.jackson.core:jackson-core:jar -> duplicate declaration of version (?) @ org.gluu:oxtrust-model:[unknown-version], /home/jenkins/.jenkins/jobs/oxTrust/workspace/model/pom.xml, line 89, column 15
[WARNING] 'dependencies.dependency.(groupId:artifactId:type:classifier)' must be unique: com.fasterxml.jackson.core:jackson-databind:jar -> duplicate declaration of version (?) @ org.gluu:oxtrust-model:[unknown-version], /home/jenkins/.jenkins/jobs/oxTrust/workspace/model/pom.xml, line 93, column 15
[WARNING] 
[WARNING] Some problems were encountered while building the effective model for org.gluu:oxtrust-service:jar:4.4.0-SNAPSHOT
[WARNING] 'build.plugins.plugin.version' for org.apache.maven.plugins:maven-javadoc-plugin is missing. @ org.gluu:oxtrust-service:[unknown-version], /home/jenkins/.jenkins/jobs/oxTrust/workspace/service/pom.xml, line 42, column 12
[WARNING] 
[WARNING] Some problems were encountered while building the effective model for org.gluu:oxtrust-server:war:4.4.0-SNAPSHOT
[WARNING] 'build.plugins.plugin.version' for org.apache.maven.plugins:maven-javadoc-plugin is missing. @ org.gluu:oxtrust-server:[unknown-version], /home/jenkins/.jenkins/jobs/oxTrust/workspace/server/pom.xml, line 69, column 12
[WARNING] 
[WARNING] Some problems were encountered while building the effective model for org.gluu:oxtrust-openid-auth-client:jar:4.4.0-SNAPSHOT
[WARNING] 'build.plugins.plugin.version' for org.apache.maven.plugins:maven-javadoc-plugin is missing. @ org.gluu:oxtrust-openid-auth-client:[unknown-version], /home/jenkins/.jenkins/jobs/oxTrust/workspace/openid-auth-client/pom.xml, line 22, column 21
[WARNING] 
[WARNING] Some problems were encountered while building the effective model for org.gluu:oxtrust-saml-openid-auth-client:jar:4.4.0-SNAPSHOT
[WARNING] 'build.plugins.plugin.version' for org.apache.maven.plugins:maven-javadoc-plugin is missing. @ org.gluu:oxtrust-saml-openid-auth-client:[unknown-version], /home/jenkins/.jenkins/jobs/oxTrust/workspace/saml-openid-auth-client/pom.xml, line 22, column 21
[WARNING] 
[WARNING] Some problems were encountered while building the effective model for org.gluu:oxtrust-cas-openid-auth-client:jar:4.4.0-SNAPSHOT
[WARNING] 'build.plugins.plugin.version' for org.apache.maven.plugins:maven-javadoc-plugin is missing. @ org.gluu:oxtrust-cas-openid-auth-client:[unknown-version], /home/jenkins/.jenkins/jobs/oxTrust/workspace/cas-openid-auth-client/pom.xml, line 27, column 12
[WARNING] 
[WARNING] It is highly recommended to fix these problems because they threaten the stability of your build.
[WARNING] 
[WARNING] For this reason, future Maven versions might no longer support building such malformed projects.
[WARNING] 
[INFO] ------------------------------------------------------------------------
[INFO] Reactor Build Order:
[INFO] 
[INFO] oxTrust
[INFO] oxTrust static resources
[INFO] oxTrust configuration
[INFO] oxTrust Model library
[INFO] oxTrust Client library
[INFO] oxTrust Service
[INFO] OpenId authentication module
[INFO] oxTrust Server
[INFO] OpenId authentication module for Saml
[INFO] OpenId authentication module for CAS
[INFO] oxTrust Server Test
[INFO] API Server
[INFO]                                                                         
[INFO] ------------------------------------------------------------------------
[INFO] Building oxTrust 4.4.0-SNAPSHOT
[INFO] ------------------------------------------------------------------------
[INFO] 
[INFO] --- maven-clean-plugin:2.5:clean (default-clean) @ oxtrust ---
[INFO] Deleting /home/jenkins/.jenkins/jobs/oxTrust/workspace/target
[INFO] 
[INFO] --- maven-install-plugin:2.3.1:install (default-install) @ oxtrust ---
[INFO] Installing /home/jenkins/.jenkins/jobs/oxTrust/workspace/pom.xml to /var/www/html/maven/org/gluu/oxtrust/4.4.0-SNAPSHOT/oxtrust-4.4.0-SNAPSHOT.pom
[INFO] 
[INFO] --- findbugs-maven-plugin:3.0.4:findbugs (default-cli) @ oxtrust ---
WARNING: An illegal reflective access operation has occurred
WARNING: Illegal reflective access by org.codehaus.groovy.reflection.CachedClass$3$1 (file:/var/www/html/maven/org/codehaus/groovy/groovy/2.4.7/groovy-2.4.7.jar) to method java.lang.Object.finalize()
WARNING: Please consider reporting this to the maintainers of org.codehaus.groovy.reflection.CachedClass$3$1
WARNING: Use --illegal-access=warn to enable warnings of further illegal reflective access operations
WARNING: All illegal access operations will be denied in a future release
[INFO] 
[INFO] --- maven-site-plugin:2.1.1:site (default-site) @ oxtrust ---
[INFO]                                                                         
[INFO] ------------------------------------------------------------------------
[INFO] Building oxTrust static resources 4.4.0-SNAPSHOT
[INFO] ------------------------------------------------------------------------
[INFO] 
[INFO] --- maven-clean-plugin:2.5:clean (default-clean) @ oxtrust-static ---
[INFO] Deleting /home/jenkins/.jenkins/jobs/oxTrust/workspace/static/target
[INFO] 
[INFO] --- maven-resources-plugin:2.6:resources (default-resources) @ oxtrust-static ---
[INFO] Using 'UTF-8' encoding to copy filtered resources.
[INFO] Copying 337 resources
[INFO] 
[INFO] --- maven-compiler-plugin:2.3.2:compile (default-compile) @ oxtrust-static ---
[INFO] No sources to compile
[INFO] 
[INFO] --- maven-resources-plugin:2.6:resources (default-resources) @ oxtrust-static ---
[INFO] Using 'UTF-8' encoding to copy filtered resources.
[INFO] Copying 337 resources
[INFO] 
[INFO] --- maven-compiler-plugin:2.3.2:compile (default-compile) @ oxtrust-static ---
[INFO] No sources to compile
[INFO] 
[INFO] --- maven-resources-plugin:2.6:testResources (default-testResources) @ oxtrust-static ---
[INFO] Using 'UTF-8' encoding to copy filtered resources.
[INFO] skip non existing resourceDirectory /home/jenkins/.jenkins/jobs/oxTrust/workspace/static/src/test/resources
[INFO] 
[INFO] --- maven-compiler-plugin:2.3.2:testCompile (default-testCompile) @ oxtrust-static ---
[INFO] No sources to compile
[INFO] 
[INFO] --- maven-surefire-plugin:2.19.1:test (default-test) @ oxtrust-static ---
[INFO] No tests to run.
[INFO] 
[INFO] --- maven-jar-plugin:2.4:jar (default-jar) @ oxtrust-static ---
[INFO] Building jar: /home/jenkins/.jenkins/jobs/oxTrust/workspace/static/target/oxtrust-static-4.4.0-SNAPSHOT.jar
[INFO] 
[INFO] --- maven-jar-plugin:2.4:test-jar (default) @ oxtrust-static ---
[WARNING] JAR will be empty - no content was marked for inclusion!
[INFO] Building jar: /home/jenkins/.jenkins/jobs/oxTrust/workspace/static/target/oxtrust-static-4.4.0-SNAPSHOT-tests.jar
[INFO] 
[INFO] --- maven-install-plugin:2.3.1:install (default-install) @ oxtrust-static ---
[INFO] Installing /home/jenkins/.jenkins/jobs/oxTrust/workspace/static/target/oxtrust-static-4.4.0-SNAPSHOT.jar to /var/www/html/maven/org/gluu/oxtrust-static/4.4.0-SNAPSHOT/oxtrust-static-4.4.0-SNAPSHOT.jar
[INFO] Installing /home/jenkins/.jenkins/jobs/oxTrust/workspace/static/pom.xml to /var/www/html/maven/org/gluu/oxtrust-static/4.4.0-SNAPSHOT/oxtrust-static-4.4.0-SNAPSHOT.pom
[INFO] Installing /home/jenkins/.jenkins/jobs/oxTrust/workspace/static/target/oxtrust-static-4.4.0-SNAPSHOT-tests.jar to /var/www/html/maven/org/gluu/oxtrust-static/4.4.0-SNAPSHOT/oxtrust-static-4.4.0-SNAPSHOT-tests.jar
[INFO] 
[INFO] --- findbugs-maven-plugin:3.0.4:findbugs (default-cli) @ oxtrust-static ---
[INFO] 
[INFO] --- maven-site-plugin:2.1.1:site (default-site) @ oxtrust-static ---
[INFO]                                                                         
[INFO] ------------------------------------------------------------------------
[INFO] Building oxTrust configuration 4.4.0-SNAPSHOT
[INFO] ------------------------------------------------------------------------
[INFO] 
[INFO] --- maven-clean-plugin:2.5:clean (default-clean) @ oxtrust-configuration ---
[INFO] Deleting /home/jenkins/.jenkins/jobs/oxTrust/workspace/configuration/target
[INFO] 
[INFO] --- maven-resources-plugin:2.6:resources (default-resources) @ oxtrust-configuration ---
[INFO] Using 'UTF-8' encoding to copy filtered resources.
[INFO] Copying 3 resources
[INFO] Copying 32 resources
[INFO] 
[INFO] --- maven-compiler-plugin:2.3.2:compile (default-compile) @ oxtrust-configuration ---
[INFO] No sources to compile
[INFO] 
[INFO] --- maven-resources-plugin:2.6:resources (default-resources) @ oxtrust-configuration ---
[INFO] Using 'UTF-8' encoding to copy filtered resources.
[INFO] Copying 3 resources
[INFO] Copying 32 resources
[INFO] 
[INFO] --- maven-compiler-plugin:2.3.2:compile (default-compile) @ oxtrust-configuration ---
[INFO] No sources to compile
[INFO] 
[INFO] --- maven-resources-plugin:2.6:testResources (default-testResources) @ oxtrust-configuration ---
[INFO] Using 'UTF-8' encoding to copy filtered resources.
[INFO] skip non existing resourceDirectory /home/jenkins/.jenkins/jobs/oxTrust/workspace/configuration/src/test/resources
[INFO] 
[INFO] --- maven-compiler-plugin:2.3.2:testCompile (default-testCompile) @ oxtrust-configuration ---
[INFO] No sources to compile
[INFO] 
[INFO] --- maven-surefire-plugin:2.19.1:test (default-test) @ oxtrust-configuration ---
[INFO] No tests to run.
[INFO] 
[INFO] --- maven-jar-plugin:2.4:jar (default-jar) @ oxtrust-configuration ---
[INFO] Building jar: /home/jenkins/.jenkins/jobs/oxTrust/workspace/configuration/target/oxtrust-configuration-4.4.0-SNAPSHOT.jar
[INFO] 
[INFO] --- maven-jar-plugin:2.4:test-jar (default) @ oxtrust-configuration ---
[WARNING] JAR will be empty - no content was marked for inclusion!
[INFO] Building jar: /home/jenkins/.jenkins/jobs/oxTrust/workspace/configuration/target/oxtrust-configuration-4.4.0-SNAPSHOT-tests.jar
[INFO] 
[INFO] --- maven-install-plugin:2.3.1:install (default-install) @ oxtrust-configuration ---
[INFO] Installing /home/jenkins/.jenkins/jobs/oxTrust/workspace/configuration/target/oxtrust-configuration-4.4.0-SNAPSHOT.jar to /var/www/html/maven/org/gluu/oxtrust-configuration/4.4.0-SNAPSHOT/oxtrust-configuration-4.4.0-SNAPSHOT.jar
[INFO] Installing /home/jenkins/.jenkins/jobs/oxTrust/workspace/configuration/pom.xml to /var/www/html/maven/org/gluu/oxtrust-configuration/4.4.0-SNAPSHOT/oxtrust-configuration-4.4.0-SNAPSHOT.pom
[INFO] Installing /home/jenkins/.jenkins/jobs/oxTrust/workspace/configuration/target/oxtrust-configuration-4.4.0-SNAPSHOT-tests.jar to /var/www/html/maven/org/gluu/oxtrust-configuration/4.4.0-SNAPSHOT/oxtrust-configuration-4.4.0-SNAPSHOT-tests.jar
[INFO] 
[INFO] --- findbugs-maven-plugin:3.0.4:findbugs (default-cli) @ oxtrust-configuration ---
[INFO] 
[INFO] --- maven-site-plugin:2.1.1:site (default-site) @ oxtrust-configuration ---
[INFO]                                                                         
[INFO] ------------------------------------------------------------------------
[INFO] Building oxTrust Model library 4.4.0-SNAPSHOT
[INFO] ------------------------------------------------------------------------
Downloading: https://repo2.maven.org/maven2/org/bouncycastle/org/gluu/gluu-core-bom/4.4.0-SNAPSHOT/maven-metadata.xml

[WARNING] Could not transfer metadata org.gluu:gluu-core-bom:4.4.0-SNAPSHOT/maven-metadata.xml from/to bouncycastle (https://repo2.maven.org/maven2/org/bouncycastle): repo2.maven.org: Name or service not known
Downloading: https://repo2.maven.org/maven2/org/bouncycastle/org/gluu/gluu-orm-annotation/4.4.0-SNAPSHOT/maven-metadata.xml

[WARNING] Could not transfer metadata org.gluu:gluu-orm-annotation:4.4.0-SNAPSHOT/maven-metadata.xml from/to bouncycastle (https://repo2.maven.org/maven2/org/bouncycastle): repo2.maven.org
[WARNING] Failure to transfer org.gluu:gluu-orm-annotation:4.4.0-SNAPSHOT/maven-metadata.xml from https://repo2.maven.org/maven2/org/bouncycastle was cached in the local repository, resolution will not be reattempted until the update interval of bouncycastle has elapsed or updates are forced. Original error: Could not transfer metadata org.gluu:gluu-orm-annotation:4.4.0-SNAPSHOT/maven-metadata.xml from/to bouncycastle (https://repo2.maven.org/maven2/org/bouncycastle): repo2.maven.org
Downloading: https://repo2.maven.org/maven2/org/bouncycastle/org/gluu/gluu-orm-parent/4.4.0-SNAPSHOT/maven-metadata.xml

[WARNING] Could not transfer metadata org.gluu:gluu-orm-parent:4.4.0-SNAPSHOT/maven-metadata.xml from/to bouncycastle (https://repo2.maven.org/maven2/org/bouncycastle): repo2.maven.org
Downloading: https://repo2.maven.org/maven2/org/bouncycastle/org/gluu/gluu-orm-model/4.4.0-SNAPSHOT/maven-metadata.xml

[WARNING] Could not transfer metadata org.gluu:gluu-orm-model:4.4.0-SNAPSHOT/maven-metadata.xml from/to bouncycastle (https://repo2.maven.org/maven2/org/bouncycastle): repo2.maven.org
[WARNING] Failure to transfer org.gluu:gluu-orm-model:4.4.0-SNAPSHOT/maven-metadata.xml from https://repo2.maven.org/maven2/org/bouncycastle was cached in the local repository, resolution will not be reattempted until the update interval of bouncycastle has elapsed or updates are forced. Original error: Could not transfer metadata org.gluu:gluu-orm-model:4.4.0-SNAPSHOT/maven-metadata.xml from/to bouncycastle (https://repo2.maven.org/maven2/org/bouncycastle): repo2.maven.org
Downloading: https://repo2.maven.org/maven2/org/bouncycastle/org/gluu/gluu-orm-util/4.4.0-SNAPSHOT/maven-metadata.xml

[WARNING] Could not transfer metadata org.gluu:gluu-orm-util:4.4.0-SNAPSHOT/maven-metadata.xml from/to bouncycastle (https://repo2.maven.org/maven2/org/bouncycastle): repo2.maven.org
[WARNING] Failure to transfer org.gluu:gluu-orm-util:4.4.0-SNAPSHOT/maven-metadata.xml from https://repo2.maven.org/maven2/org/bouncycastle was cached in the local repository, resolution will not be reattempted until the update interval of bouncycastle has elapsed or updates are forced. Original error: Could not transfer metadata org.gluu:gluu-orm-util:4.4.0-SNAPSHOT/maven-metadata.xml from/to bouncycastle (https://repo2.maven.org/maven2/org/bouncycastle): repo2.maven.org
Downloading: https://repo2.maven.org/maven2/org/bouncycastle/org/gluu/gluu-orm-core/4.4.0-SNAPSHOT/maven-metadata.xml

[WARNING] Could not transfer metadata org.gluu:gluu-orm-core:4.4.0-SNAPSHOT/maven-metadata.xml from/to bouncycastle (https://repo2.maven.org/maven2/org/bouncycastle): repo2.maven.org
[WARNING] Failure to transfer org.gluu:gluu-orm-core:4.4.0-SNAPSHOT/maven-metadata.xml from https://repo2.maven.org/maven2/org/bouncycastle was cached in the local repository, resolution will not be reattempted until the update interval of bouncycastle has elapsed or updates are forced. Original error: Could not transfer metadata org.gluu:gluu-orm-core:4.4.0-SNAPSHOT/maven-metadata.xml from/to bouncycastle (https://repo2.maven.org/maven2/org/bouncycastle): repo2.maven.org
Downloading: https://repo2.maven.org/maven2/org/bouncycastle/org/gluu/gluu-orm-filter/4.4.0-SNAPSHOT/maven-metadata.xml

[WARNING] Could not transfer metadata org.gluu:gluu-orm-filter:4.4.0-SNAPSHOT/maven-metadata.xml from/to bouncycastle (https://repo2.maven.org/maven2/org/bouncycastle): repo2.maven.org
[WARNING] Failure to transfer org.gluu:gluu-orm-filter:4.4.0-SNAPSHOT/maven-metadata.xml from https://repo2.maven.org/maven2/org/bouncycastle was cached in the local repository, resolution will not be reattempted until the update interval of bouncycastle has elapsed or updates are forced. Original error: Could not transfer metadata org.gluu:gluu-orm-filter:4.4.0-SNAPSHOT/maven-metadata.xml from/to bouncycastle (https://repo2.maven.org/maven2/org/bouncycastle): repo2.maven.org
Downloading: https://repo2.maven.org/maven2/org/bouncycastle/org/gluu/gluu-orm-couchbase/4.4.0-SNAPSHOT/maven-metadata.xml

[WARNING] Could not transfer metadata org.gluu:gluu-orm-couchbase:4.4.0-SNAPSHOT/maven-metadata.xml from/to bouncycastle (https://repo2.maven.org/maven2/org/bouncycastle): repo2.maven.org
[WARNING] Failure to transfer org.gluu:gluu-orm-couchbase:4.4.0-SNAPSHOT/maven-metadata.xml from https://repo2.maven.org/maven2/org/bouncycastle was cached in the local repository, resolution will not be reattempted until the update interval of bouncycastle has elapsed or updates are forced. Original error: Could not transfer metadata org.gluu:gluu-orm-couchbase:4.4.0-SNAPSHOT/maven-metadata.xml from/to bouncycastle (https://repo2.maven.org/maven2/org/bouncycastle): repo2.maven.org
Downloading: https://repo2.maven.org/maven2/org/bouncycastle/org/gluu/gluu-orm-spanner/4.4.0-SNAPSHOT/maven-metadata.xml

[WARNING] Could not transfer metadata org.gluu:gluu-orm-spanner:4.4.0-SNAPSHOT/maven-metadata.xml from/to bouncycastle (https://repo2.maven.org/maven2/org/bouncycastle): repo2.maven.org
[WARNING] Failure to transfer org.gluu:gluu-orm-spanner:4.4.0-SNAPSHOT/maven-metadata.xml from https://repo2.maven.org/maven2/org/bouncycastle was cached in the local repository, resolution will not be reattempted until the update interval of bouncycastle has elapsed or updates are forced. Original error: Could not transfer metadata org.gluu:gluu-orm-spanner:4.4.0-SNAPSHOT/maven-metadata.xml from/to bouncycastle (https://repo2.maven.org/maven2/org/bouncycastle): repo2.maven.org
Downloading: https://repo2.maven.org/maven2/org/bouncycastle/org/gluu/gluu-orm-sql/4.4.0-SNAPSHOT/maven-metadata.xml

[WARNING] Could not transfer metadata org.gluu:gluu-orm-sql:4.4.0-SNAPSHOT/maven-metadata.xml from/to bouncycastle (https://repo2.maven.org/maven2/org/bouncycastle): repo2.maven.org
[WARNING] Failure to transfer org.gluu:gluu-orm-sql:4.4.0-SNAPSHOT/maven-metadata.xml from https://repo2.maven.org/maven2/org/bouncycastle was cached in the local repository, resolution will not be reattempted until the update interval of bouncycastle has elapsed or updates are forced. Original error: Could not transfer metadata org.gluu:gluu-orm-sql:4.4.0-SNAPSHOT/maven-metadata.xml from/to bouncycastle (https://repo2.maven.org/maven2/org/bouncycastle): repo2.maven.org
Downloading: https://repo2.maven.org/maven2/org/bouncycastle/org/gluu/gluu-orm-hybrid/4.4.0-SNAPSHOT/maven-metadata.xml

[WARNING] Could not transfer metadata org.gluu:gluu-orm-hybrid:4.4.0-SNAPSHOT/maven-metadata.xml from/to bouncycastle (https://repo2.maven.org/maven2/org/bouncycastle): repo2.maven.org
[WARNING] Failure to transfer org.gluu:gluu-orm-hybrid:4.4.0-SNAPSHOT/maven-metadata.xml from https://repo2.maven.org/maven2/org/bouncycastle was cached in the local repository, resolution will not be reattempted until the update interval of bouncycastle has elapsed or updates are forced. Original error: Could not transfer metadata org.gluu:gluu-orm-hybrid:4.4.0-SNAPSHOT/maven-metadata.xml from/to bouncycastle (https://repo2.maven.org/maven2/org/bouncycastle): repo2.maven.org
Downloading: https://repo2.maven.org/maven2/org/bouncycastle/org/gluu/gluu-orm-cdi/4.4.0-SNAPSHOT/maven-metadata.xml

[WARNING] Could not transfer metadata org.gluu:gluu-orm-cdi:4.4.0-SNAPSHOT/maven-metadata.xml from/to bouncycastle (https://repo2.maven.org/maven2/org/bouncycastle): repo2.maven.org
[WARNING] Failure to transfer org.gluu:gluu-orm-cdi:4.4.0-SNAPSHOT/maven-metadata.xml from https://repo2.maven.org/maven2/org/bouncycastle was cached in the local repository, resolution will not be reattempted until the update interval of bouncycastle has elapsed or updates are forced. Original error: Could not transfer metadata org.gluu:gluu-orm-cdi:4.4.0-SNAPSHOT/maven-metadata.xml from/to bouncycastle (https://repo2.maven.org/maven2/org/bouncycastle): repo2.maven.org
Downloading: https://repo2.maven.org/maven2/org/bouncycastle/org/gluu/oxcore-cache/4.4.0-SNAPSHOT/maven-metadata.xml

[WARNING] Could not transfer metadata org.gluu:oxcore-cache:4.4.0-SNAPSHOT/maven-metadata.xml from/to bouncycastle (https://repo2.maven.org/maven2/org/bouncycastle): repo2.maven.org
[WARNING] Failure to transfer org.gluu:oxcore-cache:4.4.0-SNAPSHOT/maven-metadata.xml from https://repo2.maven.org/maven2/org/bouncycastle was cached in the local repository, resolution will not be reattempted until the update interval of bouncycastle has elapsed or updates are forced. Original error: Could not transfer metadata org.gluu:oxcore-cache:4.4.0-SNAPSHOT/maven-metadata.xml from/to bouncycastle (https://repo2.maven.org/maven2/org/bouncycastle): repo2.maven.org
Downloading: https://repo2.maven.org/maven2/org/bouncycastle/org/gluu/oxcore-script/4.4.0-SNAPSHOT/maven-metadata.xml

[WARNING] Could not transfer metadata org.gluu:oxcore-script:4.4.0-SNAPSHOT/maven-metadata.xml from/to bouncycastle (https://repo2.maven.org/maven2/org/bouncycastle): repo2.maven.org
[WARNING] Failure to transfer org.gluu:oxcore-script:4.4.0-SNAPSHOT/maven-metadata.xml from https://repo2.maven.org/maven2/org/bouncycastle was cached in the local repository, resolution will not be reattempted until the update interval of bouncycastle has elapsed or updates are forced. Original error: Could not transfer metadata org.gluu:oxcore-script:4.4.0-SNAPSHOT/maven-metadata.xml from/to bouncycastle (https://repo2.maven.org/maven2/org/bouncycastle): repo2.maven.org
Downloading: https://repo2.maven.org/maven2/org/bouncycastle/org/gluu/oxcore-cdi/4.4.0-SNAPSHOT/maven-metadata.xml

[WARNING] Could not transfer metadata org.gluu:oxcore-cdi:4.4.0-SNAPSHOT/maven-metadata.xml from/to bouncycastle (https://repo2.maven.org/maven2/org/bouncycastle): repo2.maven.org
[WARNING] Failure to transfer org.gluu:oxcore-cdi:4.4.0-SNAPSHOT/maven-metadata.xml from https://repo2.maven.org/maven2/org/bouncycastle was cached in the local repository, resolution will not be reattempted until the update interval of bouncycastle has elapsed or updates are forced. Original error: Could not transfer metadata org.gluu:oxcore-cdi:4.4.0-SNAPSHOT/maven-metadata.xml from/to bouncycastle (https://repo2.maven.org/maven2/org/bouncycastle): repo2.maven.org
Downloading: https://repo2.maven.org/maven2/org/bouncycastle/org/gluu/oxcore-document-store/4.4.0-SNAPSHOT/maven-metadata.xml

[WARNING] Could not transfer metadata org.gluu:oxcore-document-store:4.4.0-SNAPSHOT/maven-metadata.xml from/to bouncycastle (https://repo2.maven.org/maven2/org/bouncycastle): repo2.maven.org
[WARNING] Failure to transfer org.gluu:oxcore-document-store:4.4.0-SNAPSHOT/maven-metadata.xml from https://repo2.maven.org/maven2/org/bouncycastle was cached in the local repository, resolution will not be reattempted until the update interval of bouncycastle has elapsed or updates are forced. Original error: Could not transfer metadata org.gluu:oxcore-document-store:4.4.0-SNAPSHOT/maven-metadata.xml from/to bouncycastle (https://repo2.maven.org/maven2/org/bouncycastle): repo2.maven.org
Downloading: https://repo2.maven.org/maven2/org/bouncycastle/org/gluu/oxeleven-client/4.4.0-SNAPSHOT/maven-metadata.xml

[WARNING] Could not transfer metadata org.gluu:oxeleven-client:4.4.0-SNAPSHOT/maven-metadata.xml from/to bouncycastle (https://repo2.maven.org/maven2/org/bouncycastle): repo2.maven.org
[WARNING] Failure to transfer org.gluu:oxeleven-client:4.4.0-SNAPSHOT/maven-metadata.xml from https://repo2.maven.org/maven2/org/bouncycastle was cached in the local repository, resolution will not be reattempted until the update interval of bouncycastle has elapsed or updates are forced. Original error: Could not transfer metadata org.gluu:oxeleven-client:4.4.0-SNAPSHOT/maven-metadata.xml from/to bouncycastle (https://repo2.maven.org/maven2/org/bouncycastle): repo2.maven.org
Downloading: https://repo2.maven.org/maven2/org/bouncycastle/org/gluu/oxeleven/4.4.0-SNAPSHOT/maven-metadata.xml

[WARNING] Could not transfer metadata org.gluu:oxeleven:4.4.0-SNAPSHOT/maven-metadata.xml from/to bouncycastle (https://repo2.maven.org/maven2/org/bouncycastle): repo2.maven.org
Downloading: https://repo2.maven.org/maven2/org/bouncycastle/org/gluu/oxeleven-model/4.4.0-SNAPSHOT/maven-metadata.xml

[WARNING] Could not transfer metadata org.gluu:oxeleven-model:4.4.0-SNAPSHOT/maven-metadata.xml from/to bouncycastle (https://repo2.maven.org/maven2/org/bouncycastle): repo2.maven.org
[WARNING] Failure to transfer org.gluu:oxeleven-model:4.4.0-SNAPSHOT/maven-metadata.xml from https://repo2.maven.org/maven2/org/bouncycastle was cached in the local repository, resolution will not be reattempted until the update interval of bouncycastle has elapsed or updates are forced. Original error: Could not transfer metadata org.gluu:oxeleven-model:4.4.0-SNAPSHOT/maven-metadata.xml from/to bouncycastle (https://repo2.maven.org/maven2/org/bouncycastle): repo2.maven.org
[INFO] 
[INFO] --- maven-clean-plugin:2.5:clean (default-clean) @ oxtrust-model ---
[INFO] Deleting /home/jenkins/.jenkins/jobs/oxTrust/workspace/model/target
[INFO] 
[INFO] --- maven-resources-plugin:2.6:resources (default-resources) @ oxtrust-model ---
[INFO] Using 'UTF-8' encoding to copy filtered resources.
[INFO] skip non existing resourceDirectory /home/jenkins/.jenkins/jobs/oxTrust/workspace/model/src/main/resources
[INFO] 
[INFO] --- maven-compiler-plugin:2.3.2:compile (default-compile) @ oxtrust-model ---
[INFO] Compiling 84 source files to /home/jenkins/.jenkins/jobs/oxTrust/workspace/model/target/classes
[INFO] 
[INFO] --- maven-resources-plugin:2.6:resources (default-resources) @ oxtrust-model ---
[INFO] Using 'UTF-8' encoding to copy filtered resources.
[INFO] skip non existing resourceDirectory /home/jenkins/.jenkins/jobs/oxTrust/workspace/model/src/main/resources
[INFO] 
[INFO] --- maven-compiler-plugin:2.3.2:compile (default-compile) @ oxtrust-model ---
[INFO] Nothing to compile - all classes are up to date
[INFO] 
[INFO] --- maven-resources-plugin:2.6:testResources (default-testResources) @ oxtrust-model ---
[INFO] Using 'UTF-8' encoding to copy filtered resources.
[INFO] skip non existing resourceDirectory /home/jenkins/.jenkins/jobs/oxTrust/workspace/model/src/test/resources
[INFO] 
[INFO] --- maven-compiler-plugin:2.3.2:testCompile (default-testCompile) @ oxtrust-model ---
[INFO] No sources to compile
[INFO] 
[INFO] --- maven-surefire-plugin:2.19.1:test (default-test) @ oxtrust-model ---
[INFO] No tests to run.
[INFO] 
[INFO] --- maven-jar-plugin:2.4:jar (default-jar) @ oxtrust-model ---
[INFO] Building jar: /home/jenkins/.jenkins/jobs/oxTrust/workspace/model/target/oxtrust-model-4.4.0-SNAPSHOT.jar
[INFO] 
[INFO] --- maven-jar-plugin:2.4:test-jar (default) @ oxtrust-model ---
[WARNING] JAR will be empty - no content was marked for inclusion!
[INFO] Building jar: /home/jenkins/.jenkins/jobs/oxTrust/workspace/model/target/oxtrust-model-4.4.0-SNAPSHOT-tests.jar
[INFO] 
[INFO] --- maven-install-plugin:2.3.1:install (default-install) @ oxtrust-model ---
[INFO] Installing /home/jenkins/.jenkins/jobs/oxTrust/workspace/model/target/oxtrust-model-4.4.0-SNAPSHOT.jar to /var/www/html/maven/org/gluu/oxtrust-model/4.4.0-SNAPSHOT/oxtrust-model-4.4.0-SNAPSHOT.jar
[INFO] Installing /home/jenkins/.jenkins/jobs/oxTrust/workspace/model/pom.xml to /var/www/html/maven/org/gluu/oxtrust-model/4.4.0-SNAPSHOT/oxtrust-model-4.4.0-SNAPSHOT.pom
[INFO] Installing /home/jenkins/.jenkins/jobs/oxTrust/workspace/model/target/oxtrust-model-4.4.0-SNAPSHOT-tests.jar to /var/www/html/maven/org/gluu/oxtrust-model/4.4.0-SNAPSHOT/oxtrust-model-4.4.0-SNAPSHOT-tests.jar
[INFO] 
[INFO] --- findbugs-maven-plugin:3.0.4:findbugs (default-cli) @ oxtrust-model ---
[INFO] Fork Value is true
     [java] The following classes needed for analysis were missing:
     [java]   java.lang.Object
     [java]   java.lang.Enum
     [java]   java.io.Serializable
     [java]   java.lang.Cloneable
     [java]   java.lang.Comparable
     [java]   java.lang.String
     [java]   java.util.Date
     [java]   java.lang.StringBuilder
     [java]   java.util.List
     [java]   java.util.Map
     [java]   java.lang.StringBuffer
     [java]   java.util.HashMap
     [java]   java.util.ArrayList
     [java]   java.util.Iterator
     [java]   java.util.Arrays
     [java]   java.lang.Integer
     [java]   java.util.Set
     [java]   java.util.Collection
     [java]   java.lang.Boolean
     [java]   java.security.cert.X509Certificate
     [java]   java.security.Principal
     [java]   java.lang.System
     [java]   java.io.File
     [java]   java.util.TreeSet
     [java]   java.lang.IllegalArgumentException
     [java]   java.lang.Math
     [java]   java.time.LocalDate
     [java]   java.time.ZoneId
     [java]   java.time.ZonedDateTime
     [java]   java.lang.Long
     [java]   java.lang.NoSuchFieldError
     [java]   java.lang.UnsatisfiedLinkError
     [java]   java.lang.NoClassDefFoundError
     [java]   java.lang.CloneNotSupportedException
     [java]   java.lang.IllegalAccessError
     [java] Warnings generated: 90
     [java] Missing classes: 29
[INFO] Done FindBugs Analysis....
[INFO] 
[INFO] --- maven-site-plugin:2.1.1:site (default-site) @ oxtrust-model ---
[INFO]                                                                         
[INFO] ------------------------------------------------------------------------
[INFO] Building oxTrust Client library 4.4.0-SNAPSHOT
[INFO] ------------------------------------------------------------------------
Downloading: https://repo2.maven.org/maven2/org/bouncycastle/org/gluu/oxcore-model/4.4.0-SNAPSHOT/maven-metadata.xml

[WARNING] Could not transfer metadata org.gluu:oxcore-model:4.4.0-SNAPSHOT/maven-metadata.xml from/to bouncycastle (https://repo2.maven.org/maven2/org/bouncycastle): repo2.maven.org: Name or service not known
[INFO] 
[INFO] --- maven-clean-plugin:2.5:clean (default-clean) @ oxtrust-client ---
[INFO] Deleting /home/jenkins/.jenkins/jobs/oxTrust/workspace/client/target
[INFO] 
[INFO] --- maven-resources-plugin:2.6:resources (default-resources) @ oxtrust-client ---
[INFO] Using 'UTF-8' encoding to copy filtered resources.
[INFO] skip non existing resourceDirectory /home/jenkins/.jenkins/jobs/oxTrust/workspace/client/src/main/resources
[INFO] 
[INFO] --- maven-compiler-plugin:2.3.2:compile (default-compile) @ oxtrust-client ---
[INFO] No sources to compile
[INFO] 
[INFO] --- maven-resources-plugin:2.6:resources (default-resources) @ oxtrust-client ---
[INFO] Using 'UTF-8' encoding to copy filtered resources.
[INFO] skip non existing resourceDirectory /home/jenkins/.jenkins/jobs/oxTrust/workspace/client/src/main/resources
[INFO] 
[INFO] --- maven-compiler-plugin:2.3.2:compile (default-compile) @ oxtrust-client ---
[INFO] No sources to compile
[INFO] 
[INFO] --- maven-resources-plugin:2.6:testResources (default-testResources) @ oxtrust-client ---
[INFO] Using 'UTF-8' encoding to copy filtered resources.
[INFO] skip non existing resourceDirectory /home/jenkins/.jenkins/jobs/oxTrust/workspace/client/src/test/resources
[INFO] 
[INFO] --- maven-compiler-plugin:2.3.2:testCompile (default-testCompile) @ oxtrust-client ---
[INFO] No sources to compile
[INFO] 
[INFO] --- maven-surefire-plugin:2.19.1:test (default-test) @ oxtrust-client ---
[INFO] No tests to run.
[INFO] 
[INFO] --- maven-jar-plugin:2.4:jar (default-jar) @ oxtrust-client ---
[WARNING] JAR will be empty - no content was marked for inclusion!
[INFO] Building jar: /home/jenkins/.jenkins/jobs/oxTrust/workspace/client/target/oxtrust-client-4.4.0-SNAPSHOT.jar
[INFO] 
[INFO] --- maven-jar-plugin:2.4:test-jar (default) @ oxtrust-client ---
[WARNING] JAR will be empty - no content was marked for inclusion!
[INFO] Building jar: /home/jenkins/.jenkins/jobs/oxTrust/workspace/client/target/oxtrust-client-4.4.0-SNAPSHOT-tests.jar
[INFO] 
[INFO] --- maven-install-plugin:2.3.1:install (default-install) @ oxtrust-client ---
[INFO] Installing /home/jenkins/.jenkins/jobs/oxTrust/workspace/client/target/oxtrust-client-4.4.0-SNAPSHOT.jar to /var/www/html/maven/org/gluu/oxtrust-client/4.4.0-SNAPSHOT/oxtrust-client-4.4.0-SNAPSHOT.jar
[INFO] Installing /home/jenkins/.jenkins/jobs/oxTrust/workspace/client/pom.xml to /var/www/html/maven/org/gluu/oxtrust-client/4.4.0-SNAPSHOT/oxtrust-client-4.4.0-SNAPSHOT.pom
[INFO] Installing /home/jenkins/.jenkins/jobs/oxTrust/workspace/client/target/oxtrust-client-4.4.0-SNAPSHOT-tests.jar to /var/www/html/maven/org/gluu/oxtrust-client/4.4.0-SNAPSHOT/oxtrust-client-4.4.0-SNAPSHOT-tests.jar
[INFO] 
[INFO] --- findbugs-maven-plugin:3.0.4:findbugs (default-cli) @ oxtrust-client ---
[INFO] 
[INFO] --- maven-site-plugin:2.1.1:site (default-site) @ oxtrust-client ---
[INFO]                                                                         
[INFO] ------------------------------------------------------------------------
[INFO] Building oxTrust Service 4.4.0-SNAPSHOT
[INFO] ------------------------------------------------------------------------
[INFO] 
[INFO] --- maven-clean-plugin:2.5:clean (default-clean) @ oxtrust-service ---
[INFO] Deleting /home/jenkins/.jenkins/jobs/oxTrust/workspace/service/target
[INFO] 
[INFO] --- maven-resources-plugin:2.6:resources (default-resources) @ oxtrust-service ---
[INFO] Using 'UTF-8' encoding to copy filtered resources.
[INFO] Copying 1 resource
[INFO] 
[INFO] --- maven-compiler-plugin:2.3.2:compile (default-compile) @ oxtrust-service ---
[INFO] Compiling 87 source files to /home/jenkins/.jenkins/jobs/oxTrust/workspace/service/target/classes
[INFO] 
[INFO] --- maven-resources-plugin:2.6:resources (default-resources) @ oxtrust-service ---
[INFO] Using 'UTF-8' encoding to copy filtered resources.
[INFO] Copying 1 resource
[INFO] 
[INFO] --- maven-compiler-plugin:2.3.2:compile (default-compile) @ oxtrust-service ---
[INFO] Nothing to compile - all classes are up to date
[INFO] 
[INFO] --- maven-resources-plugin:2.6:testResources (default-testResources) @ oxtrust-service ---
[INFO] Using 'UTF-8' encoding to copy filtered resources.
[INFO] skip non existing resourceDirectory /home/jenkins/.jenkins/jobs/oxTrust/workspace/service/src/test/resources
[INFO] 
[INFO] --- maven-compiler-plugin:2.3.2:testCompile (default-testCompile) @ oxtrust-service ---
[INFO] No sources to compile
[INFO] 
[INFO] --- maven-surefire-plugin:2.19.1:test (default-test) @ oxtrust-service ---
[INFO] No tests to run.
[INFO] 
[INFO] --- maven-jar-plugin:2.4:jar (default-jar) @ oxtrust-service ---
[INFO] Building jar: /home/jenkins/.jenkins/jobs/oxTrust/workspace/service/target/oxtrust-service-4.4.0-SNAPSHOT.jar
[INFO] 
[INFO] --- maven-jar-plugin:2.4:test-jar (default) @ oxtrust-service ---
[WARNING] JAR will be empty - no content was marked for inclusion!
[INFO] Building jar: /home/jenkins/.jenkins/jobs/oxTrust/workspace/service/target/oxtrust-service-4.4.0-SNAPSHOT-tests.jar
[INFO] 
[INFO] --- maven-install-plugin:2.3.1:install (default-install) @ oxtrust-service ---
[INFO] Installing /home/jenkins/.jenkins/jobs/oxTrust/workspace/service/target/oxtrust-service-4.4.0-SNAPSHOT.jar to /var/www/html/maven/org/gluu/oxtrust-service/4.4.0-SNAPSHOT/oxtrust-service-4.4.0-SNAPSHOT.jar
[INFO] Installing /home/jenkins/.jenkins/jobs/oxTrust/workspace/service/pom.xml to /var/www/html/maven/org/gluu/oxtrust-service/4.4.0-SNAPSHOT/oxtrust-service-4.4.0-SNAPSHOT.pom
[INFO] Installing /home/jenkins/.jenkins/jobs/oxTrust/workspace/service/target/oxtrust-service-4.4.0-SNAPSHOT-tests.jar to /var/www/html/maven/org/gluu/oxtrust-service/4.4.0-SNAPSHOT/oxtrust-service-4.4.0-SNAPSHOT-tests.jar
[INFO] 
[INFO] --- findbugs-maven-plugin:3.0.4:findbugs (default-cli) @ oxtrust-service ---
[INFO] Fork Value is true
     [java] The following classes needed for analysis were missing:
     [java]   java.lang.Object
     [java]   java.io.Serializable
     [java]   java.io.FilenameFilter
     [java]   java.lang.annotation.Annotation
     [java]   java.lang.Exception
     [java]   java.lang.RuntimeException
     [java]   java.lang.Enum
     [java]   java.util.function.Function
     [java]   java.util.function.Supplier
     [java]   java.util.function.Predicate
     [java]   java.lang.Cloneable
     [java]   java.lang.Class
     [java]   java.lang.StringBuilder
     [java]   java.util.Arrays
     [java]   java.util.List
     [java]   java.util.ArrayList
     [java]   java.util.Date
     [java]   java.lang.Throwable
     [java]   java.lang.String
     [java]   java.time.Instant
     [java]   java.util.Iterator
     [java]   java.util.UUID
     [java]   java.lang.Integer
     [java]   java.lang.Boolean
     [java]   java.io.File
     [java]   java.util.Properties
     [java]   java.io.StringWriter
     [java]   java.io.IOException
     [java]   java.lang.ClassLoader
     [java]   java.io.InputStream
     [java]   java.lang.Thread
     [java]   java.net.URLClassLoader
     [java]   java.net.URL
     [java]   java.util.HashSet
     [java]   java.util.Set
     [java]   java.net.JarURLConnection
     [java]   java.util.jar.JarFile
     [java]   java.util.Enumeration
     [java]   java.util.jar.JarEntry
     [java]   java.lang.System
     [java]   java.security.KeyStore
     [java]   java.io.FileInputStream
     [java]   javax.net.ssl.SSLContext
     [java]   java.util.Map
     [java]   java.util.Objects
     [java]   java.util.stream.Stream
     [java]   java.util.Optional
     [java]   java.util.HashMap
     [java]   java.util.Collections
     [java]   java.lang.Iterable
     [java]   java.security.SecureRandom
     [java]   java.lang.Math
     [java]   java.lang.IllegalArgumentException
     [java]   java.io.ByteArrayInputStream
     [java]   java.io.FileOutputStream
     [java]   java.io.ByteArrayOutputStream
     [java]   java.lang.StringBuffer
     [java]   java.time.format.DateTimeFormatter
     [java]   java.time.LocalDateTime
     [java]   java.lang.Package
     [java]   java.text.SimpleDateFormat
     [java]   java.util.LinkedList
     [java]   java.util.Collection
     [java]   java.lang.Long
     [java]   java.lang.reflect.AnnotatedElement
     [java]   java.util.Comparator
     [java]   java.nio.charset.Charset
     [java]   java.io.InputStreamReader
     [java]   java.net.HttpURLConnection
     [java]   java.util.stream.Collectors
     [java]   java.util.concurrent.atomic.AtomicBoolean
     [java]   java.util.concurrent.locks.ReentrantLock
     [java]   java.util.Calendar
     [java]   java.lang.reflect.Method
     [java]   java.security.cert.Certificate
     [java]   java.io.Reader
     [java]   java.security.cert.CertificateFactory
     [java]   java.security.cert.CertPath
     [java]   java.lang.NoSuchFieldError
     [java]   java.lang.UnsatisfiedLinkError
     [java]   java.lang.IllegalAccessError
     [java]   java.lang.IncompatibleClassChangeError
     [java]   java.lang.AbstractMethodError
     [java]   java.lang.ClassFormatError
     [java]   java.lang.VerifyError
     [java]   java.lang.ExceptionInInitializerError
     [java]   java.lang.Error
     [java]   java.lang.NegativeArraySizeException
     [java]   java.lang.ArrayIndexOutOfBoundsException
     [java]   java.lang.NullPointerException
     [java]   java.net.MalformedURLException
     [java]   java.lang.InterruptedException
     [java]   java.lang.invoke.LambdaMetafactory
     [java]   java.lang.invoke.MethodHandles$Lookup
     [java]   java.lang.invoke.MethodHandles
     [java]   java.io.BufferedReader
     [java]   java.security.cert.X509CRL
     [java]   java.security.KeyStoreException
     [java]   java.security.KeyManagementException
     [java]   java.util.Arrays$ArrayList
     [java]   java.lang.NoClassDefFoundError
     [java] Warnings generated: 39
     [java] Missing classes: 82
[INFO] Done FindBugs Analysis....
[INFO] 
[INFO] --- maven-site-plugin:2.1.1:site (default-site) @ oxtrust-service ---
[INFO]                                                                         
[INFO] ------------------------------------------------------------------------
[INFO] Building OpenId authentication module 4.4.0-SNAPSHOT
[INFO] ------------------------------------------------------------------------
Downloading: https://repo2.maven.org/maven2/org/bouncycastle/org/gluu/gluu-orm-ldap/4.4.0-SNAPSHOT/maven-metadata.xml

[WARNING] Could not transfer metadata org.gluu:gluu-orm-ldap:4.4.0-SNAPSHOT/maven-metadata.xml from/to bouncycastle (https://repo2.maven.org/maven2/org/bouncycastle): repo2.maven.org: Name or service not known
[INFO] 
[INFO] --- maven-clean-plugin:2.5:clean (default-clean) @ oxtrust-openid-auth-client ---
[INFO] Deleting /home/jenkins/.jenkins/jobs/oxTrust/workspace/openid-auth-client/target
[INFO] 
[INFO] --- maven-resources-plugin:2.6:resources (default-resources) @ oxtrust-openid-auth-client ---
[INFO] Using 'UTF-8' encoding to copy filtered resources.
[INFO] skip non existing resourceDirectory /home/jenkins/.jenkins/jobs/oxTrust/workspace/openid-auth-client/src/main/resources
[INFO] 
[INFO] --- maven-compiler-plugin:2.3.2:compile (default-compile) @ oxtrust-openid-auth-client ---
[INFO] Compiling 6 source files to /home/jenkins/.jenkins/jobs/oxTrust/workspace/openid-auth-client/target/classes
[INFO] 
[INFO] --- maven-resources-plugin:2.6:resources (default-resources) @ oxtrust-openid-auth-client ---
[INFO] Using 'UTF-8' encoding to copy filtered resources.
[INFO] skip non existing resourceDirectory /home/jenkins/.jenkins/jobs/oxTrust/workspace/openid-auth-client/src/main/resources
[INFO] 
[INFO] --- maven-compiler-plugin:2.3.2:compile (default-compile) @ oxtrust-openid-auth-client ---
[INFO] Nothing to compile - all classes are up to date
[INFO] 
[INFO] --- maven-resources-plugin:2.6:testResources (default-testResources) @ oxtrust-openid-auth-client ---
[INFO] Using 'UTF-8' encoding to copy filtered resources.
[INFO] skip non existing resourceDirectory /home/jenkins/.jenkins/jobs/oxTrust/workspace/openid-auth-client/src/test/resources
[INFO] 
[INFO] --- maven-compiler-plugin:2.3.2:testCompile (default-testCompile) @ oxtrust-openid-auth-client ---
[INFO] No sources to compile
[INFO] 
[INFO] --- maven-surefire-plugin:2.19.1:test (default-test) @ oxtrust-openid-auth-client ---
[INFO] No tests to run.
[INFO] 
[INFO] --- maven-jar-plugin:2.4:jar (default-jar) @ oxtrust-openid-auth-client ---
[INFO] Building jar: /home/jenkins/.jenkins/jobs/oxTrust/workspace/openid-auth-client/target/oxtrust-openid-auth-client-4.4.0-SNAPSHOT.jar
[INFO] 
[INFO] --- maven-jar-plugin:2.4:test-jar (default) @ oxtrust-openid-auth-client ---
[WARNING] JAR will be empty - no content was marked for inclusion!
[INFO] Building jar: /home/jenkins/.jenkins/jobs/oxTrust/workspace/openid-auth-client/target/oxtrust-openid-auth-client-4.4.0-SNAPSHOT-tests.jar
[INFO] 
[INFO] --- maven-install-plugin:2.3.1:install (default-install) @ oxtrust-openid-auth-client ---
[INFO] Installing /home/jenkins/.jenkins/jobs/oxTrust/workspace/openid-auth-client/target/oxtrust-openid-auth-client-4.4.0-SNAPSHOT.jar to /var/www/html/maven/org/gluu/oxtrust-openid-auth-client/4.4.0-SNAPSHOT/oxtrust-openid-auth-client-4.4.0-SNAPSHOT.jar
[INFO] Installing /home/jenkins/.jenkins/jobs/oxTrust/workspace/openid-auth-client/pom.xml to /var/www/html/maven/org/gluu/oxtrust-openid-auth-client/4.4.0-SNAPSHOT/oxtrust-openid-auth-client-4.4.0-SNAPSHOT.pom
[INFO] Installing /home/jenkins/.jenkins/jobs/oxTrust/workspace/openid-auth-client/target/oxtrust-openid-auth-client-4.4.0-SNAPSHOT-tests.jar to /var/www/html/maven/org/gluu/oxtrust-openid-auth-client/4.4.0-SNAPSHOT/oxtrust-openid-auth-client-4.4.0-SNAPSHOT-tests.jar
[INFO] 
[INFO] --- findbugs-maven-plugin:3.0.4:findbugs (default-cli) @ oxtrust-openid-auth-client ---
[INFO] Fork Value is true
     [java] The following classes needed for analysis were missing:
     [java]   java.lang.Object
     [java]   java.lang.RuntimeException
     [java]   java.io.Serializable
     [java]   java.util.HashMap
     [java]   java.util.Collections
     [java]   java.util.Map
     [java]   java.lang.StringBuilder
     [java]   java.util.concurrent.locks.ReentrantLock
     [java]   java.lang.System
     [java]   java.util.Date
     [java]   java.util.Arrays
     [java]   java.lang.Class
     [java]   java.util.Set
     [java]   java.util.Iterator
     [java]   java.util.Map$Entry
     [java]   java.lang.Boolean
     [java]   java.lang.Integer
     [java]   java.util.List
     [java]   java.lang.NoSuchFieldError
     [java]   java.lang.UnsatisfiedLinkError
     [java]   java.lang.String
     [java]   java.lang.IllegalAccessError
     [java]   java.lang.IncompatibleClassChangeError
     [java]   java.lang.AbstractMethodError
     [java]   java.lang.Error
     [java]   java.lang.Exception
     [java]   java.lang.Enum
     [java]   java.io.IOException
     [java] Missing classes: 24
[INFO] Done FindBugs Analysis....
[INFO] 
[INFO] --- maven-site-plugin:2.1.1:site (default-site) @ oxtrust-openid-auth-client ---
[INFO]                                                                         
[INFO] ------------------------------------------------------------------------
[INFO] Building oxTrust Server 4.4.0-SNAPSHOT
[INFO] ------------------------------------------------------------------------
[INFO] 
[INFO] --- maven-clean-plugin:2.5:clean (default-clean) @ oxtrust-server ---
[INFO] Deleting /home/jenkins/.jenkins/jobs/oxTrust/workspace/server/target
[INFO] 
[INFO] --- buildnumber-maven-plugin:1.1:create (default) @ oxtrust-server ---
[INFO] Checking for local modifications: skipped.
[INFO] Updating project files from SCM: skipped.
[INFO] Executing: /bin/sh -c cd /home/jenkins/.jenkins/jobs/oxTrust/workspace/server && git rev-parse --verify HEAD
[INFO] Working directory: /home/jenkins/.jenkins/jobs/oxTrust/workspace/server
[INFO] Storing buildNumber: 82cb5bfba301ebb96f61e6417e9ba4c707bcc00c at timestamp: 1640007420003
[INFO] Executing: /bin/sh -c cd /home/jenkins/.jenkins/jobs/oxTrust/workspace/server && git rev-parse --verify HEAD
[INFO] Working directory: /home/jenkins/.jenkins/jobs/oxTrust/workspace/server
[INFO] Storing buildScmBranch: UNKNOWN
[INFO] 
[INFO] --- git-commit-id-plugin:2.2.6:revision (get-the-git-infos) @ oxtrust-server ---
[INFO] 
[INFO] --- maven-resources-plugin:2.6:resources (default-resources) @ oxtrust-server ---
[INFO] Using 'UTF-8' encoding to copy filtered resources.
[INFO] Copying 109 resources
[INFO] 
[INFO] --- maven-compiler-plugin:2.3.2:compile (default-compile) @ oxtrust-server ---
[INFO] Compiling 179 source files to /home/jenkins/.jenkins/jobs/oxTrust/workspace/server/target/classes
[INFO] 
[INFO] --- maven-jar-plugin:2.4:jar (make-a-jar) @ oxtrust-server ---
[INFO] Building jar: /home/jenkins/.jenkins/jobs/oxTrust/workspace/server/target/oxtrust-server.jar
[INFO] 
[INFO] --- buildnumber-maven-plugin:1.1:create (default) @ oxtrust-server ---
[INFO] Checking for local modifications: skipped.
[INFO] Updating project files from SCM: skipped.
[INFO] Executing: /bin/sh -c cd /home/jenkins/.jenkins/jobs/oxTrust/workspace/server && git rev-parse --verify HEAD
[INFO] Working directory: /home/jenkins/.jenkins/jobs/oxTrust/workspace/server
[INFO] Storing buildNumber: 82cb5bfba301ebb96f61e6417e9ba4c707bcc00c at timestamp: 1640007431307
[INFO] Executing: /bin/sh -c cd /home/jenkins/.jenkins/jobs/oxTrust/workspace/server && git rev-parse --verify HEAD
[INFO] Working directory: /home/jenkins/.jenkins/jobs/oxTrust/workspace/server
[INFO] Storing buildScmBranch: UNKNOWN
[INFO] 
[INFO] --- git-commit-id-plugin:2.2.6:revision (get-the-git-infos) @ oxtrust-server ---
[INFO] 
[INFO] --- maven-resources-plugin:2.6:resources (default-resources) @ oxtrust-server ---
[INFO] Using 'UTF-8' encoding to copy filtered resources.
[INFO] Copying 109 resources
[INFO] 
[INFO] --- maven-compiler-plugin:2.3.2:compile (default-compile) @ oxtrust-server ---
[INFO] Nothing to compile - all classes are up to date
[INFO] 
[INFO] --- maven-jar-plugin:2.4:jar (make-a-jar) @ oxtrust-server ---
[INFO] Building jar: /home/jenkins/.jenkins/jobs/oxTrust/workspace/server/target/oxtrust-server.jar
[INFO] 
[INFO] --- maven-resources-plugin:2.6:testResources (default-testResources) @ oxtrust-server ---
[INFO] Using 'UTF-8' encoding to copy filtered resources.
[INFO] Copying 96 resources
[INFO] Copying 6 resources
[INFO] 
[INFO] --- maven-resources-plugin:2.6:copy-resources (prepare-configuration-files) @ oxtrust-server ---
[INFO] Using 'UTF-8' encoding to copy filtered resources.
[INFO] Copying 98 resources
[INFO] 
[INFO] --- maven-compiler-plugin:2.3.2:testCompile (default-testCompile) @ oxtrust-server ---
[INFO] Compiling 13 source files to /home/jenkins/.jenkins/jobs/oxTrust/workspace/server/target/test-classes
[INFO] 
[INFO] --- maven-surefire-plugin:2.19.1:test (default-test) @ oxtrust-server ---

-------------------------------------------------------
 T E S T S
-------------------------------------------------------
Running TestSuite
Invoked init test suite method
2021-12-20 13:37:22,025 INFO  [main] [org.reflections.Reflections] (Reflections.java:229) - Reflections took 216 ms to scan 1 urls, producing 8 keys and 13 values 
Dec 20, 2021 1:37:22 PM org.eu.ingwar.tools.arquillian.extension.suite.DeploymentClassFinder getDeploymentClassFromAnnotation
INFO: arquillian-suite-deployment: Found class annotated with @ArquillianSuiteDeployment: org.gluu.oxtrust.action.ConfigurableTest
Dec 20, 2021 1:37:22 PM org.jboss.arquillian.container.impl.MapObject populate
WARNING: Configuration contain properties not supported by the backing object org.jboss.arquillian.container.jetty.embedded_9.JettyEmbeddedConfiguration
Unused property entries: {javaVmArguments=-Xms256m -Xmx512m -XX:MaxPermSize=256m}
Supported property names: [tempDirectory, dumpServerAfterStart, mimeTypes, bindHttpPort, idleTimeoutMillis, headerBufferSize, defaultsDescriptor, classloaderBehavior, configurationClasses, bindAddress, realmProperties, httpConfiguration]
Dec 20, 2021 1:37:22 PM org.eclipse.jetty.util.log.Log initialized
INFO: Logging initialized @5941ms to org.eclipse.jetty.util.log.JavaUtilLog
Dec 20, 2021 1:37:22 PM org.jboss.arquillian.container.jetty.embedded_9.JettyEmbeddedContainer start
INFO: Starting Jetty Embedded Server 9.4.9.v20180320 [id:813780803]
Dec 20, 2021 1:37:22 PM org.eclipse.jetty.server.Server doStart
INFO: jetty-9.4.9.v20180320; built: 2018-03-20T12:21:10Z; git: 1f8159b1e4a42d3f79997021ea1609f2fbac6de5; jvm 11.0.7+10-LTS
Dec 20, 2021 1:37:22 PM org.eclipse.jetty.server.AbstractConnector doStart
INFO: Started ServerConnector@27a5ae72{HTTP/1.1,[http/1.1]}{localhost:9980}
Dec 20, 2021 1:37:22 PM org.eclipse.jetty.server.Server doStart
INFO: Started @6366ms
Dec 20, 2021 1:37:29 PM org.jboss.arquillian.container.jetty.embedded_9.ArquillianAppProvider createApp
INFO: Webapp archive location: file:/home/jenkins/.jenkins/jobs/oxTrust/workspace/server/target/arquillian-jetty-temp/export6719028791244992162oxtrust.war
Dec 20, 2021 1:37:31 PM org.eclipse.jetty.annotations.AnnotationConfiguration scanForAnnotations
INFO: Scanning elapsed time=639ms
Dec 20, 2021 1:37:31 PM org.eclipse.jetty.webapp.StandardDescriptorProcessor visitServlet
INFO: NO JSP Support for /export6719028791244992162oxtrust, did not find org.eclipse.jetty.jsp.JettyJspServlet
Dec 20, 2021 1:37:32 PM org.richfaces.webapp.ResourceServletContainerInitializer registerServlet
INFO: Auto-registered servlet ResourceServlet with mapping '/org.richfaces.resources/*'
Dec 20, 2021 1:37:32 PM org.omnifaces.ApplicationInitializer logOmniFacesVersion
INFO: Using OmniFaces version 2.6.9
Dec 20, 2021 1:37:34 PM org.eclipse.jetty.webapp.WebAppContext doStart
WARNING: Failed startup of context o.e.j.w.WebAppContext@6ea3a513{/export6719028791244992162oxtrust,file:///tmp/jetty-localhost-9980-export6719028791244992162oxtrust.war-_export6719028791244992162oxtrust-any-8604526427080358945.dir/webapp/,UNAVAILABLE}{/home/jenkins/.jenkins/jobs/oxTrust/workspace/server/target/arquillian-jetty-temp/export6719028791244992162oxtrust.war}
javax.xml.stream.FactoryConfigurationError: Provider for class javax.xml.stream.XMLInputFactory cannot be created
	at java.xml/javax.xml.stream.FactoryFinder.findServiceProvider(FactoryFinder.java:366)
	at java.xml/javax.xml.stream.FactoryFinder.find(FactoryFinder.java:309)
	at java.xml/javax.xml.stream.FactoryFinder.find(FactoryFinder.java:222)
	at java.xml/javax.xml.stream.XMLInputFactory.newInstance(XMLInputFactory.java:161)
	at org.jboss.weld.xml.BeansXmlStreamParser.parse(BeansXmlStreamParser.java:136)
	at org.jboss.weld.bootstrap.WeldBootstrap.parse(WeldBootstrap.java:136)
	at org.jboss.weld.environment.deployment.discovery.AbstractBeanArchiveScanner.parseBeansXml(AbstractBeanArchiveScanner.java:46)
	at org.jboss.weld.environment.deployment.discovery.DefaultBeanArchiveScanner.scan(DefaultBeanArchiveScanner.java:76)
	at org.jboss.weld.environment.servlet.deployment.WebAppBeanArchiveScanner.scan(WebAppBeanArchiveScanner.java:73)
	at org.jboss.weld.environment.deployment.discovery.AbstractDiscoveryStrategy.performDiscovery(AbstractDiscoveryStrategy.java:113)
	at org.jboss.weld.environment.servlet.WeldServletLifecycle.createDeployment(WeldServletLifecycle.java:303)
	at org.jboss.weld.environment.servlet.WeldServletLifecycle.initialize(WeldServletLifecycle.java:157)
	at org.jboss.weld.environment.servlet.EnhancedListener.onStartup(EnhancedListener.java:62)
	at org.eclipse.jetty.plus.annotation.ContainerInitializer.callStartup(ContainerInitializer.java:140)
	at org.eclipse.jetty.annotations.ServletContainerInitializersStarter.doStart(ServletContainerInitializersStarter.java:64)
	at org.eclipse.jetty.util.component.AbstractLifeCycle.start(AbstractLifeCycle.java:68)
	at org.eclipse.jetty.servlet.ServletContextHandler.startContext(ServletContextHandler.java:355)
	at org.eclipse.jetty.webapp.WebAppContext.startWebapp(WebAppContext.java:1497)
	at org.eclipse.jetty.webapp.WebAppContext.startContext(WebAppContext.java:1459)
	at org.eclipse.jetty.server.handler.ContextHandler.doStart(ContextHandler.java:785)
	at org.eclipse.jetty.servlet.ServletContextHandler.doStart(ServletContextHandler.java:287)
	at org.eclipse.jetty.webapp.WebAppContext.doStart(WebAppContext.java:545)
	at org.eclipse.jetty.util.component.AbstractLifeCycle.start(AbstractLifeCycle.java:68)
	at org.eclipse.jetty.deploy.bindings.StandardStarter.processBinding(StandardStarter.java:46)
	at org.eclipse.jetty.deploy.AppLifeCycle.runBindings(AppLifeCycle.java:192)
	at org.eclipse.jetty.deploy.DeploymentManager.requestAppGoal(DeploymentManager.java:505)
	at org.eclipse.jetty.deploy.DeploymentManager.addApp(DeploymentManager.java:151)
	at org.jboss.arquillian.container.jetty.embedded_9.JettyEmbeddedContainer.deploy(JettyEmbeddedContainer.java:295)
	at org.jboss.arquillian.container.impl.client.container.ContainerDeployController$3.call(ContainerDeployController.java:151)
	at org.jboss.arquillian.container.impl.client.container.ContainerDeployController$3.call(ContainerDeployController.java:118)
	at org.jboss.arquillian.container.impl.client.container.ContainerDeployController.executeOperation(ContainerDeployController.java:239)
	at org.jboss.arquillian.container.impl.client.container.ContainerDeployController.deploy(ContainerDeployController.java:118)
	at java.base/jdk.internal.reflect.NativeMethodAccessorImpl.invoke0(Native Method)
	at java.base/jdk.internal.reflect.NativeMethodAccessorImpl.invoke(NativeMethodAccessorImpl.java:62)
	at java.base/jdk.internal.reflect.DelegatingMethodAccessorImpl.invoke(DelegatingMethodAccessorImpl.java:43)
	at java.base/java.lang.reflect.Method.invoke(Method.java:566)
	at org.jboss.arquillian.core.impl.ObserverImpl.invoke(ObserverImpl.java:86)
	at org.jboss.arquillian.core.impl.EventContextImpl.invokeObservers(EventContextImpl.java:103)
	at org.jboss.arquillian.core.impl.EventContextImpl.proceed(EventContextImpl.java:90)
	at org.jboss.arquillian.container.impl.client.ContainerDeploymentContextHandler.createDeploymentContext(ContainerDeploymentContextHandler.java:71)
	at java.base/jdk.internal.reflect.NativeMethodAccessorImpl.invoke0(Native Method)
	at java.base/jdk.internal.reflect.NativeMethodAccessorImpl.invoke(NativeMethodAccessorImpl.java:62)
	at java.base/jdk.internal.reflect.DelegatingMethodAccessorImpl.invoke(DelegatingMethodAccessorImpl.java:43)
	at java.base/java.lang.reflect.Method.invoke(Method.java:566)
	at org.jboss.arquillian.core.impl.ObserverImpl.invoke(ObserverImpl.java:86)
	at org.jboss.arquillian.core.impl.EventContextImpl.proceed(EventContextImpl.java:95)
	at org.jboss.arquillian.container.impl.client.ContainerDeploymentContextHandler.createContainerContext(ContainerDeploymentContextHandler.java:54)
	at java.base/jdk.internal.reflect.NativeMethodAccessorImpl.invoke0(Native Method)
	at java.base/jdk.internal.reflect.NativeMethodAccessorImpl.invoke(NativeMethodAccessorImpl.java:62)
	at java.base/jdk.internal.reflect.DelegatingMethodAccessorImpl.invoke(DelegatingMethodAccessorImpl.java:43)
	at java.base/java.lang.reflect.Method.invoke(Method.java:566)
	at org.jboss.arquillian.core.impl.ObserverImpl.invoke(ObserverImpl.java:86)
	at org.jboss.arquillian.core.impl.EventContextImpl.proceed(EventContextImpl.java:95)
	at org.jboss.arquillian.container.impl.client.container.DeploymentExceptionHandler.verifyExpectedExceptionDuringDeploy(DeploymentExceptionHandler.java:47)
	at java.base/jdk.internal.reflect.NativeMethodAccessorImpl.invoke0(Native Method)
	at java.base/jdk.internal.reflect.NativeMethodAccessorImpl.invoke(NativeMethodAccessorImpl.java:62)
	at java.base/jdk.internal.reflect.DelegatingMethodAccessorImpl.invoke(DelegatingMethodAccessorImpl.java:43)
	at java.base/java.lang.reflect.Method.invoke(Method.java:566)
	at org.jboss.arquillian.core.impl.ObserverImpl.invoke(ObserverImpl.java:86)
	at org.jboss.arquillian.core.impl.EventContextImpl.proceed(EventContextImpl.java:95)
	at org.jboss.arquillian.core.impl.ManagerImpl.fire(ManagerImpl.java:133)
	at org.jboss.arquillian.core.impl.ManagerImpl.fire(ManagerImpl.java:105)
	at org.jboss.arquillian.core.impl.EventImpl.fire(EventImpl.java:62)
	at org.jboss.arquillian.container.impl.client.container.ContainerDeployController$1.perform(ContainerDeployController.java:92)
	at org.jboss.arquillian.container.impl.client.container.ContainerDeployController$1.perform(ContainerDeployController.java:77)
	at org.jboss.arquillian.container.impl.client.container.ContainerDeployController.forEachDeployment(ContainerDeployController.java:232)
	at org.jboss.arquillian.container.impl.client.container.ContainerDeployController.forEachManagedDeployment(ContainerDeployController.java:212)
	at org.jboss.arquillian.container.impl.client.container.ContainerDeployController.deployManaged(ContainerDeployController.java:77)
	at java.base/jdk.internal.reflect.NativeMethodAccessorImpl.invoke0(Native Method)
	at java.base/jdk.internal.reflect.NativeMethodAccessorImpl.invoke(NativeMethodAccessorImpl.java:62)
	at java.base/jdk.internal.reflect.DelegatingMethodAccessorImpl.invoke(DelegatingMethodAccessorImpl.java:43)
	at java.base/java.lang.reflect.Method.invoke(Method.java:566)
	at org.jboss.arquillian.core.impl.ObserverImpl.invoke(ObserverImpl.java:86)
	at org.jboss.arquillian.core.impl.EventContextImpl.invokeObservers(EventContextImpl.java:103)
	at org.jboss.arquillian.core.impl.EventContextImpl.proceed(EventContextImpl.java:90)
	at org.eu.ingwar.tools.arquillian.extension.suite.SuiteDeployer.blockDeployManagedDeploymentsWhenNeeded(SuiteDeployer.java:95)
	at java.base/jdk.internal.reflect.NativeMethodAccessorImpl.invoke0(Native Method)
	at java.base/jdk.internal.reflect.NativeMethodAccessorImpl.invoke(NativeMethodAccessorImpl.java:62)
	at java.base/jdk.internal.reflect.DelegatingMethodAccessorImpl.invoke(DelegatingMethodAccessorImpl.java:43)
	at java.base/java.lang.reflect.Method.invoke(Method.java:566)
	at org.jboss.arquillian.core.impl.ObserverImpl.invoke(ObserverImpl.java:86)
	at org.jboss.arquillian.core.impl.EventContextImpl.proceed(EventContextImpl.java:95)
	at org.jboss.arquillian.core.impl.ManagerImpl.fire(ManagerImpl.java:133)
	at org.jboss.arquillian.core.impl.ManagerImpl.fire(ManagerImpl.java:105)
	at org.jboss.arquillian.core.impl.EventImpl.fire(EventImpl.java:62)
	at org.jboss.arquillian.container.test.impl.client.ContainerEventController.execute(ContainerEventController.java:96)
	at java.base/jdk.internal.reflect.NativeMethodAccessorImpl.invoke0(Native Method)
	at java.base/jdk.internal.reflect.NativeMethodAccessorImpl.invoke(NativeMethodAccessorImpl.java:62)
	at java.base/jdk.internal.reflect.DelegatingMethodAccessorImpl.invoke(DelegatingMethodAccessorImpl.java:43)
	at java.base/java.lang.reflect.Method.invoke(Method.java:566)
	at org.jboss.arquillian.core.impl.ObserverImpl.invoke(ObserverImpl.java:86)
	at org.jboss.arquillian.core.impl.EventContextImpl.invokeObservers(EventContextImpl.java:103)
	at org.jboss.arquillian.core.impl.EventContextImpl.proceed(EventContextImpl.java:90)
	at org.jboss.arquillian.test.impl.TestContextHandler.createClassContext(TestContextHandler.java:83)
	at java.base/jdk.internal.reflect.NativeMethodAccessorImpl.invoke0(Native Method)
	at java.base/jdk.internal.reflect.NativeMethodAccessorImpl.invoke(NativeMethodAccessorImpl.java:62)
	at java.base/jdk.internal.reflect.DelegatingMethodAccessorImpl.invoke(DelegatingMethodAccessorImpl.java:43)
	at java.base/java.lang.reflect.Method.invoke(Method.java:566)
	at org.jboss.arquillian.core.impl.ObserverImpl.invoke(ObserverImpl.java:86)
	at org.jboss.arquillian.core.impl.EventContextImpl.proceed(EventContextImpl.java:95)
	at org.jboss.arquillian.test.impl.TestContextHandler.createSuiteContext(TestContextHandler.java:69)
	at java.base/jdk.internal.reflect.NativeMethodAccessorImpl.invoke0(Native Method)
	at java.base/jdk.internal.reflect.NativeMethodAccessorImpl.invoke(NativeMethodAccessorImpl.java:62)
	at java.base/jdk.internal.reflect.DelegatingMethodAccessorImpl.invoke(DelegatingMethodAccessorImpl.java:43)
	at java.base/java.lang.reflect.Method.invoke(Method.java:566)
	at org.jboss.arquillian.core.impl.ObserverImpl.invoke(ObserverImpl.java:86)
	at org.jboss.arquillian.core.impl.EventContextImpl.proceed(EventContextImpl.java:95)
	at org.jboss.arquillian.core.impl.ManagerImpl.fire(ManagerImpl.java:133)
	at org.jboss.arquillian.core.impl.ManagerImpl.fire(ManagerImpl.java:105)
	at org.jboss.arquillian.test.impl.EventTestRunnerAdaptor.beforeClass(EventTestRunnerAdaptor.java:89)
	at org.jboss.arquillian.testng.Arquillian.arquillianBeforeClass(Arquillian.java:99)
	at java.base/jdk.internal.reflect.NativeMethodAccessorImpl.invoke0(Native Method)
	at java.base/jdk.internal.reflect.NativeMethodAccessorImpl.invoke(NativeMethodAccessorImpl.java:62)
	at java.base/jdk.internal.reflect.DelegatingMethodAccessorImpl.invoke(DelegatingMethodAccessorImpl.java:43)
	at java.base/java.lang.reflect.Method.invoke(Method.java:566)
	at org.testng.internal.MethodInvocationHelper.invokeMethod(MethodInvocationHelper.java:124)
	at org.testng.internal.MethodInvocationHelper.invokeMethodConsideringTimeout(MethodInvocationHelper.java:59)
	at org.testng.internal.Invoker.invokeConfigurationMethod(Invoker.java:458)
	at org.testng.internal.Invoker.invokeConfigurations(Invoker.java:222)
	at org.testng.internal.Invoker.invokeConfigurations(Invoker.java:142)
	at org.testng.internal.TestMethodWorker.invokeBeforeClassMethods(TestMethodWorker.java:168)
	at org.testng.internal.TestMethodWorker.run(TestMethodWorker.java:105)
	at org.testng.TestRunner.privateRun(TestRunner.java:648)
	at org.testng.TestRunner.run(TestRunner.java:505)
	at org.testng.SuiteRunner.runTest(SuiteRunner.java:455)
	at org.testng.SuiteRunner.runSequentially(SuiteRunner.java:450)
	at org.testng.SuiteRunner.privateRun(SuiteRunner.java:415)
	at org.testng.SuiteRunner.run(SuiteRunner.java:364)
	at org.testng.SuiteRunnerWorker.runSuite(SuiteRunnerWorker.java:52)
	at org.testng.SuiteRunnerWorker.run(SuiteRunnerWorker.java:84)
	at org.testng.TestNG.runSuitesSequentially(TestNG.java:1208)
	at org.testng.TestNG.runSuitesLocally(TestNG.java:1137)
	at org.testng.TestNG.runSuites(TestNG.java:1049)
	at org.testng.TestNG.run(TestNG.java:1017)
	at org.apache.maven.surefire.testng.TestNGExecutor.run(TestNGExecutor.java:281)
	at org.apache.maven.surefire.testng.TestNGXmlTestSuite.execute(TestNGXmlTestSuite.java:75)
	at org.apache.maven.surefire.testng.TestNGProvider.invoke(TestNGProvider.java:121)
	at org.apache.maven.surefire.booter.ForkedBooter.invokeProviderInSameClassLoader(ForkedBooter.java:290)
	at org.apache.maven.surefire.booter.ForkedBooter.runSuitesInProcess(ForkedBooter.java:242)
	at org.apache.maven.surefire.booter.ForkedBooter.main(ForkedBooter.java:121)
Caused by: java.lang.RuntimeException: Provider for class javax.xml.stream.XMLInputFactory cannot be created
	at java.xml/javax.xml.stream.FactoryFinder.findServiceProvider(FactoryFinder.java:363)
	... 139 more
Caused by: java.util.ServiceConfigurationError: javax.xml.stream.XMLInputFactory: Provider com.fasterxml.aalto.stax.InputFactoryImpl not found
	at java.base/java.util.ServiceLoader.fail(ServiceLoader.java:588)
	at java.base/java.util.ServiceLoader$LazyClassPathLookupIterator.nextProviderClass(ServiceLoader.java:1211)
	at java.base/java.util.ServiceLoader$LazyClassPathLookupIterator.hasNextService(ServiceLoader.java:1220)
	at java.base/java.util.ServiceLoader$LazyClassPathLookupIterator.hasNext(ServiceLoader.java:1264)
	at java.base/java.util.ServiceLoader$2.hasNext(ServiceLoader.java:1299)
	at java.base/java.util.ServiceLoader$3.hasNext(ServiceLoader.java:1384)
	at java.xml/javax.xml.stream.FactoryFinder$1.run(FactoryFinder.java:348)
	at java.base/java.security.AccessController.doPrivileged(Native Method)
	at java.xml/javax.xml.stream.FactoryFinder.findServiceProvider(FactoryFinder.java:337)
	... 139 more

Dec 20, 2021 1:37:35 PM org.eclipse.jetty.server.handler.ContextHandler doStop
INFO: Stopped o.e.j.w.WebAppContext@6ea3a513{/export6719028791244992162oxtrust,null,UNAVAILABLE}{/home/jenkins/.jenkins/jobs/oxTrust/workspace/server/target/arquillian-jetty-temp/export6719028791244992162oxtrust.war}
Dec 20, 2021 1:37:35 PM org.jboss.arquillian.container.jetty.embedded_9.JettyEmbeddedContainer stop
INFO: Stopping Jetty Embedded Server [id:813780803]
Dec 20, 2021 1:37:35 PM org.eclipse.jetty.server.AbstractConnector doStop
INFO: Stopped ServerConnector@27a5ae72{HTTP/1.1,[http/1.1]}{localhost:9980}
Tests run: 9, Failures: 1, Errors: 0, Skipped: 4, Time elapsed: 18.029 sec <<< FAILURE! - in TestSuite
arquillianBeforeClass(org.gluu.oxtrust.action.ConfigurationStatusTest)  Time elapsed: 16.99 sec  <<< FAILURE!
org.jboss.arquillian.container.spi.client.container.DeploymentException: Could not deploy oxtrust.war
	at org.jboss.arquillian.container.jetty.embedded_9.JettyEmbeddedContainer.deploy(JettyEmbeddedContainer.java:311)
	at org.jboss.arquillian.container.impl.client.container.ContainerDeployController$3.call(ContainerDeployController.java:151)
	at org.jboss.arquillian.container.impl.client.container.ContainerDeployController$3.call(ContainerDeployController.java:118)
	at org.jboss.arquillian.container.impl.client.container.ContainerDeployController.executeOperation(ContainerDeployController.java:239)
	at org.jboss.arquillian.container.impl.client.container.ContainerDeployController.deploy(ContainerDeployController.java:118)
	at java.base/jdk.internal.reflect.NativeMethodAccessorImpl.invoke0(Native Method)
	at java.base/jdk.internal.reflect.NativeMethodAccessorImpl.invoke(NativeMethodAccessorImpl.java:62)
	at java.base/jdk.internal.reflect.DelegatingMethodAccessorImpl.invoke(DelegatingMethodAccessorImpl.java:43)
	at java.base/java.lang.reflect.Method.invoke(Method.java:566)
	at org.jboss.arquillian.core.impl.ObserverImpl.invoke(ObserverImpl.java:86)
	at org.jboss.arquillian.core.impl.EventContextImpl.invokeObservers(EventContextImpl.java:103)
	at org.jboss.arquillian.core.impl.EventContextImpl.proceed(EventContextImpl.java:90)
	at org.jboss.arquillian.container.impl.client.ContainerDeploymentContextHandler.createDeploymentContext(ContainerDeploymentContextHandler.java:71)
	at java.base/jdk.internal.reflect.NativeMethodAccessorImpl.invoke0(Native Method)
	at java.base/jdk.internal.reflect.NativeMethodAccessorImpl.invoke(NativeMethodAccessorImpl.java:62)
	at java.base/jdk.internal.reflect.DelegatingMethodAccessorImpl.invoke(DelegatingMethodAccessorImpl.java:43)
	at java.base/java.lang.reflect.Method.invoke(Method.java:566)
	at org.jboss.arquillian.core.impl.ObserverImpl.invoke(ObserverImpl.java:86)
	at org.jboss.arquillian.core.impl.EventContextImpl.proceed(EventContextImpl.java:95)
	at org.jboss.arquillian.container.impl.client.ContainerDeploymentContextHandler.createContainerContext(ContainerDeploymentContextHandler.java:54)
	at java.base/jdk.internal.reflect.NativeMethodAccessorImpl.invoke0(Native Method)
	at java.base/jdk.internal.reflect.NativeMethodAccessorImpl.invoke(NativeMethodAccessorImpl.java:62)
	at java.base/jdk.internal.reflect.DelegatingMethodAccessorImpl.invoke(DelegatingMethodAccessorImpl.java:43)
	at java.base/java.lang.reflect.Method.invoke(Method.java:566)
	at org.jboss.arquillian.core.impl.ObserverImpl.invoke(ObserverImpl.java:86)
	at org.jboss.arquillian.core.impl.EventContextImpl.proceed(EventContextImpl.java:95)
	at org.jboss.arquillian.container.impl.client.container.DeploymentExceptionHandler.verifyExpectedExceptionDuringDeploy(DeploymentExceptionHandler.java:47)
	at java.base/jdk.internal.reflect.NativeMethodAccessorImpl.invoke0(Native Method)
	at java.base/jdk.internal.reflect.NativeMethodAccessorImpl.invoke(NativeMethodAccessorImpl.java:62)
	at java.base/jdk.internal.reflect.DelegatingMethodAccessorImpl.invoke(DelegatingMethodAccessorImpl.java:43)
	at java.base/java.lang.reflect.Method.invoke(Method.java:566)
	at org.jboss.arquillian.core.impl.ObserverImpl.invoke(ObserverImpl.java:86)
	at org.jboss.arquillian.core.impl.EventContextImpl.proceed(EventContextImpl.java:95)
	at org.jboss.arquillian.core.impl.ManagerImpl.fire(ManagerImpl.java:133)
	at org.jboss.arquillian.core.impl.ManagerImpl.fire(ManagerImpl.java:105)
	at org.jboss.arquillian.core.impl.EventImpl.fire(EventImpl.java:62)
	at org.jboss.arquillian.container.impl.client.container.ContainerDeployController$1.perform(ContainerDeployController.java:92)
	at org.jboss.arquillian.container.impl.client.container.ContainerDeployController$1.perform(ContainerDeployController.java:77)
	at org.jboss.arquillian.container.impl.client.container.ContainerDeployController.forEachDeployment(ContainerDeployController.java:232)
	at org.jboss.arquillian.container.impl.client.container.ContainerDeployController.forEachManagedDeployment(ContainerDeployController.java:212)
	at org.jboss.arquillian.container.impl.client.container.ContainerDeployController.deployManaged(ContainerDeployController.java:77)
	at java.base/jdk.internal.reflect.NativeMethodAccessorImpl.invoke0(Native Method)
	at java.base/jdk.internal.reflect.NativeMethodAccessorImpl.invoke(NativeMethodAccessorImpl.java:62)
	at java.base/jdk.internal.reflect.DelegatingMethodAccessorImpl.invoke(DelegatingMethodAccessorImpl.java:43)
	at java.base/java.lang.reflect.Method.invoke(Method.java:566)
	at org.jboss.arquillian.core.impl.ObserverImpl.invoke(ObserverImpl.java:86)
	at org.jboss.arquillian.core.impl.EventContextImpl.invokeObservers(EventContextImpl.java:103)
	at org.jboss.arquillian.core.impl.EventContextImpl.proceed(EventContextImpl.java:90)
	at org.eu.ingwar.tools.arquillian.extension.suite.SuiteDeployer.blockDeployManagedDeploymentsWhenNeeded(SuiteDeployer.java:95)
	at java.base/jdk.internal.reflect.NativeMethodAccessorImpl.invoke0(Native Method)
	at java.base/jdk.internal.reflect.NativeMethodAccessorImpl.invoke(NativeMethodAccessorImpl.java:62)
	at java.base/jdk.internal.reflect.DelegatingMethodAccessorImpl.invoke(DelegatingMethodAccessorImpl.java:43)
	at java.base/java.lang.reflect.Method.invoke(Method.java:566)
	at org.jboss.arquillian.core.impl.ObserverImpl.invoke(ObserverImpl.java:86)
	at org.jboss.arquillian.core.impl.EventContextImpl.proceed(EventContextImpl.java:95)
	at org.jboss.arquillian.core.impl.ManagerImpl.fire(ManagerImpl.java:133)
	at org.jboss.arquillian.core.impl.ManagerImpl.fire(ManagerImpl.java:105)
	at org.jboss.arquillian.core.impl.EventImpl.fire(EventImpl.java:62)
	at org.jboss.arquillian.container.test.impl.client.ContainerEventController.execute(ContainerEventController.java:96)
	at java.base/jdk.internal.reflect.NativeMethodAccessorImpl.invoke0(Native Method)
	at java.base/jdk.internal.reflect.NativeMethodAccessorImpl.invoke(NativeMethodAccessorImpl.java:62)
	at java.base/jdk.internal.reflect.DelegatingMethodAccessorImpl.invoke(DelegatingMethodAccessorImpl.java:43)
	at java.base/java.lang.reflect.Method.invoke(Method.java:566)
	at org.jboss.arquillian.core.impl.ObserverImpl.invoke(ObserverImpl.java:86)
	at org.jboss.arquillian.core.impl.EventContextImpl.invokeObservers(EventContextImpl.java:103)
	at org.jboss.arquillian.core.impl.EventContextImpl.proceed(EventContextImpl.java:90)
	at org.jboss.arquillian.test.impl.TestContextHandler.createClassContext(TestContextHandler.java:83)
	at java.base/jdk.internal.reflect.NativeMethodAccessorImpl.invoke0(Native Method)
	at java.base/jdk.internal.reflect.NativeMethodAccessorImpl.invoke(NativeMethodAccessorImpl.java:62)
	at java.base/jdk.internal.reflect.DelegatingMethodAccessorImpl.invoke(DelegatingMethodAccessorImpl.java:43)
	at java.base/java.lang.reflect.Method.invoke(Method.java:566)
	at org.jboss.arquillian.core.impl.ObserverImpl.invoke(ObserverImpl.java:86)
	at org.jboss.arquillian.core.impl.EventContextImpl.proceed(EventContextImpl.java:95)
	at org.jboss.arquillian.test.impl.TestContextHandler.createSuiteContext(TestContextHandler.java:69)
	at java.base/jdk.internal.reflect.NativeMethodAccessorImpl.invoke0(Native Method)
	at java.base/jdk.internal.reflect.NativeMethodAccessorImpl.invoke(NativeMethodAccessorImpl.java:62)
	at java.base/jdk.internal.reflect.DelegatingMethodAccessorImpl.invoke(DelegatingMethodAccessorImpl.java:43)
	at java.base/java.lang.reflect.Method.invoke(Method.java:566)
	at org.jboss.arquillian.core.impl.ObserverImpl.invoke(ObserverImpl.java:86)
	at org.jboss.arquillian.core.impl.EventContextImpl.proceed(EventContextImpl.java:95)
	at org.jboss.arquillian.core.impl.ManagerImpl.fire(ManagerImpl.java:133)
	at org.jboss.arquillian.core.impl.ManagerImpl.fire(ManagerImpl.java:105)
	at org.jboss.arquillian.test.impl.EventTestRunnerAdaptor.beforeClass(EventTestRunnerAdaptor.java:89)
	at org.jboss.arquillian.testng.Arquillian.arquillianBeforeClass(Arquillian.java:99)
	at java.base/jdk.internal.reflect.NativeMethodAccessorImpl.invoke0(Native Method)
	at java.base/jdk.internal.reflect.NativeMethodAccessorImpl.invoke(NativeMethodAccessorImpl.java:62)
	at java.base/jdk.internal.reflect.DelegatingMethodAccessorImpl.invoke(DelegatingMethodAccessorImpl.java:43)
	at java.base/java.lang.reflect.Method.invoke(Method.java:566)
	at org.testng.internal.MethodInvocationHelper.invokeMethod(MethodInvocationHelper.java:124)
	at org.testng.internal.MethodInvocationHelper.invokeMethodConsideringTimeout(MethodInvocationHelper.java:59)
	at org.testng.internal.Invoker.invokeConfigurationMethod(Invoker.java:458)
	at org.testng.internal.Invoker.invokeConfigurations(Invoker.java:222)
	at org.testng.internal.Invoker.invokeConfigurations(Invoker.java:142)
	at org.testng.internal.TestMethodWorker.invokeBeforeClassMethods(TestMethodWorker.java:168)
	at org.testng.internal.TestMethodWorker.run(TestMethodWorker.java:105)
	at org.testng.TestRunner.privateRun(TestRunner.java:648)
	at org.testng.TestRunner.run(TestRunner.java:505)
	at org.testng.SuiteRunner.runTest(SuiteRunner.java:455)
	at org.testng.SuiteRunner.runSequentially(SuiteRunner.java:450)
	at org.testng.SuiteRunner.privateRun(SuiteRunner.java:415)
	at org.testng.SuiteRunner.run(SuiteRunner.java:364)
	at org.testng.SuiteRunnerWorker.runSuite(SuiteRunnerWorker.java:52)
	at org.testng.SuiteRunnerWorker.run(SuiteRunnerWorker.java:84)
	at org.testng.TestNG.runSuitesSequentially(TestNG.java:1208)
	at org.testng.TestNG.runSuitesLocally(TestNG.java:1137)
	at org.testng.TestNG.runSuites(TestNG.java:1049)
	at org.testng.TestNG.run(TestNG.java:1017)
	at org.apache.maven.surefire.testng.TestNGExecutor.run(TestNGExecutor.java:281)
	at org.apache.maven.surefire.testng.TestNGXmlTestSuite.execute(TestNGXmlTestSuite.java:75)
	at org.apache.maven.surefire.testng.TestNGProvider.invoke(TestNGProvider.java:121)
	at org.apache.maven.surefire.booter.ForkedBooter.invokeProviderInSameClassLoader(ForkedBooter.java:290)
	at org.apache.maven.surefire.booter.ForkedBooter.runSuitesInProcess(ForkedBooter.java:242)
	at org.apache.maven.surefire.booter.ForkedBooter.main(ForkedBooter.java:121)
Caused by: java.lang.NullPointerException
	at org.eclipse.jetty.servlet.ServletHolder.getContextPath(ServletHolder.java:763)
	at org.jboss.arquillian.container.jetty.embedded_9.JettyEmbeddedContainer.deploy(JettyEmbeddedContainer.java:305)
	... 112 more


Results :

Failed tests: 
  ConfigurationStatusTest>Arquillian.arquillianBeforeClass:99 ยป Deployment Could...

Tests run: 9, Failures: 1, Errors: 0, Skipped: 4

[INFO] ------------------------------------------------------------------------
[INFO] Reactor Summary:
[INFO] 
[INFO] oxTrust ............................................ SUCCESS [  4.442 s]
[INFO] oxTrust static resources ........................... SUCCESS [  2.163 s]
[INFO] oxTrust configuration .............................. SUCCESS [  0.472 s]
[INFO] oxTrust Model library .............................. SUCCESS [ 17.654 s]
[INFO] oxTrust Client library ............................. SUCCESS [  0.305 s]
[INFO] oxTrust Service .................................... SUCCESS [ 18.928 s]
[INFO] OpenId authentication module ....................... SUCCESS [  9.741 s]
[INFO] oxTrust Server ..................................... FAILURE [ 39.003 s]
[INFO] OpenId authentication module for Saml .............. SKIPPED
[INFO] OpenId authentication module for CAS ............... SKIPPED
[INFO] oxTrust Server Test ................................ SKIPPED
[INFO] API Server ......................................... SKIPPED
[INFO] ------------------------------------------------------------------------
[INFO] BUILD FAILURE
[INFO] ------------------------------------------------------------------------
[INFO] Total time: 01:36 min
[INFO] Finished at: 2021-12-20T13:37:36+00:00
[INFO] Final Memory: 67M/234M
[INFO] ------------------------------------------------------------------------
[ERROR] Failed to execute goal org.apache.maven.plugins:maven-surefire-plugin:2.19.1:test (default-test) on project oxtrust-server: There are test failures.
[ERROR] 
[ERROR] Please refer to /home/jenkins/.jenkins/jobs/oxTrust/workspace/server/target/surefire-reports for the individual test results.
[ERROR] -> [Help 1]
[ERROR] 
[ERROR] To see the full stack trace of the errors, re-run Maven with the -e switch.
[ERROR] Re-run Maven using the -X switch to enable full debug logging.
[ERROR] 
[ERROR] For more information about the errors and possible solutions, please read the following articles:
[ERROR] [Help 1] http://cwiki.apache.org/confluence/display/MAVEN/MojoFailureException
[ERROR] 
[ERROR] After correcting the problems, you can resume the build with the command
[ERROR]   mvn <goals> -rf :oxtrust-server
Build step 'Invoke top-level Maven targets' marked build as failure
[FINDBUGS] Skipping publisher since build result is FAILURE
Publishing Javadoc
TestNG Reports Processing: START
Looking for TestNG results report in workspace using pattern: **/testng-results.xml
Saving reports...
Processing '/home/jenkins/.jenkins/jobs/oxTrust/builds/521/testng/testng-results.xml'
TestNG Reports Processing: FINISH
Sending e-mails to: support@gluu.org
ERROR: Couldn't connect to host, port: webmail.gluu.org, 465; timeout 60000
com.sun.mail.util.MailConnectException: Couldn't connect to host, port: webmail.gluu.org, 465; timeout 60000;
  nested exception is:
	java.net.SocketTimeoutException: connect timed out
	at com.sun.mail.smtp.SMTPTransport.openServer(SMTPTransport.java:2210)
	at com.sun.mail.smtp.SMTPTransport.protocolConnect(SMTPTransport.java:722)
	at javax.mail.Service.connect(Service.java:310)
	at javax.mail.Service.connect(Service.java:169)
	at javax.mail.Service.connect(Service.java:118)
	at javax.mail.Transport.send0(Transport.java:188)
	at javax.mail.Transport.send(Transport.java:118)
	at hudson.tasks.MailSender.run(MailSender.java:130)
	at hudson.tasks.Mailer.perform(Mailer.java:176)
	at hudson.tasks.Mailer.perform(Mailer.java:139)
	at hudson.tasks.BuildStepMonitor$1.perform(BuildStepMonitor.java:20)
	at hudson.model.AbstractBuild$AbstractBuildExecution.perform(AbstractBuild.java:741)
	at hudson.model.AbstractBuild$AbstractBuildExecution.performAllBuildSteps(AbstractBuild.java:690)
	at hudson.model.Build$BuildExecution.post2(Build.java:186)
	at hudson.model.AbstractBuild$AbstractBuildExecution.post(AbstractBuild.java:635)
	at hudson.model.Run.execute(Run.java:1905)
	at hudson.model.FreeStyleBuild.run(FreeStyleBuild.java:43)
	at hudson.model.ResourceController.execute(ResourceController.java:97)
	at hudson.model.Executor.run(Executor.java:428)
Caused by: java.net.SocketTimeoutException: connect timed out
	at java.net.PlainSocketImpl.socketConnect(Native Method)
	at java.net.AbstractPlainSocketImpl.doConnect(AbstractPlainSocketImpl.java:350)
	at java.net.AbstractPlainSocketImpl.connectToAddress(AbstractPlainSocketImpl.java:206)
	at java.net.AbstractPlainSocketImpl.connect(AbstractPlainSocketImpl.java:188)
	at java.net.SocksSocketImpl.connect(SocksSocketImpl.java:392)
	at java.net.Socket.connect(Socket.java:589)
	at com.sun.mail.util.SocketFetcher.createSocket(SocketFetcher.java:333)
	at com.sun.mail.util.SocketFetcher.getSocket(SocketFetcher.java:193)
	at com.sun.mail.smtp.SMTPTransport.openServer(SMTPTransport.java:2160)
	... 18 more
[Boolean condition] checking [true] against [^(1|y|yes|t|true|on|run)$] (origin token: $DEPLOY_BUILD)
Run condition [Boolean condition] enabling perform for step [Builder to mark whether executed]
Finished: FAILURE