FailedConsole Output

Started by user Jose Gonzalez
Running as SYSTEM
Building on master in workspace /home/jenkins/.jenkins/jobs/oxTrust/workspace
The recommended git tool is: NONE
No credentials specified
 > git rev-parse --is-inside-work-tree # timeout=10
Fetching changes from the remote Git repository
 > git config remote.origin.url https://github.com/GluuFederation/oxTrust # timeout=10
Fetching upstream changes from https://github.com/GluuFederation/oxTrust
 > git --version # timeout=10
 > git --version # 'git version 1.8.3.1'
 > git fetch --tags --progress https://github.com/GluuFederation/oxTrust +refs/heads/*:refs/remotes/origin/* # timeout=10
 > git rev-parse refs/remotes/origin/version_3.1.5.sp5^{commit} # timeout=10
 > git rev-parse refs/remotes/origin/origin/version_3.1.5.sp5^{commit} # timeout=10
Checking out Revision ec4aeccbaae6d9d863125941cade79849962d9da (refs/remotes/origin/version_3.1.5.sp5)
 > git config core.sparsecheckout # timeout=10
 > git checkout -f ec4aeccbaae6d9d863125941cade79849962d9da # timeout=10
Commit message: "fix: rewrite scim brackets preprocessing"
First time build. Skipping changelog.
Run condition [Boolean condition] enabling prebuild for step [Trigger/call builds on other projects]
[workspace] $ /bin/bash /opt/jetty/temp/jenkins2859141429735045442.sh
Cloning into 'oxHudsonProfiles'...
[workspace] $ /home/jenkins/.jenkins/tools/hudson.tasks.Maven_MavenInstallation/maven_3.3.9/bin/mvn -DDEPLOY_BUILD=false -DVERSION_NAME=version_3.1.5.sp5 -DPROFILE_NAME=ce-dev5.gluu.org -DDEVELOPMENT_BUILD=false -DMAVEN_SKIP_TESTS=true -Dpython.import.site=false -DPYTHON_HOME=/opt/jython -Dcfg=ce-dev5.gluu.org -Dmaven.test.skip=true -Ddevelopment-build=false -Dskip.qa.test=true clean compile install findbugs:findbugs site
[INFO] Scanning for projects...
[WARNING] 
[WARNING] Some problems were encountered while building the effective model for org.xdi:oxtrust-static:jar:3.1.5.sp5
[WARNING] 'dependencyManagement.dependencies.dependency.(groupId:artifactId:type:classifier)' must be unique: org.xdi:oxtrust-model:jar -> duplicate declaration of version ${project.version} @ org.xdi:oxtrust:3.1.5.sp5, /home/jenkins/.jenkins/jobs/oxTrust/workspace/pom.xml, line 146, column 25
[WARNING] 
[WARNING] Some problems were encountered while building the effective model for org.xdi:oxtrust-configuration:jar:3.1.5.sp5
[WARNING] 'dependencyManagement.dependencies.dependency.(groupId:artifactId:type:classifier)' must be unique: org.xdi:oxtrust-model:jar -> duplicate declaration of version ${project.version} @ org.xdi:oxtrust:3.1.5.sp5, /home/jenkins/.jenkins/jobs/oxTrust/workspace/pom.xml, line 146, column 25
[WARNING] 
[WARNING] Some problems were encountered while building the effective model for org.xdi:oxtrust-model:jar:3.1.5.sp5
[WARNING] 'dependencyManagement.dependencies.dependency.(groupId:artifactId:type:classifier)' must be unique: org.xdi:oxtrust-model:jar -> duplicate declaration of version ${project.version} @ org.xdi:oxtrust:3.1.5.sp5, /home/jenkins/.jenkins/jobs/oxTrust/workspace/pom.xml, line 146, column 25
[WARNING] 
[WARNING] Some problems were encountered while building the effective model for org.xdi:oxtrust-server:war:3.1.5.sp5
[WARNING] 'dependencies.dependency.(groupId:artifactId:type:classifier)' must be unique: org.jboss.resteasy:jaxrs-api:jar -> duplicate declaration of version (?) @ org.xdi:oxtrust-server:[unknown-version], /home/jenkins/.jenkins/jobs/oxTrust/workspace/server/pom.xml, line 439, column 15
[WARNING] 'dependencyManagement.dependencies.dependency.(groupId:artifactId:type:classifier)' must be unique: org.xdi:oxtrust-model:jar -> duplicate declaration of version ${project.version} @ org.xdi:oxtrust:3.1.5.sp5, /home/jenkins/.jenkins/jobs/oxTrust/workspace/pom.xml, line 146, column 25
[WARNING] 'build.plugins.plugin.version' for org.apache.maven.plugins:maven-javadoc-plugin is missing. @ org.xdi:oxtrust-server:[unknown-version], /home/jenkins/.jenkins/jobs/oxTrust/workspace/server/pom.xml, line 68, column 12
[WARNING] 
[WARNING] Some problems were encountered while building the effective model for org.xdi:oxtrust-scim:jar:3.1.5.sp5
[WARNING] 'dependencyManagement.dependencies.dependency.(groupId:artifactId:type:classifier)' must be unique: org.xdi:oxtrust-model:jar -> duplicate declaration of version ${project.version} @ org.xdi:oxtrust:3.1.5.sp5, /home/jenkins/.jenkins/jobs/oxTrust/workspace/pom.xml, line 146, column 25
[WARNING] 
[WARNING] Some problems were encountered while building the effective model for org.xdi:openid-auth-client:jar:3.1.5.sp5
[WARNING] 'dependencyManagement.dependencies.dependency.(groupId:artifactId:type:classifier)' must be unique: org.xdi:oxtrust-model:jar -> duplicate declaration of version ${project.version} @ org.xdi:oxtrust:3.1.5.sp5, /home/jenkins/.jenkins/jobs/oxTrust/workspace/pom.xml, line 146, column 25
[WARNING] 'build.plugins.plugin.version' for org.apache.maven.plugins:maven-javadoc-plugin is missing. @ org.xdi:openid-auth-client:[unknown-version], /home/jenkins/.jenkins/jobs/oxTrust/workspace/openid-auth-client/pom.xml, line 22, column 21
[WARNING] 
[WARNING] Some problems were encountered while building the effective model for org.xdi:saml-openid-auth-client:jar:3.1.5.sp5
[WARNING] 'dependencyManagement.dependencies.dependency.(groupId:artifactId:type:classifier)' must be unique: org.xdi:oxtrust-model:jar -> duplicate declaration of version ${project.version} @ org.xdi:oxtrust:3.1.5.sp5, /home/jenkins/.jenkins/jobs/oxTrust/workspace/pom.xml, line 146, column 25
[WARNING] 'build.plugins.plugin.version' for org.apache.maven.plugins:maven-javadoc-plugin is missing. @ org.xdi:saml-openid-auth-client:[unknown-version], /home/jenkins/.jenkins/jobs/oxTrust/workspace/saml-openid-auth-client/pom.xml, line 22, column 21
[WARNING] 
[WARNING] Some problems were encountered while building the effective model for org.xdi:cas-openid-auth-client:jar:3.1.5.sp5
[WARNING] 'dependencyManagement.dependencies.dependency.(groupId:artifactId:type:classifier)' must be unique: org.xdi:oxtrust-model:jar -> duplicate declaration of version ${project.version} @ org.xdi:oxtrust:3.1.5.sp5, /home/jenkins/.jenkins/jobs/oxTrust/workspace/pom.xml, line 146, column 25
[WARNING] 'build.plugins.plugin.version' for org.apache.maven.plugins:maven-javadoc-plugin is missing. @ org.xdi:cas-openid-auth-client:[unknown-version], /home/jenkins/.jenkins/jobs/oxTrust/workspace/cas-openid-auth-client/pom.xml, line 27, column 12
[WARNING] 
[WARNING] Some problems were encountered while building the effective model for org.xdi:oxtrust:pom:3.1.5.sp5
[WARNING] 'dependencyManagement.dependencies.dependency.(groupId:artifactId:type:classifier)' must be unique: org.xdi:oxtrust-model:jar -> duplicate declaration of version ${project.version} @ line 146, column 25
[WARNING] 
[WARNING] It is highly recommended to fix these problems because they threaten the stability of your build.
[WARNING] 
[WARNING] For this reason, future Maven versions might no longer support building such malformed projects.
[WARNING] 
[INFO] ------------------------------------------------------------------------
[INFO] Reactor Build Order:
[INFO] 
[INFO] oxTrust
[INFO] oxTrust static resources
[INFO] oxTrust configuration
[INFO] oxTrust Model library
[INFO] OpenId authentication module
[INFO] oxtrust-scim
[INFO] oxTrust Server
[INFO] OpenId authentication module for Saml
[INFO] OpenId authentication module for CAS
[INFO]                                                                         
[INFO] ------------------------------------------------------------------------
[INFO] Building oxTrust 3.1.5.sp5
[INFO] ------------------------------------------------------------------------
[INFO] 
[INFO] --- maven-clean-plugin:2.5:clean (default-clean) @ oxtrust ---
[INFO] Deleting /home/jenkins/.jenkins/jobs/oxTrust/workspace/target
[INFO] 
[INFO] --- maven-install-plugin:2.3.1:install (default-install) @ oxtrust ---
[INFO] Installing /home/jenkins/.jenkins/jobs/oxTrust/workspace/pom.xml to /var/www/html/maven/org/xdi/oxtrust/3.1.5.sp5/oxtrust-3.1.5.sp5.pom
[INFO] 
[INFO] --- findbugs-maven-plugin:3.0.4:findbugs (default-cli) @ oxtrust ---
WARNING: An illegal reflective access operation has occurred
WARNING: Illegal reflective access by org.codehaus.groovy.reflection.CachedClass$3$1 (file:/var/www/html/maven/org/codehaus/groovy/groovy/2.4.7/groovy-2.4.7.jar) to method java.lang.Object.finalize()
WARNING: Please consider reporting this to the maintainers of org.codehaus.groovy.reflection.CachedClass$3$1
WARNING: Use --illegal-access=warn to enable warnings of further illegal reflective access operations
WARNING: All illegal access operations will be denied in a future release
[INFO] 
[INFO] --- maven-site-plugin:2.1.1:site (default-site) @ oxtrust ---
Downloading: http://repo2.maven.org/maven2/org/bouncycastle/org/apache/maven/skins/maven-default-skin/maven-metadata.xml

[WARNING] Could not transfer metadata org.apache.maven.skins:maven-default-skin/maven-metadata.xml from/to bouncycastle (http://repo2.maven.org/maven2/org/bouncycastle): repo2.maven.org: Name or service not known
[INFO]                                                                         
[INFO] ------------------------------------------------------------------------
[INFO] Building oxTrust static resources 3.1.5.sp5
[INFO] ------------------------------------------------------------------------
[INFO] 
[INFO] --- maven-clean-plugin:2.5:clean (default-clean) @ oxtrust-static ---
[INFO] Deleting /home/jenkins/.jenkins/jobs/oxTrust/workspace/static/target
[INFO] 
[INFO] --- maven-resources-plugin:2.6:resources (default-resources) @ oxtrust-static ---
[INFO] Using 'UTF-8' encoding to copy filtered resources.
[INFO] Copying 347 resources
[INFO] 
[INFO] --- maven-compiler-plugin:2.3.2:compile (default-compile) @ oxtrust-static ---
[INFO] No sources to compile
[INFO] 
[INFO] --- maven-resources-plugin:2.6:resources (default-resources) @ oxtrust-static ---
[INFO] Using 'UTF-8' encoding to copy filtered resources.
[INFO] Copying 347 resources
[INFO] 
[INFO] --- maven-compiler-plugin:2.3.2:compile (default-compile) @ oxtrust-static ---
[INFO] No sources to compile
[INFO] 
[INFO] --- maven-resources-plugin:2.6:testResources (default-testResources) @ oxtrust-static ---
[INFO] Not copying test resources
[INFO] 
[INFO] --- maven-compiler-plugin:2.3.2:testCompile (default-testCompile) @ oxtrust-static ---
[INFO] Not compiling test sources
[INFO] 
[INFO] --- maven-surefire-plugin:2.19.1:test (default-test) @ oxtrust-static ---
[INFO] Tests are skipped.
[INFO] 
[INFO] --- maven-jar-plugin:2.4:jar (default-jar) @ oxtrust-static ---
[INFO] Building jar: /home/jenkins/.jenkins/jobs/oxTrust/workspace/static/target/oxtrust-static-3.1.5.sp5.jar
[INFO] 
[INFO] --- maven-jar-plugin:2.4:test-jar (default) @ oxtrust-static ---
[INFO] Skipping packaging of the test-jar
[INFO] 
[INFO] --- maven-install-plugin:2.3.1:install (default-install) @ oxtrust-static ---
[INFO] Installing /home/jenkins/.jenkins/jobs/oxTrust/workspace/static/target/oxtrust-static-3.1.5.sp5.jar to /var/www/html/maven/org/xdi/oxtrust-static/3.1.5.sp5/oxtrust-static-3.1.5.sp5.jar
[INFO] Installing /home/jenkins/.jenkins/jobs/oxTrust/workspace/static/pom.xml to /var/www/html/maven/org/xdi/oxtrust-static/3.1.5.sp5/oxtrust-static-3.1.5.sp5.pom
[INFO] 
[INFO] --- findbugs-maven-plugin:3.0.4:findbugs (default-cli) @ oxtrust-static ---
[INFO] 
[INFO] --- maven-site-plugin:2.1.1:site (default-site) @ oxtrust-static ---
[INFO]                                                                         
[INFO] ------------------------------------------------------------------------
[INFO] Building oxTrust configuration 3.1.5.sp5
[INFO] ------------------------------------------------------------------------
[INFO] 
[INFO] --- maven-clean-plugin:2.5:clean (default-clean) @ oxtrust-configuration ---
[INFO] Deleting /home/jenkins/.jenkins/jobs/oxTrust/workspace/configuration/target
[INFO] 
[INFO] --- maven-resources-plugin:2.6:resources (default-resources) @ oxtrust-configuration ---
[INFO] Using 'UTF-8' encoding to copy filtered resources.
[INFO] Copying 32 resources
[INFO] 
[INFO] --- maven-compiler-plugin:2.3.2:compile (default-compile) @ oxtrust-configuration ---
[INFO] No sources to compile
[INFO] 
[INFO] --- maven-resources-plugin:2.6:resources (default-resources) @ oxtrust-configuration ---
[INFO] Using 'UTF-8' encoding to copy filtered resources.
[INFO] Copying 32 resources
[INFO] 
[INFO] --- maven-compiler-plugin:2.3.2:compile (default-compile) @ oxtrust-configuration ---
[INFO] No sources to compile
[INFO] 
[INFO] --- maven-resources-plugin:2.6:testResources (default-testResources) @ oxtrust-configuration ---
[INFO] Not copying test resources
[INFO] 
[INFO] --- maven-compiler-plugin:2.3.2:testCompile (default-testCompile) @ oxtrust-configuration ---
[INFO] Not compiling test sources
[INFO] 
[INFO] --- maven-surefire-plugin:2.19.1:test (default-test) @ oxtrust-configuration ---
[INFO] Tests are skipped.
[INFO] 
[INFO] --- maven-jar-plugin:2.4:jar (default-jar) @ oxtrust-configuration ---
[INFO] Building jar: /home/jenkins/.jenkins/jobs/oxTrust/workspace/configuration/target/oxtrust-configuration-3.1.5.sp5.jar
[INFO] 
[INFO] --- maven-jar-plugin:2.4:test-jar (default) @ oxtrust-configuration ---
[INFO] Skipping packaging of the test-jar
[INFO] 
[INFO] --- maven-install-plugin:2.3.1:install (default-install) @ oxtrust-configuration ---
[INFO] Installing /home/jenkins/.jenkins/jobs/oxTrust/workspace/configuration/target/oxtrust-configuration-3.1.5.sp5.jar to /var/www/html/maven/org/xdi/oxtrust-configuration/3.1.5.sp5/oxtrust-configuration-3.1.5.sp5.jar
[INFO] Installing /home/jenkins/.jenkins/jobs/oxTrust/workspace/configuration/pom.xml to /var/www/html/maven/org/xdi/oxtrust-configuration/3.1.5.sp5/oxtrust-configuration-3.1.5.sp5.pom
[INFO] 
[INFO] --- findbugs-maven-plugin:3.0.4:findbugs (default-cli) @ oxtrust-configuration ---
[INFO] 
[INFO] --- maven-site-plugin:2.1.1:site (default-site) @ oxtrust-configuration ---
[INFO]                                                                         
[INFO] ------------------------------------------------------------------------
[INFO] Building oxTrust Model library 3.1.5.sp5
[INFO] ------------------------------------------------------------------------
Downloading: http://repository.jboss.org/nexus/content/groups/public-jboss/commons-io/commons-io/2.6/commons-io-2.6.jar
4/210 KB   
7/210 KB   
11/210 KB   
13/210 KB   
17/210 KB   
21/210 KB   
23/210 KB   
24/210 KB   
28/210 KB   
32/210 KB   
36/210 KB   
40/210 KB   
44/210 KB   
45/210 KB   
46/210 KB   
48/210 KB   
52/210 KB   
53/210 KB   
54/210 KB   
58/210 KB   
61/210 KB   
65/210 KB   
66/210 KB   
67/210 KB   
69/210 KB   
71/210 KB   
73/210 KB   
77/210 KB   
81/210 KB   
82/210 KB   
83/210 KB   
87/210 KB   
91/210 KB   
92/210 KB   
96/210 KB   
99/210 KB   
100/210 KB   
104/210 KB   
107/210 KB   
111/210 KB   
115/210 KB   
117/210 KB   
119/210 KB   
123/210 KB   
127/210 KB   
128/210 KB   
131/210 KB   
135/210 KB   
139/210 KB   
143/210 KB   
147/210 KB   
149/210 KB   
153/210 KB   
157/210 KB   
161/210 KB   
165/210 KB   
169/210 KB   
173/210 KB   
177/210 KB   
181/210 KB   
185/210 KB   
189/210 KB   
193/210 KB   
197/210 KB   
201/210 KB   
205/210 KB   
209/210 KB   
210/210 KB   
             
Downloaded: http://repository.jboss.org/nexus/content/groups/public-jboss/commons-io/commons-io/2.6/commons-io-2.6.jar (210 KB at 183.8 KB/sec)
[INFO] 
[INFO] --- maven-clean-plugin:2.5:clean (default-clean) @ oxtrust-model ---
[INFO] Deleting /home/jenkins/.jenkins/jobs/oxTrust/workspace/model/target
[INFO] 
[INFO] --- maven-resources-plugin:2.6:resources (default-resources) @ oxtrust-model ---
[INFO] Using 'UTF-8' encoding to copy filtered resources.
[INFO] skip non existing resourceDirectory /home/jenkins/.jenkins/jobs/oxTrust/workspace/model/src/main/resources
[INFO] 
[INFO] --- maven-compiler-plugin:2.3.2:compile (default-compile) @ oxtrust-model ---
[INFO] Compiling 4 source files to /home/jenkins/.jenkins/jobs/oxTrust/workspace/model/target/classes
[INFO] 
[INFO] --- maven-resources-plugin:2.6:resources (default-resources) @ oxtrust-model ---
[INFO] Using 'UTF-8' encoding to copy filtered resources.
[INFO] skip non existing resourceDirectory /home/jenkins/.jenkins/jobs/oxTrust/workspace/model/src/main/resources
[INFO] 
[INFO] --- maven-compiler-plugin:2.3.2:compile (default-compile) @ oxtrust-model ---
[INFO] Nothing to compile - all classes are up to date
[INFO] 
[INFO] --- maven-resources-plugin:2.6:testResources (default-testResources) @ oxtrust-model ---
[INFO] Not copying test resources
[INFO] 
[INFO] --- maven-compiler-plugin:2.3.2:testCompile (default-testCompile) @ oxtrust-model ---
[INFO] Not compiling test sources
[INFO] 
[INFO] --- maven-surefire-plugin:2.19.1:test (default-test) @ oxtrust-model ---
[INFO] Tests are skipped.
[INFO] 
[INFO] --- maven-jar-plugin:2.4:jar (default-jar) @ oxtrust-model ---
[INFO] Building jar: /home/jenkins/.jenkins/jobs/oxTrust/workspace/model/target/oxtrust-model-3.1.5.sp5.jar
[INFO] 
[INFO] --- maven-jar-plugin:2.4:test-jar (default) @ oxtrust-model ---
[INFO] Skipping packaging of the test-jar
[INFO] 
[INFO] --- maven-install-plugin:2.3.1:install (default-install) @ oxtrust-model ---
[INFO] Installing /home/jenkins/.jenkins/jobs/oxTrust/workspace/model/target/oxtrust-model-3.1.5.sp5.jar to /var/www/html/maven/org/xdi/oxtrust-model/3.1.5.sp5/oxtrust-model-3.1.5.sp5.jar
[INFO] Installing /home/jenkins/.jenkins/jobs/oxTrust/workspace/model/pom.xml to /var/www/html/maven/org/xdi/oxtrust-model/3.1.5.sp5/oxtrust-model-3.1.5.sp5.pom
[INFO] 
[INFO] --- findbugs-maven-plugin:3.0.4:findbugs (default-cli) @ oxtrust-model ---
[INFO] Fork Value is true
     [java] The following classes needed for analysis were missing:
     [java]   java.lang.Object
     [java]   java.util.ArrayList
     [java]   java.lang.String
     [java]   java.lang.NoSuchFieldError
     [java] Missing classes: 2
[INFO] Done FindBugs Analysis....
[INFO] 
[INFO] --- maven-site-plugin:2.1.1:site (default-site) @ oxtrust-model ---
[INFO]                                                                         
[INFO] ------------------------------------------------------------------------
[INFO] Building OpenId authentication module 3.1.5.sp5
[INFO] ------------------------------------------------------------------------
Downloading: http://repository.jboss.org/nexus/content/groups/public-jboss/net/minidev/json-smart/maven-metadata.xml
Downloading: http://repo1.maven.org/maven2/net/minidev/json-smart/maven-metadata.xml
Downloading: http://ox.gluu.org/maven/net/minidev/json-smart/maven-metadata.xml
Downloading: http://repo2.maven.org/maven2/org/bouncycastle/net/minidev/json-smart/maven-metadata.xml
             
Downloading: https://build.shibboleth.net/nexus/content/repositories/releases/net/minidev/json-smart/maven-metadata.xml
             
Downloading: https://repo.maven.apache.org/maven2/net/minidev/json-smart/maven-metadata.xml
             
2/2 KB       
         
         
Downloaded: https://repo.maven.apache.org/maven2/net/minidev/json-smart/maven-metadata.xml (2 KB at 17.5 KB/sec)
849/849 B   
            
Downloaded: http://repository.jboss.org/nexus/content/groups/public-jboss/net/minidev/json-smart/maven-metadata.xml (849 B at 2.9 KB/sec)
[WARNING] Could not transfer metadata net.minidev:json-smart/maven-metadata.xml from/to bouncycastle (http://repo2.maven.org/maven2/org/bouncycastle): repo2.maven.org
[WARNING] Could not transfer metadata net.minidev:json-smart/maven-metadata.xml from/to mavencentral (http://repo1.maven.org/maven2): Failed to transfer file: http://repo1.maven.org/maven2/net/minidev/json-smart/maven-metadata.xml. Return code is: 501 , ReasonPhrase:HTTPS Required.
Downloading: http://repository.jboss.org/nexus/content/groups/public-jboss/commons-cli/commons-cli/1.3.1/commons-cli-1.3.1.pom
4/11 KB     
5/11 KB   
9/11 KB   
11/11 KB   
           
Downloaded: http://repository.jboss.org/nexus/content/groups/public-jboss/commons-cli/commons-cli/1.3.1/commons-cli-1.3.1.pom (11 KB at 34.9 KB/sec)
Downloading: http://repository.jboss.org/nexus/content/groups/public-jboss/commons-cli/commons-cli/1.3.1/commons-cli-1.3.1.jar
2/52 KB    
6/52 KB   
10/52 KB   
14/52 KB   
15/52 KB   
16/52 KB   
19/52 KB   
21/52 KB   
25/52 KB   
28/52 KB   
32/52 KB   
34/52 KB   
36/52 KB   
38/52 KB   
40/52 KB   
41/52 KB   
42/52 KB   
46/52 KB   
49/52 KB   
52/52 KB   
           
Downloaded: http://repository.jboss.org/nexus/content/groups/public-jboss/commons-cli/commons-cli/1.3.1/commons-cli-1.3.1.jar (52 KB at 178.4 KB/sec)
[INFO] 
[INFO] --- maven-clean-plugin:2.5:clean (default-clean) @ openid-auth-client ---
[INFO] Deleting /home/jenkins/.jenkins/jobs/oxTrust/workspace/openid-auth-client/target
[INFO] 
[INFO] --- maven-resources-plugin:2.6:resources (default-resources) @ openid-auth-client ---
[INFO] Using 'UTF-8' encoding to copy filtered resources.
[INFO] skip non existing resourceDirectory /home/jenkins/.jenkins/jobs/oxTrust/workspace/openid-auth-client/src/main/resources
[INFO] 
[INFO] --- maven-compiler-plugin:2.3.2:compile (default-compile) @ openid-auth-client ---
[INFO] Compiling 10 source files to /home/jenkins/.jenkins/jobs/oxTrust/workspace/openid-auth-client/target/classes
[INFO] 
[INFO] --- maven-resources-plugin:2.6:resources (default-resources) @ openid-auth-client ---
[INFO] Using 'UTF-8' encoding to copy filtered resources.
[INFO] skip non existing resourceDirectory /home/jenkins/.jenkins/jobs/oxTrust/workspace/openid-auth-client/src/main/resources
[INFO] 
[INFO] --- maven-compiler-plugin:2.3.2:compile (default-compile) @ openid-auth-client ---
[INFO] Nothing to compile - all classes are up to date
[INFO] 
[INFO] --- maven-resources-plugin:2.6:testResources (default-testResources) @ openid-auth-client ---
[INFO] Not copying test resources
[INFO] 
[INFO] --- maven-compiler-plugin:2.3.2:testCompile (default-testCompile) @ openid-auth-client ---
[INFO] Not compiling test sources
[INFO] 
[INFO] --- maven-surefire-plugin:2.19.1:test (default-test) @ openid-auth-client ---
[INFO] Tests are skipped.
[INFO] 
[INFO] --- maven-jar-plugin:2.4:jar (default-jar) @ openid-auth-client ---
[INFO] Building jar: /home/jenkins/.jenkins/jobs/oxTrust/workspace/openid-auth-client/target/openid-auth-client-3.1.5.sp5.jar
[INFO] 
[INFO] --- maven-jar-plugin:2.4:test-jar (default) @ openid-auth-client ---
[INFO] Skipping packaging of the test-jar
[INFO] 
[INFO] --- maven-install-plugin:2.3.1:install (default-install) @ openid-auth-client ---
[INFO] Installing /home/jenkins/.jenkins/jobs/oxTrust/workspace/openid-auth-client/target/openid-auth-client-3.1.5.sp5.jar to /var/www/html/maven/org/xdi/openid-auth-client/3.1.5.sp5/openid-auth-client-3.1.5.sp5.jar
[INFO] Installing /home/jenkins/.jenkins/jobs/oxTrust/workspace/openid-auth-client/pom.xml to /var/www/html/maven/org/xdi/openid-auth-client/3.1.5.sp5/openid-auth-client-3.1.5.sp5.pom
[INFO] 
[INFO] --- findbugs-maven-plugin:3.0.4:findbugs (default-cli) @ openid-auth-client ---
[INFO] Fork Value is true
     [java] The following classes needed for analysis were missing:
     [java]   java.lang.Object
     [java]   java.io.Serializable
     [java]   java.lang.RuntimeException
     [java]   java.lang.StringBuilder
     [java]   java.util.HashMap
     [java]   java.util.Collections
     [java]   java.util.Map
     [java]   java.io.File
     [java]   java.util.concurrent.atomic.AtomicBoolean
     [java]   java.lang.Exception
     [java]   java.lang.System
     [java]   java.util.concurrent.locks.ReentrantLock
     [java]   java.util.Date
     [java]   java.util.Arrays
     [java]   java.lang.Class
     [java]   java.util.Set
     [java]   java.util.Iterator
     [java]   java.util.Map$Entry
     [java]   java.lang.Boolean
     [java]   java.lang.Integer
     [java]   java.util.List
     [java]   java.lang.NoSuchFieldError
     [java]   java.lang.UnsatisfiedLinkError
     [java]   java.lang.String
     [java]   java.lang.IllegalAccessError
     [java]   java.lang.IncompatibleClassChangeError
     [java]   java.lang.Error
     [java]   java.lang.AbstractMethodError
     [java]   java.lang.ClassFormatError
     [java]   java.lang.VerifyError
     [java]   java.lang.ExceptionInInitializerError
     [java]   java.lang.NegativeArraySizeException
     [java]   java.lang.ClassCastException
     [java]   java.lang.Enum
     [java] Missing classes: 28
[INFO] Done FindBugs Analysis....
[INFO] 
[INFO] --- maven-site-plugin:2.1.1:site (default-site) @ openid-auth-client ---
[INFO]                                                                         
[INFO] ------------------------------------------------------------------------
[INFO] Building oxtrust-scim 3.1.5.sp5
[INFO] ------------------------------------------------------------------------
[INFO] 
[INFO] --- maven-clean-plugin:2.5:clean (default-clean) @ oxtrust-scim ---
[INFO] 
[INFO] --- maven-resources-plugin:2.6:resources (default-resources) @ oxtrust-scim ---
[INFO] Using 'UTF-8' encoding to copy filtered resources.
[INFO] skip non existing resourceDirectory /home/jenkins/.jenkins/jobs/oxTrust/workspace/scim/src/main/resources
[INFO] 
[INFO] --- maven-compiler-plugin:2.3.2:compile (default-compile) @ oxtrust-scim ---
[INFO] Compiling 65 source files to /home/jenkins/.jenkins/jobs/oxTrust/workspace/scim/target/classes
[INFO] 
[INFO] --- maven-resources-plugin:2.6:resources (default-resources) @ oxtrust-scim ---
[INFO] Using 'UTF-8' encoding to copy filtered resources.
[INFO] skip non existing resourceDirectory /home/jenkins/.jenkins/jobs/oxTrust/workspace/scim/src/main/resources
[INFO] 
[INFO] --- maven-compiler-plugin:2.3.2:compile (default-compile) @ oxtrust-scim ---
[INFO] Compiling 6 source files to /home/jenkins/.jenkins/jobs/oxTrust/workspace/scim/target/classes
[INFO] 
[INFO] --- maven-resources-plugin:2.6:testResources (default-testResources) @ oxtrust-scim ---
[INFO] Not copying test resources
[INFO] 
[INFO] --- maven-compiler-plugin:2.3.2:testCompile (default-testCompile) @ oxtrust-scim ---
[INFO] Not compiling test sources
[INFO] 
[INFO] --- maven-surefire-plugin:2.19.1:test (default-test) @ oxtrust-scim ---
[INFO] Tests are skipped.
[INFO] 
[INFO] --- maven-jar-plugin:2.4:jar (default-jar) @ oxtrust-scim ---
[INFO] Building jar: /home/jenkins/.jenkins/jobs/oxTrust/workspace/scim/target/oxtrust-scim-3.1.5.sp5.jar
[INFO] 
[INFO] --- maven-jar-plugin:2.4:test-jar (default) @ oxtrust-scim ---
[INFO] Skipping packaging of the test-jar
[INFO] 
[INFO] --- maven-install-plugin:2.3.1:install (default-install) @ oxtrust-scim ---
[INFO] Installing /home/jenkins/.jenkins/jobs/oxTrust/workspace/scim/target/oxtrust-scim-3.1.5.sp5.jar to /var/www/html/maven/org/xdi/oxtrust-scim/3.1.5.sp5/oxtrust-scim-3.1.5.sp5.jar
[INFO] Installing /home/jenkins/.jenkins/jobs/oxTrust/workspace/scim/pom.xml to /var/www/html/maven/org/xdi/oxtrust-scim/3.1.5.sp5/oxtrust-scim-3.1.5.sp5.pom
[INFO] 
[INFO] --- findbugs-maven-plugin:3.0.4:findbugs (default-cli) @ oxtrust-scim ---
[INFO] Fork Value is true
     [java] The following classes needed for analysis were missing:
     [java]   java.lang.Enum
     [java]   java.lang.Object
     [java]   java.io.Serializable
     [java]   java.lang.RuntimeException
     [java]   java.lang.annotation.Annotation
     [java]   java.lang.Comparable
     [java]   java.util.Map
     [java]   java.lang.Class
     [java]   java.lang.String
     [java]   java.util.Collection
     [java]   java.lang.StringBuilder
     [java]   java.util.HashMap
     [java]   java.util.Set
     [java]   java.util.Iterator
     [java]   java.lang.Boolean
     [java]   java.util.Arrays
     [java]   java.lang.Integer
     [java]   java.util.List
     [java]   java.util.HashSet
     [java]   java.lang.Exception
     [java]   java.util.Collections
     [java]   java.util.regex.Pattern
     [java]   java.util.regex.Matcher
     [java]   java.net.URI
     [java]   java.util.Locale
     [java]   java.util.TimeZone
     [java]   javax.management.InvalidAttributeValueException
     [java]   java.lang.reflect.Field
     [java]   java.util.ArrayList
     [java]   java.util.SortedSet
     [java]   java.lang.reflect.Method
     [java]   java.lang.Double
     [java]   java.util.Date
     [java]   java.beans.Introspector
     [java]   java.beans.BeanInfo
     [java]   java.beans.PropertyDescriptor
     [java]   java.util.TreeSet
     [java]   java.lang.NoSuchFieldError
     [java]   java.lang.IllegalAccessError
     [java]   java.lang.NoSuchMethodError
     [java]   java.lang.UnsatisfiedLinkError
     [java]   java.lang.IncompatibleClassChangeError
     [java]   java.lang.Error
     [java]   java.lang.AbstractMethodError
     [java]   java.lang.NoClassDefFoundError
     [java]   java.lang.ArrayIndexOutOfBoundsException
     [java]   java.lang.ClassFormatError
     [java]   java.lang.VerifyError
     [java]   java.lang.ExceptionInInitializerError
     [java]   java.lang.NegativeArraySizeException
     [java]   java.lang.ClassCastException
     [java]   java.util.Arrays$ArrayList
     [java]   javax.lang.model.type.NullType
     [java]   java.lang.NullPointerException
     [java] Warnings generated: 23
     [java] Missing classes: 41
[INFO] Done FindBugs Analysis....
[INFO] 
[INFO] --- maven-site-plugin:2.1.1:site (default-site) @ oxtrust-scim ---
[INFO]                                                                         
[INFO] ------------------------------------------------------------------------
[INFO] Building oxTrust Server 3.1.5.sp5
[INFO] ------------------------------------------------------------------------
[WARNING] Failure to transfer net.minidev:json-smart/maven-metadata.xml from http://repo2.maven.org/maven2/org/bouncycastle was cached in the local repository, resolution will not be reattempted until the update interval of bouncycastle has elapsed or updates are forced. Original error: Could not transfer metadata net.minidev:json-smart/maven-metadata.xml from/to bouncycastle (http://repo2.maven.org/maven2/org/bouncycastle): repo2.maven.org
[WARNING] Failure to transfer net.minidev:json-smart/maven-metadata.xml from http://repo1.maven.org/maven2 was cached in the local repository, resolution will not be reattempted until the update interval of mavencentral has elapsed or updates are forced. Original error: Could not transfer metadata net.minidev:json-smart/maven-metadata.xml from/to mavencentral (http://repo1.maven.org/maven2): Failed to transfer file: http://repo1.maven.org/maven2/net/minidev/json-smart/maven-metadata.xml. Return code is: 501 , ReasonPhrase:HTTPS Required.
Downloading: http://repository.jboss.org/nexus/content/groups/public-jboss/commons-beanutils/commons-beanutils/1.9.3/commons-beanutils-1.9.3.pom
4/15 KB    
8/15 KB   
12/15 KB   
15/15 KB   
           
Downloaded: http://repository.jboss.org/nexus/content/groups/public-jboss/commons-beanutils/commons-beanutils/1.9.3/commons-beanutils-1.9.3.pom (15 KB at 51.2 KB/sec)
Downloading: http://repository.jboss.org/nexus/content/groups/public-jboss/commons-beanutils/commons-beanutils/1.9.3/commons-beanutils-1.9.3.jar
4/241 KB   
5/241 KB   
9/241 KB   
13/241 KB   
17/241 KB   
20/241 KB   
23/241 KB   
24/241 KB   
28/241 KB   
29/241 KB   
33/241 KB   
37/241 KB   
40/241 KB   
44/241 KB   
46/241 KB   
50/241 KB   
53/241 KB   
54/241 KB   
58/241 KB   
59/241 KB   
63/241 KB   
67/241 KB   
71/241 KB   
75/241 KB   
79/241 KB   
82/241 KB   
83/241 KB   
84/241 KB   
88/241 KB   
91/241 KB   
92/241 KB   
96/241 KB   
100/241 KB   
102/241 KB   
103/241 KB   
104/241 KB   
106/241 KB   
110/241 KB   
114/241 KB   
116/241 KB   
119/241 KB   
123/241 KB   
127/241 KB   
129/241 KB   
131/241 KB   
135/241 KB   
139/241 KB   
141/241 KB   
145/241 KB   
149/241 KB   
153/241 KB   
157/241 KB   
161/241 KB   
163/241 KB   
165/241 KB   
166/241 KB   
167/241 KB   
171/241 KB   
174/241 KB   
177/241 KB   
178/241 KB   
182/241 KB   
186/241 KB   
190/241 KB   
191/241 KB   
192/241 KB   
195/241 KB   
196/241 KB   
198/241 KB   
202/241 KB   
206/241 KB   
210/241 KB   
214/241 KB   
218/241 KB   
221/241 KB   
225/241 KB   
229/241 KB   
233/241 KB   
237/241 KB   
238/241 KB   
240/241 KB   
241/241 KB   
             
Downloaded: http://repository.jboss.org/nexus/content/groups/public-jboss/commons-beanutils/commons-beanutils/1.9.3/commons-beanutils-1.9.3.jar (241 KB at 614.8 KB/sec)
[INFO] 
[INFO] --- maven-clean-plugin:2.5:clean (default-clean) @ oxtrust-server ---
[INFO] Deleting /home/jenkins/.jenkins/jobs/oxTrust/workspace/server/target
[INFO] 
[INFO] --- buildnumber-maven-plugin:1.1:create (default) @ oxtrust-server ---
[INFO] Checking for local modifications: skipped.
[INFO] Updating project files from SCM: skipped.
[INFO] Executing: /bin/sh -c cd /home/jenkins/.jenkins/jobs/oxTrust/workspace/server && git rev-parse --verify HEAD
[INFO] Working directory: /home/jenkins/.jenkins/jobs/oxTrust/workspace/server
[INFO] Storing buildNumber: ec4aeccbaae6d9d863125941cade79849962d9da at timestamp: 1637013693423
[INFO] Executing: /bin/sh -c cd /home/jenkins/.jenkins/jobs/oxTrust/workspace/server && git rev-parse --verify HEAD
[INFO] Working directory: /home/jenkins/.jenkins/jobs/oxTrust/workspace/server
[INFO] Storing buildScmBranch: UNKNOWN
[INFO] 
[INFO] --- maven-resources-plugin:2.6:resources (default-resources) @ oxtrust-server ---
[INFO] Using 'UTF-8' encoding to copy filtered resources.
[INFO] Copying 96 resources
[INFO] 
[INFO] --- maven-compiler-plugin:2.3.2:compile (default-compile) @ oxtrust-server ---
[INFO] Compiling 322 source files to /home/jenkins/.jenkins/jobs/oxTrust/workspace/server/target/classes
[INFO] -------------------------------------------------------------
[ERROR] COMPILATION ERROR : 
[INFO] -------------------------------------------------------------
[ERROR] /home/jenkins/.jenkins/jobs/oxTrust/workspace/server/src/main/java/org/gluu/oxtrust/service/antlr/scimFilter/util/FilterUtil.java:[178,20] error: cannot find symbol
[ERROR]  class FilterUtil
/home/jenkins/.jenkins/jobs/oxTrust/workspace/server/src/main/java/org/gluu/oxtrust/service/antlr/scimFilter/util/FilterUtil.java:[182,34] error: method applyPrefix in class FilterUtil cannot be applied to given types;
[INFO] 2 errors 
[INFO] -------------------------------------------------------------
[INFO] ------------------------------------------------------------------------
[INFO] Reactor Summary:
[INFO] 
[INFO] oxTrust ............................................ SUCCESS [  2.085 s]
[INFO] oxTrust static resources ........................... SUCCESS [  1.289 s]
[INFO] oxTrust configuration .............................. SUCCESS [  0.376 s]
[INFO] oxTrust Model library .............................. SUCCESS [  5.283 s]
[INFO] OpenId authentication module ....................... SUCCESS [  5.806 s]
[INFO] oxtrust-scim ....................................... SUCCESS [  6.732 s]
[INFO] oxTrust Server ..................................... FAILURE [  5.747 s]
[INFO] OpenId authentication module for Saml .............. SKIPPED
[INFO] OpenId authentication module for CAS ............... SKIPPED
[INFO] ------------------------------------------------------------------------
[INFO] BUILD FAILURE
[INFO] ------------------------------------------------------------------------
[INFO] Total time: 28.386 s
[INFO] Finished at: 2021-11-15T22:01:37+00:00
[INFO] Final Memory: 62M/217M
[INFO] ------------------------------------------------------------------------
[ERROR] Failed to execute goal org.apache.maven.plugins:maven-compiler-plugin:2.3.2:compile (default-compile) on project oxtrust-server: Compilation failure: Compilation failure:
[ERROR] /home/jenkins/.jenkins/jobs/oxTrust/workspace/server/src/main/java/org/gluu/oxtrust/service/antlr/scimFilter/util/FilterUtil.java:[178,20] error: cannot find symbol
[ERROR] class FilterUtil
[ERROR] /home/jenkins/.jenkins/jobs/oxTrust/workspace/server/src/main/java/org/gluu/oxtrust/service/antlr/scimFilter/util/FilterUtil.java:[182,34] error: method applyPrefix in class FilterUtil cannot be applied to given types;
[ERROR] -> [Help 1]
[ERROR] 
[ERROR] To see the full stack trace of the errors, re-run Maven with the -e switch.
[ERROR] Re-run Maven using the -X switch to enable full debug logging.
[ERROR] 
[ERROR] For more information about the errors and possible solutions, please read the following articles:
[ERROR] [Help 1] http://cwiki.apache.org/confluence/display/MAVEN/MojoFailureException
[ERROR] 
[ERROR] After correcting the problems, you can resume the build with the command
[ERROR]   mvn <goals> -rf :oxtrust-server
Build step 'Invoke top-level Maven targets' marked build as failure
[FINDBUGS] Skipping publisher since build result is FAILURE
Publishing Javadoc
TestNG Reports Processing: START
Looking for TestNG results report in workspace using pattern: **/testng-results.xml
Did not find any matching files.
Not sending mail to unregistered user 343411+ossdhaval@users.noreply.github.com
Not sending mail to unregistered user Yuriy.Movchan@gmail.com
Sending e-mails to: support@gluu.org
ERROR: Couldn't connect to host, port: webmail.gluu.org, 465; timeout 60000
com.sun.mail.util.MailConnectException: Couldn't connect to host, port: webmail.gluu.org, 465; timeout 60000;
  nested exception is:
	java.net.SocketTimeoutException: connect timed out
	at com.sun.mail.smtp.SMTPTransport.openServer(SMTPTransport.java:2210)
	at com.sun.mail.smtp.SMTPTransport.protocolConnect(SMTPTransport.java:722)
	at javax.mail.Service.connect(Service.java:310)
	at javax.mail.Service.connect(Service.java:169)
	at javax.mail.Service.connect(Service.java:118)
	at javax.mail.Transport.send0(Transport.java:188)
	at javax.mail.Transport.send(Transport.java:118)
	at hudson.tasks.MailSender.run(MailSender.java:130)
	at hudson.tasks.Mailer.perform(Mailer.java:176)
	at hudson.tasks.Mailer.perform(Mailer.java:139)
	at hudson.tasks.BuildStepMonitor$1.perform(BuildStepMonitor.java:20)
	at hudson.model.AbstractBuild$AbstractBuildExecution.perform(AbstractBuild.java:741)
	at hudson.model.AbstractBuild$AbstractBuildExecution.performAllBuildSteps(AbstractBuild.java:690)
	at hudson.model.Build$BuildExecution.post2(Build.java:186)
	at hudson.model.AbstractBuild$AbstractBuildExecution.post(AbstractBuild.java:635)
	at hudson.model.Run.execute(Run.java:1905)
	at hudson.model.FreeStyleBuild.run(FreeStyleBuild.java:43)
	at hudson.model.ResourceController.execute(ResourceController.java:97)
	at hudson.model.Executor.run(Executor.java:428)
Caused by: java.net.SocketTimeoutException: connect timed out
	at java.net.PlainSocketImpl.socketConnect(Native Method)
	at java.net.AbstractPlainSocketImpl.doConnect(AbstractPlainSocketImpl.java:350)
	at java.net.AbstractPlainSocketImpl.connectToAddress(AbstractPlainSocketImpl.java:206)
	at java.net.AbstractPlainSocketImpl.connect(AbstractPlainSocketImpl.java:188)
	at java.net.SocksSocketImpl.connect(SocksSocketImpl.java:392)
	at java.net.Socket.connect(Socket.java:589)
	at com.sun.mail.util.SocketFetcher.createSocket(SocketFetcher.java:333)
	at com.sun.mail.util.SocketFetcher.getSocket(SocketFetcher.java:193)
	at com.sun.mail.smtp.SMTPTransport.openServer(SMTPTransport.java:2160)
	... 18 more
[Boolean condition] checking [false] against [^(1|y|yes|t|true|on|run)$] (origin token: $DEPLOY_BUILD)
Run condition [Boolean condition] preventing perform for step [Builder to mark whether executed]
Finished: FAILURE