FailedConsole Output

Started by an SCM change
Started by an SCM change
Started by an SCM change
Started by an SCM change
Running as SYSTEM
Building on master in workspace /home/jenkins/.jenkins/jobs/oxTrust/workspace
The recommended git tool is: NONE
No credentials specified
 > git rev-parse --is-inside-work-tree # timeout=10
Fetching changes from the remote Git repository
 > git config remote.origin.url https://github.com/GluuFederation/oxTrust # timeout=10
Fetching upstream changes from https://github.com/GluuFederation/oxTrust
 > git --version # timeout=10
 > git --version # 'git version 1.8.3.1'
 > git fetch --tags --progress https://github.com/GluuFederation/oxTrust +refs/heads/*:refs/remotes/origin/* # timeout=10
 > git rev-parse refs/remotes/origin/master^{commit} # timeout=10
 > git rev-parse refs/remotes/origin/origin/master^{commit} # timeout=10
Checking out Revision b5207f63f1420f622fa5e089cdfd434b211e0ca6 (refs/remotes/origin/master)
 > git config core.sparsecheckout # timeout=10
 > git checkout -f b5207f63f1420f622fa5e089cdfd434b211e0ca6 # timeout=10
Commit message: "Branch for version 4.4.0"
 > git rev-list --no-walk a3121f3bf0ef8d3c8ae0230bfd99b819d7109b8e # timeout=10
Run condition [Boolean condition] enabling prebuild for step [Trigger/call builds on other projects]
[workspace] $ /bin/bash /opt/jetty/temp/jenkins5537191449560470887.sh
Cloning into 'oxHudsonProfiles'...
[workspace] $ /home/jenkins/.jenkins/tools/hudson.tasks.Maven_MavenInstallation/maven_3.3.9/bin/mvn -DDEPLOY_BUILD=true -DVERSION_NAME=master -DPROFILE_NAME=ce-dev5.gluu.org -DDEVELOPMENT_BUILD=false -DMAVEN_SKIP_TESTS=false -Dpython.import.site=false -DPYTHON_HOME=/opt/jython -Dcfg=ce-dev5.gluu.org -Dmaven.test.skip=false -Ddevelopment-build=false -Dskip.qa.test=true clean compile install findbugs:findbugs site
[INFO] Scanning for projects...
[WARNING] 
[WARNING] Some problems were encountered while building the effective model for org.gluu:oxtrust-model:jar:4.4.0-SNAPSHOT
[WARNING] 'dependencies.dependency.(groupId:artifactId:type:classifier)' must be unique: com.fasterxml.jackson.core:jackson-annotations:jar -> duplicate declaration of version (?) @ org.gluu:oxtrust-model:[unknown-version], /home/jenkins/.jenkins/jobs/oxTrust/workspace/model/pom.xml, line 85, column 15
[WARNING] 'dependencies.dependency.(groupId:artifactId:type:classifier)' must be unique: com.fasterxml.jackson.core:jackson-core:jar -> duplicate declaration of version (?) @ org.gluu:oxtrust-model:[unknown-version], /home/jenkins/.jenkins/jobs/oxTrust/workspace/model/pom.xml, line 89, column 15
[WARNING] 'dependencies.dependency.(groupId:artifactId:type:classifier)' must be unique: com.fasterxml.jackson.core:jackson-databind:jar -> duplicate declaration of version (?) @ org.gluu:oxtrust-model:[unknown-version], /home/jenkins/.jenkins/jobs/oxTrust/workspace/model/pom.xml, line 93, column 15
[WARNING] 
[WARNING] Some problems were encountered while building the effective model for org.gluu:oxtrust-service:jar:4.4.0-SNAPSHOT
[WARNING] 'build.plugins.plugin.version' for org.apache.maven.plugins:maven-javadoc-plugin is missing. @ org.gluu:oxtrust-service:[unknown-version], /home/jenkins/.jenkins/jobs/oxTrust/workspace/service/pom.xml, line 42, column 12
[WARNING] 
[WARNING] Some problems were encountered while building the effective model for org.gluu:oxtrust-server:war:4.4.0-SNAPSHOT
[WARNING] 'build.plugins.plugin.version' for org.apache.maven.plugins:maven-javadoc-plugin is missing. @ org.gluu:oxtrust-server:[unknown-version], /home/jenkins/.jenkins/jobs/oxTrust/workspace/server/pom.xml, line 69, column 12
[WARNING] 
[WARNING] Some problems were encountered while building the effective model for org.gluu:oxtrust-openid-auth-client:jar:4.4.0-SNAPSHOT
[WARNING] 'build.plugins.plugin.version' for org.apache.maven.plugins:maven-javadoc-plugin is missing. @ org.gluu:oxtrust-openid-auth-client:[unknown-version], /home/jenkins/.jenkins/jobs/oxTrust/workspace/openid-auth-client/pom.xml, line 22, column 21
[WARNING] 
[WARNING] Some problems were encountered while building the effective model for org.gluu:oxtrust-saml-openid-auth-client:jar:4.4.0-SNAPSHOT
[WARNING] 'build.plugins.plugin.version' for org.apache.maven.plugins:maven-javadoc-plugin is missing. @ org.gluu:oxtrust-saml-openid-auth-client:[unknown-version], /home/jenkins/.jenkins/jobs/oxTrust/workspace/saml-openid-auth-client/pom.xml, line 22, column 21
[WARNING] 
[WARNING] Some problems were encountered while building the effective model for org.gluu:oxtrust-cas-openid-auth-client:jar:4.4.0-SNAPSHOT
[WARNING] 'build.plugins.plugin.version' for org.apache.maven.plugins:maven-javadoc-plugin is missing. @ org.gluu:oxtrust-cas-openid-auth-client:[unknown-version], /home/jenkins/.jenkins/jobs/oxTrust/workspace/cas-openid-auth-client/pom.xml, line 27, column 12
[WARNING] 
[WARNING] It is highly recommended to fix these problems because they threaten the stability of your build.
[WARNING] 
[WARNING] For this reason, future Maven versions might no longer support building such malformed projects.
[WARNING] 
[INFO] ------------------------------------------------------------------------
[INFO] Reactor Build Order:
[INFO] 
[INFO] oxTrust
[INFO] oxTrust static resources
[INFO] oxTrust configuration
[INFO] oxTrust Model library
[INFO] oxTrust Client library
[INFO] oxTrust Service
[INFO] OpenId authentication module
[INFO] oxTrust Server
[INFO] OpenId authentication module for Saml
[INFO] OpenId authentication module for CAS
[INFO] oxTrust Server Test
[INFO] API Server
[INFO]                                                                         
[INFO] ------------------------------------------------------------------------
[INFO] Building oxTrust 4.4.0-SNAPSHOT
[INFO] ------------------------------------------------------------------------
[INFO] 
[INFO] --- maven-clean-plugin:2.5:clean (default-clean) @ oxtrust ---
[INFO] Deleting /home/jenkins/.jenkins/jobs/oxTrust/workspace/target
[INFO] 
[INFO] --- maven-install-plugin:2.3.1:install (default-install) @ oxtrust ---
[INFO] Installing /home/jenkins/.jenkins/jobs/oxTrust/workspace/pom.xml to /var/www/html/maven/org/gluu/oxtrust/4.4.0-SNAPSHOT/oxtrust-4.4.0-SNAPSHOT.pom
[INFO] 
[INFO] --- findbugs-maven-plugin:3.0.4:findbugs (default-cli) @ oxtrust ---
WARNING: An illegal reflective access operation has occurred
WARNING: Illegal reflective access by org.codehaus.groovy.reflection.CachedClass$3$1 (file:/var/www/html/maven/org/codehaus/groovy/groovy/2.4.7/groovy-2.4.7.jar) to method java.lang.Object.finalize()
WARNING: Please consider reporting this to the maintainers of org.codehaus.groovy.reflection.CachedClass$3$1
WARNING: Use --illegal-access=warn to enable warnings of further illegal reflective access operations
WARNING: All illegal access operations will be denied in a future release
[INFO] 
[INFO] --- maven-site-plugin:2.1.1:site (default-site) @ oxtrust ---
Downloading: https://build.shibboleth.net/nexus/content/repositories/releases/org/apache/maven/skins/maven-default-skin/maven-metadata.xml

[INFO]                                                                         
[INFO] ------------------------------------------------------------------------
[INFO] Building oxTrust static resources 4.4.0-SNAPSHOT
[INFO] ------------------------------------------------------------------------
[INFO] 
[INFO] --- maven-clean-plugin:2.5:clean (default-clean) @ oxtrust-static ---
[INFO] Deleting /home/jenkins/.jenkins/jobs/oxTrust/workspace/static/target
[INFO] 
[INFO] --- maven-resources-plugin:2.6:resources (default-resources) @ oxtrust-static ---
[INFO] Using 'UTF-8' encoding to copy filtered resources.
[INFO] Copying 337 resources
[INFO] 
[INFO] --- maven-compiler-plugin:2.3.2:compile (default-compile) @ oxtrust-static ---
[INFO] No sources to compile
[INFO] 
[INFO] --- maven-resources-plugin:2.6:resources (default-resources) @ oxtrust-static ---
[INFO] Using 'UTF-8' encoding to copy filtered resources.
[INFO] Copying 337 resources
[INFO] 
[INFO] --- maven-compiler-plugin:2.3.2:compile (default-compile) @ oxtrust-static ---
[INFO] No sources to compile
[INFO] 
[INFO] --- maven-resources-plugin:2.6:testResources (default-testResources) @ oxtrust-static ---
[INFO] Using 'UTF-8' encoding to copy filtered resources.
[INFO] skip non existing resourceDirectory /home/jenkins/.jenkins/jobs/oxTrust/workspace/static/src/test/resources
[INFO] 
[INFO] --- maven-compiler-plugin:2.3.2:testCompile (default-testCompile) @ oxtrust-static ---
[INFO] No sources to compile
[INFO] 
[INFO] --- maven-surefire-plugin:2.19.1:test (default-test) @ oxtrust-static ---
[INFO] No tests to run.
[INFO] 
[INFO] --- maven-jar-plugin:2.4:jar (default-jar) @ oxtrust-static ---
[INFO] Building jar: /home/jenkins/.jenkins/jobs/oxTrust/workspace/static/target/oxtrust-static-4.4.0-SNAPSHOT.jar
[INFO] 
[INFO] --- maven-jar-plugin:2.4:test-jar (default) @ oxtrust-static ---
[WARNING] JAR will be empty - no content was marked for inclusion!
[INFO] Building jar: /home/jenkins/.jenkins/jobs/oxTrust/workspace/static/target/oxtrust-static-4.4.0-SNAPSHOT-tests.jar
[INFO] 
[INFO] --- maven-install-plugin:2.3.1:install (default-install) @ oxtrust-static ---
[INFO] Installing /home/jenkins/.jenkins/jobs/oxTrust/workspace/static/target/oxtrust-static-4.4.0-SNAPSHOT.jar to /var/www/html/maven/org/gluu/oxtrust-static/4.4.0-SNAPSHOT/oxtrust-static-4.4.0-SNAPSHOT.jar
[INFO] Installing /home/jenkins/.jenkins/jobs/oxTrust/workspace/static/pom.xml to /var/www/html/maven/org/gluu/oxtrust-static/4.4.0-SNAPSHOT/oxtrust-static-4.4.0-SNAPSHOT.pom
[INFO] Installing /home/jenkins/.jenkins/jobs/oxTrust/workspace/static/target/oxtrust-static-4.4.0-SNAPSHOT-tests.jar to /var/www/html/maven/org/gluu/oxtrust-static/4.4.0-SNAPSHOT/oxtrust-static-4.4.0-SNAPSHOT-tests.jar
[INFO] 
[INFO] --- findbugs-maven-plugin:3.0.4:findbugs (default-cli) @ oxtrust-static ---
[INFO] 
[INFO] --- maven-site-plugin:2.1.1:site (default-site) @ oxtrust-static ---
[INFO]                                                                         
[INFO] ------------------------------------------------------------------------
[INFO] Building oxTrust configuration 4.4.0-SNAPSHOT
[INFO] ------------------------------------------------------------------------
[INFO] 
[INFO] --- maven-clean-plugin:2.5:clean (default-clean) @ oxtrust-configuration ---
[INFO] Deleting /home/jenkins/.jenkins/jobs/oxTrust/workspace/configuration/target
[INFO] 
[INFO] --- maven-resources-plugin:2.6:resources (default-resources) @ oxtrust-configuration ---
[INFO] Using 'UTF-8' encoding to copy filtered resources.
[INFO] Copying 3 resources
[INFO] Copying 32 resources
[INFO] 
[INFO] --- maven-compiler-plugin:2.3.2:compile (default-compile) @ oxtrust-configuration ---
[INFO] No sources to compile
[INFO] 
[INFO] --- maven-resources-plugin:2.6:resources (default-resources) @ oxtrust-configuration ---
[INFO] Using 'UTF-8' encoding to copy filtered resources.
[INFO] Copying 3 resources
[INFO] Copying 32 resources
[INFO] 
[INFO] --- maven-compiler-plugin:2.3.2:compile (default-compile) @ oxtrust-configuration ---
[INFO] No sources to compile
[INFO] 
[INFO] --- maven-resources-plugin:2.6:testResources (default-testResources) @ oxtrust-configuration ---
[INFO] Using 'UTF-8' encoding to copy filtered resources.
[INFO] skip non existing resourceDirectory /home/jenkins/.jenkins/jobs/oxTrust/workspace/configuration/src/test/resources
[INFO] 
[INFO] --- maven-compiler-plugin:2.3.2:testCompile (default-testCompile) @ oxtrust-configuration ---
[INFO] No sources to compile
[INFO] 
[INFO] --- maven-surefire-plugin:2.19.1:test (default-test) @ oxtrust-configuration ---
[INFO] No tests to run.
[INFO] 
[INFO] --- maven-jar-plugin:2.4:jar (default-jar) @ oxtrust-configuration ---
[INFO] Building jar: /home/jenkins/.jenkins/jobs/oxTrust/workspace/configuration/target/oxtrust-configuration-4.4.0-SNAPSHOT.jar
[INFO] 
[INFO] --- maven-jar-plugin:2.4:test-jar (default) @ oxtrust-configuration ---
[WARNING] JAR will be empty - no content was marked for inclusion!
[INFO] Building jar: /home/jenkins/.jenkins/jobs/oxTrust/workspace/configuration/target/oxtrust-configuration-4.4.0-SNAPSHOT-tests.jar
[INFO] 
[INFO] --- maven-install-plugin:2.3.1:install (default-install) @ oxtrust-configuration ---
[INFO] Installing /home/jenkins/.jenkins/jobs/oxTrust/workspace/configuration/target/oxtrust-configuration-4.4.0-SNAPSHOT.jar to /var/www/html/maven/org/gluu/oxtrust-configuration/4.4.0-SNAPSHOT/oxtrust-configuration-4.4.0-SNAPSHOT.jar
[INFO] Installing /home/jenkins/.jenkins/jobs/oxTrust/workspace/configuration/pom.xml to /var/www/html/maven/org/gluu/oxtrust-configuration/4.4.0-SNAPSHOT/oxtrust-configuration-4.4.0-SNAPSHOT.pom
[INFO] Installing /home/jenkins/.jenkins/jobs/oxTrust/workspace/configuration/target/oxtrust-configuration-4.4.0-SNAPSHOT-tests.jar to /var/www/html/maven/org/gluu/oxtrust-configuration/4.4.0-SNAPSHOT/oxtrust-configuration-4.4.0-SNAPSHOT-tests.jar
[INFO] 
[INFO] --- findbugs-maven-plugin:3.0.4:findbugs (default-cli) @ oxtrust-configuration ---
[INFO] 
[INFO] --- maven-site-plugin:2.1.1:site (default-site) @ oxtrust-configuration ---
[INFO]                                                                         
[INFO] ------------------------------------------------------------------------
[INFO] Building oxTrust Model library 4.4.0-SNAPSHOT
[INFO] ------------------------------------------------------------------------
Downloading: https://build.shibboleth.net/nexus/content/repositories/releases/org/gluu/oxcore-model/4.4.0-SNAPSHOT/maven-metadata.xml

Downloading: https://build.shibboleth.net/nexus/content/repositories/releases/org/gluu/oxcore-model/4.4.0-SNAPSHOT/oxcore-model-4.4.0-SNAPSHOT.pom

[WARNING] The POM for org.gluu:oxcore-model:jar:4.4.0-SNAPSHOT is missing, no dependency information available
Downloading: https://build.shibboleth.net/nexus/content/repositories/releases/org/gluu/oxcore-util/4.4.0-SNAPSHOT/maven-metadata.xml

Downloading: https://build.shibboleth.net/nexus/content/repositories/releases/org/gluu/oxcore-util/4.4.0-SNAPSHOT/oxcore-util-4.4.0-SNAPSHOT.pom

[WARNING] The POM for org.gluu:oxcore-util:jar:4.4.0-SNAPSHOT is missing, no dependency information available
Downloading: https://repo1.maven.org/maven2/org/gluu/oxcore-service/4.4.0-SNAPSHOT/maven-metadata.xml
Downloading: https://build.shibboleth.net/nexus/content/repositories/releases/org/gluu/oxcore-service/4.4.0-SNAPSHOT/maven-metadata.xml
Downloading: https://repository.jboss.org/nexus/content/groups/public-jboss/org/gluu/oxcore-service/4.4.0-SNAPSHOT/maven-metadata.xml



Downloading: https://repository.jboss.org/nexus/content/groups/public-jboss/org/gluu/oxcore-service/4.4.0-SNAPSHOT/oxcore-service-4.4.0-SNAPSHOT.pom

Downloading: https://ox.gluu.org/maven/org/gluu/oxcore-service/4.4.0-SNAPSHOT/oxcore-service-4.4.0-SNAPSHOT.pom

Downloading: https://repo1.maven.org/maven2/org/gluu/oxcore-service/4.4.0-SNAPSHOT/oxcore-service-4.4.0-SNAPSHOT.pom

Downloading: https://build.shibboleth.net/nexus/content/repositories/releases/org/gluu/oxcore-service/4.4.0-SNAPSHOT/oxcore-service-4.4.0-SNAPSHOT.pom

[WARNING] The POM for org.gluu:oxcore-service:jar:4.4.0-SNAPSHOT is missing, no dependency information available
Downloading: https://repo1.maven.org/maven2/org/gluu/oxcore-server/4.4.0-SNAPSHOT/maven-metadata.xml
Downloading: https://repository.jboss.org/nexus/content/groups/public-jboss/org/gluu/oxcore-server/4.4.0-SNAPSHOT/maven-metadata.xml
Downloading: https://ox.gluu.org/maven/org/gluu/oxcore-server/4.4.0-SNAPSHOT/maven-metadata.xml
Downloading: https://build.shibboleth.net/nexus/content/repositories/releases/org/gluu/oxcore-server/4.4.0-SNAPSHOT/maven-metadata.xml




Downloading: https://repository.jboss.org/nexus/content/groups/public-jboss/org/gluu/oxcore-server/4.4.0-SNAPSHOT/oxcore-server-4.4.0-SNAPSHOT.pom

Downloading: https://ox.gluu.org/maven/org/gluu/oxcore-server/4.4.0-SNAPSHOT/oxcore-server-4.4.0-SNAPSHOT.pom

Downloading: https://repo1.maven.org/maven2/org/gluu/oxcore-server/4.4.0-SNAPSHOT/oxcore-server-4.4.0-SNAPSHOT.pom

Downloading: https://build.shibboleth.net/nexus/content/repositories/releases/org/gluu/oxcore-server/4.4.0-SNAPSHOT/oxcore-server-4.4.0-SNAPSHOT.pom

[WARNING] The POM for org.gluu:oxcore-server:jar:4.4.0-SNAPSHOT is missing, no dependency information available
Downloading: https://ox.gluu.org/maven/org/gluu/oxcore-saml/4.4.0-SNAPSHOT/maven-metadata.xml
Downloading: https://repo1.maven.org/maven2/org/gluu/oxcore-saml/4.4.0-SNAPSHOT/maven-metadata.xml
Downloading: https://build.shibboleth.net/nexus/content/repositories/releases/org/gluu/oxcore-saml/4.4.0-SNAPSHOT/maven-metadata.xml
Downloading: https://repository.jboss.org/nexus/content/groups/public-jboss/org/gluu/oxcore-saml/4.4.0-SNAPSHOT/maven-metadata.xml




Downloading: https://repository.jboss.org/nexus/content/groups/public-jboss/org/gluu/oxcore-saml/4.4.0-SNAPSHOT/oxcore-saml-4.4.0-SNAPSHOT.pom

Downloading: https://ox.gluu.org/maven/org/gluu/oxcore-saml/4.4.0-SNAPSHOT/oxcore-saml-4.4.0-SNAPSHOT.pom

Downloading: https://repo1.maven.org/maven2/org/gluu/oxcore-saml/4.4.0-SNAPSHOT/oxcore-saml-4.4.0-SNAPSHOT.pom

Downloading: https://build.shibboleth.net/nexus/content/repositories/releases/org/gluu/oxcore-saml/4.4.0-SNAPSHOT/oxcore-saml-4.4.0-SNAPSHOT.pom

[WARNING] The POM for org.gluu:oxcore-saml:jar:4.4.0-SNAPSHOT is missing, no dependency information available
Downloading: https://repository.jboss.org/nexus/content/groups/public-jboss/org/gluu/oxcore-document-store/4.4.0-SNAPSHOT/maven-metadata.xml
Downloading: https://ox.gluu.org/maven/org/gluu/oxcore-document-store/4.4.0-SNAPSHOT/maven-metadata.xml
Downloading: https://repo1.maven.org/maven2/org/gluu/oxcore-document-store/4.4.0-SNAPSHOT/maven-metadata.xml
Downloading: https://build.shibboleth.net/nexus/content/repositories/releases/org/gluu/oxcore-document-store/4.4.0-SNAPSHOT/maven-metadata.xml




Downloading: https://repository.jboss.org/nexus/content/groups/public-jboss/org/gluu/oxcore-document-store/4.4.0-SNAPSHOT/oxcore-document-store-4.4.0-SNAPSHOT.pom

Downloading: https://ox.gluu.org/maven/org/gluu/oxcore-document-store/4.4.0-SNAPSHOT/oxcore-document-store-4.4.0-SNAPSHOT.pom

Downloading: https://repo1.maven.org/maven2/org/gluu/oxcore-document-store/4.4.0-SNAPSHOT/oxcore-document-store-4.4.0-SNAPSHOT.pom

Downloading: https://build.shibboleth.net/nexus/content/repositories/releases/org/gluu/oxcore-document-store/4.4.0-SNAPSHOT/oxcore-document-store-4.4.0-SNAPSHOT.pom

[WARNING] The POM for org.gluu:oxcore-document-store:jar:4.4.0-SNAPSHOT is missing, no dependency information available
Downloading: https://repo1.maven.org/maven2/org/gluu/oxauth-model/4.4.0-SNAPSHOT/maven-metadata.xml
Downloading: https://build.shibboleth.net/nexus/content/repositories/releases/org/gluu/oxauth-model/4.4.0-SNAPSHOT/maven-metadata.xml


Downloading: https://repo1.maven.org/maven2/org/gluu/oxauth-model/4.4.0-SNAPSHOT/oxauth-model-4.4.0-SNAPSHOT.pom

Downloading: https://build.shibboleth.net/nexus/content/repositories/releases/org/gluu/oxauth-model/4.4.0-SNAPSHOT/oxauth-model-4.4.0-SNAPSHOT.pom

[WARNING] The POM for org.gluu:oxauth-model:jar:4.4.0-SNAPSHOT is missing, no dependency information available
Downloading: https://repository.jboss.org/nexus/content/groups/public-jboss/org/gluu/oxauth-persistence-model/4.4.0-SNAPSHOT/maven-metadata.xml
Downloading: https://build.shibboleth.net/nexus/content/repositories/releases/org/gluu/oxauth-persistence-model/4.4.0-SNAPSHOT/maven-metadata.xml
Downloading: https://ox.gluu.org/maven/org/gluu/oxauth-persistence-model/4.4.0-SNAPSHOT/maven-metadata.xml
Downloading: https://repo1.maven.org/maven2/org/gluu/oxauth-persistence-model/4.4.0-SNAPSHOT/maven-metadata.xml




Downloading: https://repository.jboss.org/nexus/content/groups/public-jboss/org/gluu/oxauth-persistence-model/4.4.0-SNAPSHOT/oxauth-persistence-model-4.4.0-SNAPSHOT.pom

Downloading: https://ox.gluu.org/maven/org/gluu/oxauth-persistence-model/4.4.0-SNAPSHOT/oxauth-persistence-model-4.4.0-SNAPSHOT.pom

Downloading: https://repo1.maven.org/maven2/org/gluu/oxauth-persistence-model/4.4.0-SNAPSHOT/oxauth-persistence-model-4.4.0-SNAPSHOT.pom

Downloading: https://build.shibboleth.net/nexus/content/repositories/releases/org/gluu/oxauth-persistence-model/4.4.0-SNAPSHOT/oxauth-persistence-model-4.4.0-SNAPSHOT.pom

[WARNING] The POM for org.gluu:oxauth-persistence-model:jar:4.4.0-SNAPSHOT is missing, no dependency information available
Downloading: https://repository.jboss.org/nexus/content/groups/public-jboss/org/gluu/oxcore-model/4.4.0-SNAPSHOT/oxcore-model-4.4.0-SNAPSHOT.jar
Downloading: https://repository.jboss.org/nexus/content/groups/public-jboss/org/gluu/oxcore-util/4.4.0-SNAPSHOT/oxcore-util-4.4.0-SNAPSHOT.jar
Downloading: https://repository.jboss.org/nexus/content/groups/public-jboss/org/gluu/oxcore-service/4.4.0-SNAPSHOT/oxcore-service-4.4.0-SNAPSHOT.jar
Downloading: https://repository.jboss.org/nexus/content/groups/public-jboss/org/gluu/oxcore-server/4.4.0-SNAPSHOT/oxcore-server-4.4.0-SNAPSHOT.jar
Downloading: https://repository.jboss.org/nexus/content/groups/public-jboss/org/gluu/oxcore-saml/4.4.0-SNAPSHOT/oxcore-saml-4.4.0-SNAPSHOT.jar

Downloading: https://repository.jboss.org/nexus/content/groups/public-jboss/org/gluu/oxcore-document-store/4.4.0-SNAPSHOT/oxcore-document-store-4.4.0-SNAPSHOT.jar

Downloading: https://repository.jboss.org/nexus/content/groups/public-jboss/org/gluu/oxauth-persistence-model/4.4.0-SNAPSHOT/oxauth-persistence-model-4.4.0-SNAPSHOT.jar





Downloading: https://ox.gluu.org/maven/org/gluu/oxcore-util/4.4.0-SNAPSHOT/oxcore-util-4.4.0-SNAPSHOT.jar
Downloading: https://ox.gluu.org/maven/org/gluu/oxcore-service/4.4.0-SNAPSHOT/oxcore-service-4.4.0-SNAPSHOT.jar
Downloading: https://ox.gluu.org/maven/org/gluu/oxcore-model/4.4.0-SNAPSHOT/oxcore-model-4.4.0-SNAPSHOT.jar
Downloading: https://ox.gluu.org/maven/org/gluu/oxcore-saml/4.4.0-SNAPSHOT/oxcore-saml-4.4.0-SNAPSHOT.jar
Downloading: https://ox.gluu.org/maven/org/gluu/oxcore-server/4.4.0-SNAPSHOT/oxcore-server-4.4.0-SNAPSHOT.jar

Downloading: https://ox.gluu.org/maven/org/gluu/oxcore-document-store/4.4.0-SNAPSHOT/oxcore-document-store-4.4.0-SNAPSHOT.jar

Downloading: https://ox.gluu.org/maven/org/gluu/oxauth-persistence-model/4.4.0-SNAPSHOT/oxauth-persistence-model-4.4.0-SNAPSHOT.jar





Downloading: https://repo1.maven.org/maven2/org/gluu/oxcore-model/4.4.0-SNAPSHOT/oxcore-model-4.4.0-SNAPSHOT.jar
Downloading: https://repo1.maven.org/maven2/org/gluu/oxcore-util/4.4.0-SNAPSHOT/oxcore-util-4.4.0-SNAPSHOT.jar
Downloading: https://repo1.maven.org/maven2/org/gluu/oxcore-service/4.4.0-SNAPSHOT/oxcore-service-4.4.0-SNAPSHOT.jar
Downloading: https://repo1.maven.org/maven2/org/gluu/oxcore-server/4.4.0-SNAPSHOT/oxcore-server-4.4.0-SNAPSHOT.jar
Downloading: https://repo1.maven.org/maven2/org/gluu/oxcore-saml/4.4.0-SNAPSHOT/oxcore-saml-4.4.0-SNAPSHOT.jar

Downloading: https://repo1.maven.org/maven2/org/gluu/oxcore-document-store/4.4.0-SNAPSHOT/oxcore-document-store-4.4.0-SNAPSHOT.jar

Downloading: https://repo1.maven.org/maven2/org/gluu/oxauth-model/4.4.0-SNAPSHOT/oxauth-model-4.4.0-SNAPSHOT.jar

Downloading: https://repo1.maven.org/maven2/org/gluu/oxauth-persistence-model/4.4.0-SNAPSHOT/oxauth-persistence-model-4.4.0-SNAPSHOT.jar





Downloading: https://build.shibboleth.net/nexus/content/repositories/releases/org/gluu/oxcore-model/4.4.0-SNAPSHOT/oxcore-model-4.4.0-SNAPSHOT.jar
Downloading: https://build.shibboleth.net/nexus/content/repositories/releases/org/gluu/oxcore-util/4.4.0-SNAPSHOT/oxcore-util-4.4.0-SNAPSHOT.jar
Downloading: https://build.shibboleth.net/nexus/content/repositories/releases/org/gluu/oxcore-service/4.4.0-SNAPSHOT/oxcore-service-4.4.0-SNAPSHOT.jar
Downloading: https://build.shibboleth.net/nexus/content/repositories/releases/org/gluu/oxcore-server/4.4.0-SNAPSHOT/oxcore-server-4.4.0-SNAPSHOT.jar
Downloading: https://build.shibboleth.net/nexus/content/repositories/releases/org/gluu/oxcore-saml/4.4.0-SNAPSHOT/oxcore-saml-4.4.0-SNAPSHOT.jar

Downloading: https://build.shibboleth.net/nexus/content/repositories/releases/org/gluu/oxcore-document-store/4.4.0-SNAPSHOT/oxcore-document-store-4.4.0-SNAPSHOT.jar

Downloading: https://build.shibboleth.net/nexus/content/repositories/releases/org/gluu/oxauth-model/4.4.0-SNAPSHOT/oxauth-model-4.4.0-SNAPSHOT.jar

Downloading: https://build.shibboleth.net/nexus/content/repositories/releases/org/gluu/oxauth-persistence-model/4.4.0-SNAPSHOT/oxauth-persistence-model-4.4.0-SNAPSHOT.jar





[INFO] ------------------------------------------------------------------------
[INFO] Reactor Summary:
[INFO] 
[INFO] oxTrust ............................................ SUCCESS [  2.439 s]
[INFO] oxTrust static resources ........................... SUCCESS [  1.556 s]
[INFO] oxTrust configuration .............................. SUCCESS [  0.434 s]
[INFO] oxTrust Model library .............................. FAILURE [  4.797 s]
[INFO] oxTrust Client library ............................. SKIPPED
[INFO] oxTrust Service .................................... SKIPPED
[INFO] OpenId authentication module ....................... SKIPPED
[INFO] oxTrust Server ..................................... SKIPPED
[INFO] OpenId authentication module for Saml .............. SKIPPED
[INFO] OpenId authentication module for CAS ............... SKIPPED
[INFO] oxTrust Server Test ................................ SKIPPED
[INFO] API Server ......................................... SKIPPED
[INFO] ------------------------------------------------------------------------
[INFO] BUILD FAILURE
[INFO] ------------------------------------------------------------------------
[INFO] Total time: 10.659 s
[INFO] Finished at: 2021-11-09T17:32:50+00:00
[INFO] Final Memory: 35M/124M
[INFO] ------------------------------------------------------------------------
[ERROR] Failed to execute goal on project oxtrust-model: Could not resolve dependencies for project org.gluu:oxtrust-model:jar:4.4.0-SNAPSHOT: The following artifacts could not be resolved: org.gluu:oxcore-model:jar:4.4.0-SNAPSHOT, org.gluu:oxcore-util:jar:4.4.0-SNAPSHOT, org.gluu:oxcore-service:jar:4.4.0-SNAPSHOT, org.gluu:oxcore-server:jar:4.4.0-SNAPSHOT, org.gluu:oxcore-saml:jar:4.4.0-SNAPSHOT, org.gluu:oxcore-document-store:jar:4.4.0-SNAPSHOT, org.gluu:oxauth-model:jar:4.4.0-SNAPSHOT, org.gluu:oxauth-persistence-model:jar:4.4.0-SNAPSHOT: Could not find artifact org.gluu:oxcore-model:jar:4.4.0-SNAPSHOT in repository.jboss.org (https://repository.jboss.org/nexus/content/groups/public-jboss/) -> [Help 1]
[ERROR] 
[ERROR] To see the full stack trace of the errors, re-run Maven with the -e switch.
[ERROR] Re-run Maven using the -X switch to enable full debug logging.
[ERROR] 
[ERROR] For more information about the errors and possible solutions, please read the following articles:
[ERROR] [Help 1] http://cwiki.apache.org/confluence/display/MAVEN/DependencyResolutionException
[ERROR] 
[ERROR] After correcting the problems, you can resume the build with the command
[ERROR]   mvn <goals> -rf :oxtrust-model
Build step 'Invoke top-level Maven targets' marked build as failure
[FINDBUGS] Skipping publisher since build result is FAILURE
Publishing Javadoc
TestNG Reports Processing: START
Looking for TestNG results report in workspace using pattern: **/testng-results.xml
Did not find any matching files.
Not sending mail to unregistered user Yuriy.Movchan@gmail.com
Sending e-mails to: support@gluu.org
ERROR: Couldn't connect to host, port: webmail.gluu.org, 465; timeout 60000
com.sun.mail.util.MailConnectException: Couldn't connect to host, port: webmail.gluu.org, 465; timeout 60000;
  nested exception is:
	java.net.SocketTimeoutException: connect timed out
	at com.sun.mail.smtp.SMTPTransport.openServer(SMTPTransport.java:2210)
	at com.sun.mail.smtp.SMTPTransport.protocolConnect(SMTPTransport.java:722)
	at javax.mail.Service.connect(Service.java:310)
	at javax.mail.Service.connect(Service.java:169)
	at javax.mail.Service.connect(Service.java:118)
	at javax.mail.Transport.send0(Transport.java:188)
	at javax.mail.Transport.send(Transport.java:118)
	at hudson.tasks.MailSender.run(MailSender.java:130)
	at hudson.tasks.Mailer.perform(Mailer.java:176)
	at hudson.tasks.Mailer.perform(Mailer.java:139)
	at hudson.tasks.BuildStepMonitor$1.perform(BuildStepMonitor.java:20)
	at hudson.model.AbstractBuild$AbstractBuildExecution.perform(AbstractBuild.java:741)
	at hudson.model.AbstractBuild$AbstractBuildExecution.performAllBuildSteps(AbstractBuild.java:690)
	at hudson.model.Build$BuildExecution.post2(Build.java:186)
	at hudson.model.AbstractBuild$AbstractBuildExecution.post(AbstractBuild.java:635)
	at hudson.model.Run.execute(Run.java:1905)
	at hudson.model.FreeStyleBuild.run(FreeStyleBuild.java:43)
	at hudson.model.ResourceController.execute(ResourceController.java:97)
	at hudson.model.Executor.run(Executor.java:428)
Caused by: java.net.SocketTimeoutException: connect timed out
	at java.net.PlainSocketImpl.socketConnect(Native Method)
	at java.net.AbstractPlainSocketImpl.doConnect(AbstractPlainSocketImpl.java:350)
	at java.net.AbstractPlainSocketImpl.connectToAddress(AbstractPlainSocketImpl.java:206)
	at java.net.AbstractPlainSocketImpl.connect(AbstractPlainSocketImpl.java:188)
	at java.net.SocksSocketImpl.connect(SocksSocketImpl.java:392)
	at java.net.Socket.connect(Socket.java:589)
	at com.sun.mail.util.SocketFetcher.createSocket(SocketFetcher.java:333)
	at com.sun.mail.util.SocketFetcher.getSocket(SocketFetcher.java:193)
	at com.sun.mail.smtp.SMTPTransport.openServer(SMTPTransport.java:2160)
	... 18 more
[Boolean condition] checking [true] against [^(1|y|yes|t|true|on|run)$] (origin token: $DEPLOY_BUILD)
Run condition [Boolean condition] enabling perform for step [Builder to mark whether executed]
Finished: FAILURE