FailedConsole Output

Started by upstream project "oxCore" build number 1397
originally caused by:
 Started by upstream project "CE Build 4.X" build number 539
 originally caused by:
  Started by user Yuriy Movchan
Running as SYSTEM
Building on master in workspace /home/jenkins/.jenkins/jobs/oxTrust/workspace
The recommended git tool is: NONE
No credentials specified
 > git rev-parse --is-inside-work-tree # timeout=10
Fetching changes from the remote Git repository
 > git config remote.origin.url https://github.com/GluuFederation/oxTrust # timeout=10
Fetching upstream changes from https://github.com/GluuFederation/oxTrust
 > git --version # timeout=10
 > git --version # 'git version 1.8.3.1'
 > git fetch --tags --progress https://github.com/GluuFederation/oxTrust +refs/heads/*:refs/remotes/origin/* # timeout=10
 > git rev-parse refs/remotes/origin/master^{commit} # timeout=10
 > git rev-parse refs/remotes/origin/origin/master^{commit} # timeout=10
Checking out Revision a3121f3bf0ef8d3c8ae0230bfd99b819d7109b8e (refs/remotes/origin/master)
 > git config core.sparsecheckout # timeout=10
 > git checkout -f a3121f3bf0ef8d3c8ae0230bfd99b819d7109b8e # timeout=10
Commit message: "chore: fix after upgrade to resteasy 4"
 > git rev-list --no-walk a3121f3bf0ef8d3c8ae0230bfd99b819d7109b8e # timeout=10
Run condition [Boolean condition] enabling prebuild for step [Trigger/call builds on other projects]
[workspace] $ /bin/bash /opt/jetty/temp/jenkins8489427129799364685.sh
Cloning into 'oxHudsonProfiles'...
[workspace] $ /home/jenkins/.jenkins/tools/hudson.tasks.Maven_MavenInstallation/maven_3.3.9/bin/mvn -DDEPLOY_BUILD=true -DVERSION_NAME=master -DPROFILE_NAME=ce-dev5.gluu.org -DDEVELOPMENT_BUILD=false -DMAVEN_SKIP_TESTS=false -Dpython.import.site=false -DPYTHON_HOME=/opt/jython -Dcfg=ce-dev5.gluu.org -Dmaven.test.skip=false -Ddevelopment-build=false -Dskip.qa.test=true clean compile install findbugs:findbugs site
[INFO] Scanning for projects...
[WARNING] 
[WARNING] Some problems were encountered while building the effective model for org.gluu:oxtrust-model:jar:4.3.1-SNAPSHOT
[WARNING] 'dependencies.dependency.(groupId:artifactId:type:classifier)' must be unique: com.fasterxml.jackson.core:jackson-annotations:jar -> duplicate declaration of version (?) @ org.gluu:oxtrust-model:[unknown-version], /home/jenkins/.jenkins/jobs/oxTrust/workspace/model/pom.xml, line 85, column 15
[WARNING] 'dependencies.dependency.(groupId:artifactId:type:classifier)' must be unique: com.fasterxml.jackson.core:jackson-core:jar -> duplicate declaration of version (?) @ org.gluu:oxtrust-model:[unknown-version], /home/jenkins/.jenkins/jobs/oxTrust/workspace/model/pom.xml, line 89, column 15
[WARNING] 'dependencies.dependency.(groupId:artifactId:type:classifier)' must be unique: com.fasterxml.jackson.core:jackson-databind:jar -> duplicate declaration of version (?) @ org.gluu:oxtrust-model:[unknown-version], /home/jenkins/.jenkins/jobs/oxTrust/workspace/model/pom.xml, line 93, column 15
[WARNING] 
[WARNING] Some problems were encountered while building the effective model for org.gluu:oxtrust-service:jar:4.3.1-SNAPSHOT
[WARNING] 'build.plugins.plugin.version' for org.apache.maven.plugins:maven-javadoc-plugin is missing. @ org.gluu:oxtrust-service:[unknown-version], /home/jenkins/.jenkins/jobs/oxTrust/workspace/service/pom.xml, line 42, column 12
[WARNING] 
[WARNING] Some problems were encountered while building the effective model for org.gluu:oxtrust-server:war:4.3.1-SNAPSHOT
[WARNING] 'build.plugins.plugin.version' for org.apache.maven.plugins:maven-javadoc-plugin is missing. @ org.gluu:oxtrust-server:[unknown-version], /home/jenkins/.jenkins/jobs/oxTrust/workspace/server/pom.xml, line 69, column 12
[WARNING] 
[WARNING] Some problems were encountered while building the effective model for org.gluu:oxtrust-openid-auth-client:jar:4.3.1-SNAPSHOT
[WARNING] 'build.plugins.plugin.version' for org.apache.maven.plugins:maven-javadoc-plugin is missing. @ org.gluu:oxtrust-openid-auth-client:[unknown-version], /home/jenkins/.jenkins/jobs/oxTrust/workspace/openid-auth-client/pom.xml, line 22, column 21
[WARNING] 
[WARNING] Some problems were encountered while building the effective model for org.gluu:oxtrust-saml-openid-auth-client:jar:4.3.1-SNAPSHOT
[WARNING] 'build.plugins.plugin.version' for org.apache.maven.plugins:maven-javadoc-plugin is missing. @ org.gluu:oxtrust-saml-openid-auth-client:[unknown-version], /home/jenkins/.jenkins/jobs/oxTrust/workspace/saml-openid-auth-client/pom.xml, line 22, column 21
[WARNING] 
[WARNING] Some problems were encountered while building the effective model for org.gluu:oxtrust-cas-openid-auth-client:jar:4.3.1-SNAPSHOT
[WARNING] 'build.plugins.plugin.version' for org.apache.maven.plugins:maven-javadoc-plugin is missing. @ org.gluu:oxtrust-cas-openid-auth-client:[unknown-version], /home/jenkins/.jenkins/jobs/oxTrust/workspace/cas-openid-auth-client/pom.xml, line 27, column 12
[WARNING] 
[WARNING] It is highly recommended to fix these problems because they threaten the stability of your build.
[WARNING] 
[WARNING] For this reason, future Maven versions might no longer support building such malformed projects.
[WARNING] 
[INFO] ------------------------------------------------------------------------
[INFO] Reactor Build Order:
[INFO] 
[INFO] oxTrust
[INFO] oxTrust static resources
[INFO] oxTrust configuration
[INFO] oxTrust Model library
[INFO] oxTrust Client library
[INFO] oxTrust Service
[INFO] OpenId authentication module
[INFO] oxTrust Server
[INFO] OpenId authentication module for Saml
[INFO] OpenId authentication module for CAS
[INFO] oxTrust Server Test
[INFO] API Server
[INFO]                                                                         
[INFO] ------------------------------------------------------------------------
[INFO] Building oxTrust 4.3.1-SNAPSHOT
[INFO] ------------------------------------------------------------------------
[INFO] 
[INFO] --- maven-clean-plugin:2.5:clean (default-clean) @ oxtrust ---
[INFO] Deleting /home/jenkins/.jenkins/jobs/oxTrust/workspace/target
[INFO] 
[INFO] --- maven-install-plugin:2.3.1:install (default-install) @ oxtrust ---
[INFO] Installing /home/jenkins/.jenkins/jobs/oxTrust/workspace/pom.xml to /var/www/html/maven/org/gluu/oxtrust/4.3.1-SNAPSHOT/oxtrust-4.3.1-SNAPSHOT.pom
[INFO] 
[INFO] --- findbugs-maven-plugin:3.0.4:findbugs (default-cli) @ oxtrust ---
WARNING: An illegal reflective access operation has occurred
WARNING: Illegal reflective access by org.codehaus.groovy.reflection.CachedClass$3$1 (file:/var/www/html/maven/org/codehaus/groovy/groovy/2.4.7/groovy-2.4.7.jar) to method java.lang.Object.finalize()
WARNING: Please consider reporting this to the maintainers of org.codehaus.groovy.reflection.CachedClass$3$1
WARNING: Use --illegal-access=warn to enable warnings of further illegal reflective access operations
WARNING: All illegal access operations will be denied in a future release
[INFO] 
[INFO] --- maven-site-plugin:2.1.1:site (default-site) @ oxtrust ---
Downloading: https://build.shibboleth.net/nexus/content/repositories/releases/org/apache/maven/skins/maven-default-skin/maven-metadata.xml

[INFO]                                                                         
[INFO] ------------------------------------------------------------------------
[INFO] Building oxTrust static resources 4.3.1-SNAPSHOT
[INFO] ------------------------------------------------------------------------
[INFO] 
[INFO] --- maven-clean-plugin:2.5:clean (default-clean) @ oxtrust-static ---
[INFO] Deleting /home/jenkins/.jenkins/jobs/oxTrust/workspace/static/target
[INFO] 
[INFO] --- maven-resources-plugin:2.6:resources (default-resources) @ oxtrust-static ---
[INFO] Using 'UTF-8' encoding to copy filtered resources.
[INFO] Copying 337 resources
[INFO] 
[INFO] --- maven-compiler-plugin:2.3.2:compile (default-compile) @ oxtrust-static ---
[INFO] No sources to compile
[INFO] 
[INFO] --- maven-resources-plugin:2.6:resources (default-resources) @ oxtrust-static ---
[INFO] Using 'UTF-8' encoding to copy filtered resources.
[INFO] Copying 337 resources
[INFO] 
[INFO] --- maven-compiler-plugin:2.3.2:compile (default-compile) @ oxtrust-static ---
[INFO] No sources to compile
[INFO] 
[INFO] --- maven-resources-plugin:2.6:testResources (default-testResources) @ oxtrust-static ---
[INFO] Using 'UTF-8' encoding to copy filtered resources.
[INFO] skip non existing resourceDirectory /home/jenkins/.jenkins/jobs/oxTrust/workspace/static/src/test/resources
[INFO] 
[INFO] --- maven-compiler-plugin:2.3.2:testCompile (default-testCompile) @ oxtrust-static ---
[INFO] No sources to compile
[INFO] 
[INFO] --- maven-surefire-plugin:2.19.1:test (default-test) @ oxtrust-static ---
[INFO] No tests to run.
[INFO] 
[INFO] --- maven-jar-plugin:2.4:jar (default-jar) @ oxtrust-static ---
[INFO] Building jar: /home/jenkins/.jenkins/jobs/oxTrust/workspace/static/target/oxtrust-static-4.3.1-SNAPSHOT.jar
[INFO] 
[INFO] --- maven-jar-plugin:2.4:test-jar (default) @ oxtrust-static ---
[WARNING] JAR will be empty - no content was marked for inclusion!
[INFO] Building jar: /home/jenkins/.jenkins/jobs/oxTrust/workspace/static/target/oxtrust-static-4.3.1-SNAPSHOT-tests.jar
[INFO] 
[INFO] --- maven-install-plugin:2.3.1:install (default-install) @ oxtrust-static ---
[INFO] Installing /home/jenkins/.jenkins/jobs/oxTrust/workspace/static/target/oxtrust-static-4.3.1-SNAPSHOT.jar to /var/www/html/maven/org/gluu/oxtrust-static/4.3.1-SNAPSHOT/oxtrust-static-4.3.1-SNAPSHOT.jar
[INFO] Installing /home/jenkins/.jenkins/jobs/oxTrust/workspace/static/pom.xml to /var/www/html/maven/org/gluu/oxtrust-static/4.3.1-SNAPSHOT/oxtrust-static-4.3.1-SNAPSHOT.pom
[INFO] Installing /home/jenkins/.jenkins/jobs/oxTrust/workspace/static/target/oxtrust-static-4.3.1-SNAPSHOT-tests.jar to /var/www/html/maven/org/gluu/oxtrust-static/4.3.1-SNAPSHOT/oxtrust-static-4.3.1-SNAPSHOT-tests.jar
[INFO] 
[INFO] --- findbugs-maven-plugin:3.0.4:findbugs (default-cli) @ oxtrust-static ---
[INFO] 
[INFO] --- maven-site-plugin:2.1.1:site (default-site) @ oxtrust-static ---
[INFO]                                                                         
[INFO] ------------------------------------------------------------------------
[INFO] Building oxTrust configuration 4.3.1-SNAPSHOT
[INFO] ------------------------------------------------------------------------
[INFO] 
[INFO] --- maven-clean-plugin:2.5:clean (default-clean) @ oxtrust-configuration ---
[INFO] Deleting /home/jenkins/.jenkins/jobs/oxTrust/workspace/configuration/target
[INFO] 
[INFO] --- maven-resources-plugin:2.6:resources (default-resources) @ oxtrust-configuration ---
[INFO] Using 'UTF-8' encoding to copy filtered resources.
[INFO] Copying 3 resources
[INFO] Copying 32 resources
[INFO] 
[INFO] --- maven-compiler-plugin:2.3.2:compile (default-compile) @ oxtrust-configuration ---
[INFO] No sources to compile
[INFO] 
[INFO] --- maven-resources-plugin:2.6:resources (default-resources) @ oxtrust-configuration ---
[INFO] Using 'UTF-8' encoding to copy filtered resources.
[INFO] Copying 3 resources
[INFO] Copying 32 resources
[INFO] 
[INFO] --- maven-compiler-plugin:2.3.2:compile (default-compile) @ oxtrust-configuration ---
[INFO] No sources to compile
[INFO] 
[INFO] --- maven-resources-plugin:2.6:testResources (default-testResources) @ oxtrust-configuration ---
[INFO] Using 'UTF-8' encoding to copy filtered resources.
[INFO] skip non existing resourceDirectory /home/jenkins/.jenkins/jobs/oxTrust/workspace/configuration/src/test/resources
[INFO] 
[INFO] --- maven-compiler-plugin:2.3.2:testCompile (default-testCompile) @ oxtrust-configuration ---
[INFO] No sources to compile
[INFO] 
[INFO] --- maven-surefire-plugin:2.19.1:test (default-test) @ oxtrust-configuration ---
[INFO] No tests to run.
[INFO] 
[INFO] --- maven-jar-plugin:2.4:jar (default-jar) @ oxtrust-configuration ---
[INFO] Building jar: /home/jenkins/.jenkins/jobs/oxTrust/workspace/configuration/target/oxtrust-configuration-4.3.1-SNAPSHOT.jar
[INFO] 
[INFO] --- maven-jar-plugin:2.4:test-jar (default) @ oxtrust-configuration ---
[WARNING] JAR will be empty - no content was marked for inclusion!
[INFO] Building jar: /home/jenkins/.jenkins/jobs/oxTrust/workspace/configuration/target/oxtrust-configuration-4.3.1-SNAPSHOT-tests.jar
[INFO] 
[INFO] --- maven-install-plugin:2.3.1:install (default-install) @ oxtrust-configuration ---
[INFO] Installing /home/jenkins/.jenkins/jobs/oxTrust/workspace/configuration/target/oxtrust-configuration-4.3.1-SNAPSHOT.jar to /var/www/html/maven/org/gluu/oxtrust-configuration/4.3.1-SNAPSHOT/oxtrust-configuration-4.3.1-SNAPSHOT.jar
[INFO] Installing /home/jenkins/.jenkins/jobs/oxTrust/workspace/configuration/pom.xml to /var/www/html/maven/org/gluu/oxtrust-configuration/4.3.1-SNAPSHOT/oxtrust-configuration-4.3.1-SNAPSHOT.pom
[INFO] Installing /home/jenkins/.jenkins/jobs/oxTrust/workspace/configuration/target/oxtrust-configuration-4.3.1-SNAPSHOT-tests.jar to /var/www/html/maven/org/gluu/oxtrust-configuration/4.3.1-SNAPSHOT/oxtrust-configuration-4.3.1-SNAPSHOT-tests.jar
[INFO] 
[INFO] --- findbugs-maven-plugin:3.0.4:findbugs (default-cli) @ oxtrust-configuration ---
[INFO] 
[INFO] --- maven-site-plugin:2.1.1:site (default-site) @ oxtrust-configuration ---
[INFO]                                                                         
[INFO] ------------------------------------------------------------------------
[INFO] Building oxTrust Model library 4.3.1-SNAPSHOT
[INFO] ------------------------------------------------------------------------
Downloading: https://ox.gluu.org/maven/org/gluu/oxauth-model/4.3.1-SNAPSHOT/maven-metadata.xml
Downloading: https://build.shibboleth.net/nexus/content/repositories/releases/org/gluu/oxauth-model/4.3.1-SNAPSHOT/maven-metadata.xml
Downloading: https://repository.jboss.org/nexus/content/groups/public-jboss/org/gluu/oxauth-model/4.3.1-SNAPSHOT/maven-metadata.xml
Downloading: https://repo1.maven.org/maven2/org/gluu/oxauth-model/4.3.1-SNAPSHOT/maven-metadata.xml




Downloading: https://repository.jboss.org/nexus/content/groups/public-jboss/org/gluu/oxauth/4.3.1-SNAPSHOT/maven-metadata.xml
Downloading: https://repo1.maven.org/maven2/org/gluu/oxauth/4.3.1-SNAPSHOT/maven-metadata.xml
Downloading: https://ox.gluu.org/maven/org/gluu/oxauth/4.3.1-SNAPSHOT/maven-metadata.xml
Downloading: https://build.shibboleth.net/nexus/content/repositories/releases/org/gluu/oxauth/4.3.1-SNAPSHOT/maven-metadata.xml




Downloading: https://build.shibboleth.net/nexus/content/repositories/releases/org/gluu/oxauth-persistence-model/4.3.1-SNAPSHOT/maven-metadata.xml
Downloading: https://repo1.maven.org/maven2/org/gluu/oxauth-persistence-model/4.3.1-SNAPSHOT/maven-metadata.xml
Downloading: https://repository.jboss.org/nexus/content/groups/public-jboss/org/gluu/oxauth-persistence-model/4.3.1-SNAPSHOT/maven-metadata.xml
Downloading: https://ox.gluu.org/maven/org/gluu/oxauth-persistence-model/4.3.1-SNAPSHOT/maven-metadata.xml




[INFO] 
[INFO] --- maven-clean-plugin:2.5:clean (default-clean) @ oxtrust-model ---
[INFO] Deleting /home/jenkins/.jenkins/jobs/oxTrust/workspace/model/target
[INFO] 
[INFO] --- maven-resources-plugin:2.6:resources (default-resources) @ oxtrust-model ---
[INFO] Using 'UTF-8' encoding to copy filtered resources.
[INFO] skip non existing resourceDirectory /home/jenkins/.jenkins/jobs/oxTrust/workspace/model/src/main/resources
[INFO] 
[INFO] --- maven-compiler-plugin:2.3.2:compile (default-compile) @ oxtrust-model ---
[INFO] Compiling 84 source files to /home/jenkins/.jenkins/jobs/oxTrust/workspace/model/target/classes
[INFO] 
[INFO] --- maven-resources-plugin:2.6:resources (default-resources) @ oxtrust-model ---
[INFO] Using 'UTF-8' encoding to copy filtered resources.
[INFO] skip non existing resourceDirectory /home/jenkins/.jenkins/jobs/oxTrust/workspace/model/src/main/resources
[INFO] 
[INFO] --- maven-compiler-plugin:2.3.2:compile (default-compile) @ oxtrust-model ---
[INFO] Nothing to compile - all classes are up to date
[INFO] 
[INFO] --- maven-resources-plugin:2.6:testResources (default-testResources) @ oxtrust-model ---
[INFO] Using 'UTF-8' encoding to copy filtered resources.
[INFO] skip non existing resourceDirectory /home/jenkins/.jenkins/jobs/oxTrust/workspace/model/src/test/resources
[INFO] 
[INFO] --- maven-compiler-plugin:2.3.2:testCompile (default-testCompile) @ oxtrust-model ---
[INFO] No sources to compile
[INFO] 
[INFO] --- maven-surefire-plugin:2.19.1:test (default-test) @ oxtrust-model ---
[INFO] No tests to run.
[INFO] 
[INFO] --- maven-jar-plugin:2.4:jar (default-jar) @ oxtrust-model ---
[INFO] Building jar: /home/jenkins/.jenkins/jobs/oxTrust/workspace/model/target/oxtrust-model-4.3.1-SNAPSHOT.jar
[INFO] 
[INFO] --- maven-jar-plugin:2.4:test-jar (default) @ oxtrust-model ---
[WARNING] JAR will be empty - no content was marked for inclusion!
[INFO] Building jar: /home/jenkins/.jenkins/jobs/oxTrust/workspace/model/target/oxtrust-model-4.3.1-SNAPSHOT-tests.jar
[INFO] 
[INFO] --- maven-install-plugin:2.3.1:install (default-install) @ oxtrust-model ---
[INFO] Installing /home/jenkins/.jenkins/jobs/oxTrust/workspace/model/target/oxtrust-model-4.3.1-SNAPSHOT.jar to /var/www/html/maven/org/gluu/oxtrust-model/4.3.1-SNAPSHOT/oxtrust-model-4.3.1-SNAPSHOT.jar
[INFO] Installing /home/jenkins/.jenkins/jobs/oxTrust/workspace/model/pom.xml to /var/www/html/maven/org/gluu/oxtrust-model/4.3.1-SNAPSHOT/oxtrust-model-4.3.1-SNAPSHOT.pom
[INFO] Installing /home/jenkins/.jenkins/jobs/oxTrust/workspace/model/target/oxtrust-model-4.3.1-SNAPSHOT-tests.jar to /var/www/html/maven/org/gluu/oxtrust-model/4.3.1-SNAPSHOT/oxtrust-model-4.3.1-SNAPSHOT-tests.jar
[INFO] 
[INFO] --- findbugs-maven-plugin:3.0.4:findbugs (default-cli) @ oxtrust-model ---
[INFO] Fork Value is true
     [java] The following classes needed for analysis were missing:
     [java]   java.lang.Object
     [java]   java.lang.Enum
     [java]   java.io.Serializable
     [java]   java.lang.Cloneable
     [java]   java.lang.Comparable
     [java]   java.lang.String
     [java]   java.util.Date
     [java]   java.lang.StringBuilder
     [java]   java.util.List
     [java]   java.util.Map
     [java]   java.lang.StringBuffer
     [java]   java.util.HashMap
     [java]   java.util.ArrayList
     [java]   java.util.Iterator
     [java]   java.util.Arrays
     [java]   java.lang.Integer
     [java]   java.util.Set
     [java]   java.util.Collection
     [java]   java.lang.Boolean
     [java]   java.security.cert.X509Certificate
     [java]   java.security.Principal
     [java]   java.lang.System
     [java]   java.io.File
     [java]   java.util.TreeSet
     [java]   java.lang.IllegalArgumentException
     [java]   java.lang.Math
     [java]   java.time.LocalDate
     [java]   java.time.ZoneId
     [java]   java.time.ZonedDateTime
     [java]   java.lang.Long
     [java]   java.lang.NoSuchFieldError
     [java]   java.lang.UnsatisfiedLinkError
     [java]   java.lang.NoClassDefFoundError
     [java]   java.lang.CloneNotSupportedException
     [java]   java.lang.IllegalAccessError
     [java] Warnings generated: 90
     [java] Missing classes: 29
[INFO] Done FindBugs Analysis....
[INFO] 
[INFO] --- maven-site-plugin:2.1.1:site (default-site) @ oxtrust-model ---
[INFO]                                                                         
[INFO] ------------------------------------------------------------------------
[INFO] Building oxTrust Client library 4.3.1-SNAPSHOT
[INFO] ------------------------------------------------------------------------
Downloading: https://ox.gluu.org/maven/org/gluu/oxauth-client/4.3.1-SNAPSHOT/maven-metadata.xml
Downloading: https://repo1.maven.org/maven2/org/gluu/oxauth-client/4.3.1-SNAPSHOT/maven-metadata.xml
Downloading: https://build.shibboleth.net/nexus/content/repositories/releases/org/gluu/oxauth-client/4.3.1-SNAPSHOT/maven-metadata.xml
Downloading: https://repository.jboss.org/nexus/content/groups/public-jboss/org/gluu/oxauth-client/4.3.1-SNAPSHOT/maven-metadata.xml




[INFO] 
[INFO] --- maven-clean-plugin:2.5:clean (default-clean) @ oxtrust-client ---
[INFO] Deleting /home/jenkins/.jenkins/jobs/oxTrust/workspace/client/target
[INFO] 
[INFO] --- maven-resources-plugin:2.6:resources (default-resources) @ oxtrust-client ---
[INFO] Using 'UTF-8' encoding to copy filtered resources.
[INFO] skip non existing resourceDirectory /home/jenkins/.jenkins/jobs/oxTrust/workspace/client/src/main/resources
[INFO] 
[INFO] --- maven-compiler-plugin:2.3.2:compile (default-compile) @ oxtrust-client ---
[INFO] No sources to compile
[INFO] 
[INFO] --- maven-resources-plugin:2.6:resources (default-resources) @ oxtrust-client ---
[INFO] Using 'UTF-8' encoding to copy filtered resources.
[INFO] skip non existing resourceDirectory /home/jenkins/.jenkins/jobs/oxTrust/workspace/client/src/main/resources
[INFO] 
[INFO] --- maven-compiler-plugin:2.3.2:compile (default-compile) @ oxtrust-client ---
[INFO] No sources to compile
[INFO] 
[INFO] --- maven-resources-plugin:2.6:testResources (default-testResources) @ oxtrust-client ---
[INFO] Using 'UTF-8' encoding to copy filtered resources.
[INFO] skip non existing resourceDirectory /home/jenkins/.jenkins/jobs/oxTrust/workspace/client/src/test/resources
[INFO] 
[INFO] --- maven-compiler-plugin:2.3.2:testCompile (default-testCompile) @ oxtrust-client ---
[INFO] No sources to compile
[INFO] 
[INFO] --- maven-surefire-plugin:2.19.1:test (default-test) @ oxtrust-client ---
[INFO] No tests to run.
[INFO] 
[INFO] --- maven-jar-plugin:2.4:jar (default-jar) @ oxtrust-client ---
[WARNING] JAR will be empty - no content was marked for inclusion!
[INFO] Building jar: /home/jenkins/.jenkins/jobs/oxTrust/workspace/client/target/oxtrust-client-4.3.1-SNAPSHOT.jar
[INFO] 
[INFO] --- maven-jar-plugin:2.4:test-jar (default) @ oxtrust-client ---
[WARNING] JAR will be empty - no content was marked for inclusion!
[INFO] Building jar: /home/jenkins/.jenkins/jobs/oxTrust/workspace/client/target/oxtrust-client-4.3.1-SNAPSHOT-tests.jar
[INFO] 
[INFO] --- maven-install-plugin:2.3.1:install (default-install) @ oxtrust-client ---
[INFO] Installing /home/jenkins/.jenkins/jobs/oxTrust/workspace/client/target/oxtrust-client-4.3.1-SNAPSHOT.jar to /var/www/html/maven/org/gluu/oxtrust-client/4.3.1-SNAPSHOT/oxtrust-client-4.3.1-SNAPSHOT.jar
[INFO] Installing /home/jenkins/.jenkins/jobs/oxTrust/workspace/client/pom.xml to /var/www/html/maven/org/gluu/oxtrust-client/4.3.1-SNAPSHOT/oxtrust-client-4.3.1-SNAPSHOT.pom
[INFO] Installing /home/jenkins/.jenkins/jobs/oxTrust/workspace/client/target/oxtrust-client-4.3.1-SNAPSHOT-tests.jar to /var/www/html/maven/org/gluu/oxtrust-client/4.3.1-SNAPSHOT/oxtrust-client-4.3.1-SNAPSHOT-tests.jar
[INFO] 
[INFO] --- findbugs-maven-plugin:3.0.4:findbugs (default-cli) @ oxtrust-client ---
[INFO] 
[INFO] --- maven-site-plugin:2.1.1:site (default-site) @ oxtrust-client ---
[INFO]                                                                         
[INFO] ------------------------------------------------------------------------
[INFO] Building oxTrust Service 4.3.1-SNAPSHOT
[INFO] ------------------------------------------------------------------------
[INFO] 
[INFO] --- maven-clean-plugin:2.5:clean (default-clean) @ oxtrust-service ---
[INFO] Deleting /home/jenkins/.jenkins/jobs/oxTrust/workspace/service/target
[INFO] 
[INFO] --- maven-resources-plugin:2.6:resources (default-resources) @ oxtrust-service ---
[INFO] Using 'UTF-8' encoding to copy filtered resources.
[INFO] Copying 1 resource
[INFO] 
[INFO] --- maven-compiler-plugin:2.3.2:compile (default-compile) @ oxtrust-service ---
[INFO] Compiling 87 source files to /home/jenkins/.jenkins/jobs/oxTrust/workspace/service/target/classes
[INFO] -------------------------------------------------------------
[ERROR] COMPILATION ERROR : 
[INFO] -------------------------------------------------------------
[ERROR] /home/jenkins/.jenkins/jobs/oxTrust/workspace/service/src/main/java/org/gluu/oxtrust/auth/uma/BaseUmaProtectionService.java:[117,26] error: cannot access ClientExecutor
[INFO] 1 error
[INFO] -------------------------------------------------------------
[INFO] ------------------------------------------------------------------------
[INFO] Reactor Summary:
[INFO] 
[INFO] oxTrust ............................................ SUCCESS [  3.103 s]
[INFO] oxTrust static resources ........................... SUCCESS [  1.807 s]
[INFO] oxTrust configuration .............................. SUCCESS [  0.502 s]
[INFO] oxTrust Model library .............................. SUCCESS [ 11.217 s]
[INFO] oxTrust Client library ............................. SUCCESS [  0.454 s]
[INFO] oxTrust Service .................................... FAILURE [  2.878 s]
[INFO] OpenId authentication module ....................... SKIPPED
[INFO] oxTrust Server ..................................... SKIPPED
[INFO] OpenId authentication module for Saml .............. SKIPPED
[INFO] OpenId authentication module for CAS ............... SKIPPED
[INFO] oxTrust Server Test ................................ SKIPPED
[INFO] API Server ......................................... SKIPPED
[INFO] ------------------------------------------------------------------------
[INFO] BUILD FAILURE
[INFO] ------------------------------------------------------------------------
[INFO] Total time: 21.838 s
[INFO] Finished at: 2021-11-01T15:36:44+00:00
[INFO] Final Memory: 67M/230M
[INFO] ------------------------------------------------------------------------
[ERROR] Failed to execute goal org.apache.maven.plugins:maven-compiler-plugin:2.3.2:compile (default-compile) on project oxtrust-service: Compilation failure
[ERROR] /home/jenkins/.jenkins/jobs/oxTrust/workspace/service/src/main/java/org/gluu/oxtrust/auth/uma/BaseUmaProtectionService.java:[117,26] error: cannot access ClientExecutor
[ERROR] -> [Help 1]
[ERROR] 
[ERROR] To see the full stack trace of the errors, re-run Maven with the -e switch.
[ERROR] Re-run Maven using the -X switch to enable full debug logging.
[ERROR] 
[ERROR] For more information about the errors and possible solutions, please read the following articles:
[ERROR] [Help 1] http://cwiki.apache.org/confluence/display/MAVEN/MojoFailureException
[ERROR] 
[ERROR] After correcting the problems, you can resume the build with the command
[ERROR]   mvn <goals> -rf :oxtrust-service
Build step 'Invoke top-level Maven targets' marked build as failure
[FINDBUGS] Skipping publisher since build result is FAILURE
Publishing Javadoc
TestNG Reports Processing: START
Looking for TestNG results report in workspace using pattern: **/testng-results.xml
Did not find any matching files.
Not sending mail to unregistered user Yuriy.Movchan@gmail.com
Sending e-mails to: support@gluu.org
ERROR: Couldn't connect to host, port: webmail.gluu.org, 465; timeout 60000
com.sun.mail.util.MailConnectException: Couldn't connect to host, port: webmail.gluu.org, 465; timeout 60000;
  nested exception is:
	java.net.SocketTimeoutException: connect timed out
	at com.sun.mail.smtp.SMTPTransport.openServer(SMTPTransport.java:2210)
	at com.sun.mail.smtp.SMTPTransport.protocolConnect(SMTPTransport.java:722)
	at javax.mail.Service.connect(Service.java:310)
	at javax.mail.Service.connect(Service.java:169)
	at javax.mail.Service.connect(Service.java:118)
	at javax.mail.Transport.send0(Transport.java:188)
	at javax.mail.Transport.send(Transport.java:118)
	at hudson.tasks.MailSender.run(MailSender.java:130)
	at hudson.tasks.Mailer.perform(Mailer.java:176)
	at hudson.tasks.Mailer.perform(Mailer.java:139)
	at hudson.tasks.BuildStepMonitor$1.perform(BuildStepMonitor.java:20)
	at hudson.model.AbstractBuild$AbstractBuildExecution.perform(AbstractBuild.java:741)
	at hudson.model.AbstractBuild$AbstractBuildExecution.performAllBuildSteps(AbstractBuild.java:690)
	at hudson.model.Build$BuildExecution.post2(Build.java:186)
	at hudson.model.AbstractBuild$AbstractBuildExecution.post(AbstractBuild.java:635)
	at hudson.model.Run.execute(Run.java:1905)
	at hudson.model.FreeStyleBuild.run(FreeStyleBuild.java:43)
	at hudson.model.ResourceController.execute(ResourceController.java:97)
	at hudson.model.Executor.run(Executor.java:428)
Caused by: java.net.SocketTimeoutException: connect timed out
	at java.net.PlainSocketImpl.socketConnect(Native Method)
	at java.net.AbstractPlainSocketImpl.doConnect(AbstractPlainSocketImpl.java:350)
	at java.net.AbstractPlainSocketImpl.connectToAddress(AbstractPlainSocketImpl.java:206)
	at java.net.AbstractPlainSocketImpl.connect(AbstractPlainSocketImpl.java:188)
	at java.net.SocksSocketImpl.connect(SocksSocketImpl.java:392)
	at java.net.Socket.connect(Socket.java:589)
	at com.sun.mail.util.SocketFetcher.createSocket(SocketFetcher.java:333)
	at com.sun.mail.util.SocketFetcher.getSocket(SocketFetcher.java:193)
	at com.sun.mail.smtp.SMTPTransport.openServer(SMTPTransport.java:2160)
	... 18 more
[Boolean condition] checking [true] against [^(1|y|yes|t|true|on|run)$] (origin token: $DEPLOY_BUILD)
Run condition [Boolean condition] enabling perform for step [Builder to mark whether executed]
Finished: FAILURE