FailedConsole Output

Started by an SCM change
Running as SYSTEM
Building on master in workspace /home/jenkins/.jenkins/jobs/oxTrust/workspace
The recommended git tool is: NONE
No credentials specified
 > git rev-parse --is-inside-work-tree # timeout=10
Fetching changes from the remote Git repository
 > git config remote.origin.url https://github.com/GluuFederation/oxTrust # timeout=10
Fetching upstream changes from https://github.com/GluuFederation/oxTrust
 > git --version # timeout=10
 > git --version # 'git version 1.8.3.1'
 > git fetch --tags --progress https://github.com/GluuFederation/oxTrust +refs/heads/*:refs/remotes/origin/* # timeout=10
 > git rev-parse refs/remotes/origin/master^{commit} # timeout=10
 > git rev-parse refs/remotes/origin/origin/master^{commit} # timeout=10
Checking out Revision f5f75df1800faf8d795307ba26fa714730675c0e (refs/remotes/origin/master)
 > git config core.sparsecheckout # timeout=10
 > git checkout -f f5f75df1800faf8d795307ba26fa714730675c0e # timeout=10
Commit message: "feat: update to resteasy 4"
 > git rev-list --no-walk a99f42e2641a69e5391341c9b20bd5663358ee57 # timeout=10
Run condition [Boolean condition] enabling prebuild for step [Trigger/call builds on other projects]
[workspace] $ /bin/bash /opt/jetty/temp/jenkins7538553831087987360.sh
Cloning into 'oxHudsonProfiles'...
[workspace] $ /home/jenkins/.jenkins/tools/hudson.tasks.Maven_MavenInstallation/maven_3.3.9/bin/mvn -DDEPLOY_BUILD=true -DVERSION_NAME=master -DPROFILE_NAME=ce-dev5.gluu.org -DDEVELOPMENT_BUILD=false -DMAVEN_SKIP_TESTS=false -Dpython.import.site=false -DPYTHON_HOME=/opt/jython -Dcfg=ce-dev5.gluu.org -Dmaven.test.skip=false -Ddevelopment-build=false -Dskip.qa.test=true clean compile install findbugs:findbugs site
[INFO] Scanning for projects...
Downloading: https://build.shibboleth.net/nexus/content/repositories/releases/org/gluu/gluu-core-bom/4.3.1-SNAPSHOT/maven-metadata.xml
Downloading: https://repo1.maven.org/maven2/org/gluu/gluu-core-bom/4.3.1-SNAPSHOT/maven-metadata.xml


[WARNING] 
[WARNING] Some problems were encountered while building the effective model for org.gluu:oxtrust-model:jar:4.3.1-SNAPSHOT
[WARNING] 'dependencies.dependency.(groupId:artifactId:type:classifier)' must be unique: com.fasterxml.jackson.core:jackson-annotations:jar -> duplicate declaration of version (?) @ org.gluu:oxtrust-model:[unknown-version], /home/jenkins/.jenkins/jobs/oxTrust/workspace/model/pom.xml, line 85, column 15
[WARNING] 'dependencies.dependency.(groupId:artifactId:type:classifier)' must be unique: com.fasterxml.jackson.core:jackson-core:jar -> duplicate declaration of version (?) @ org.gluu:oxtrust-model:[unknown-version], /home/jenkins/.jenkins/jobs/oxTrust/workspace/model/pom.xml, line 89, column 15
[WARNING] 'dependencies.dependency.(groupId:artifactId:type:classifier)' must be unique: com.fasterxml.jackson.core:jackson-databind:jar -> duplicate declaration of version (?) @ org.gluu:oxtrust-model:[unknown-version], /home/jenkins/.jenkins/jobs/oxTrust/workspace/model/pom.xml, line 93, column 15
[WARNING] 
[WARNING] Some problems were encountered while building the effective model for org.gluu:oxtrust-service:jar:4.3.1-SNAPSHOT
[WARNING] 'build.plugins.plugin.version' for org.apache.maven.plugins:maven-javadoc-plugin is missing. @ org.gluu:oxtrust-service:[unknown-version], /home/jenkins/.jenkins/jobs/oxTrust/workspace/service/pom.xml, line 42, column 12
[WARNING] 
[WARNING] Some problems were encountered while building the effective model for org.gluu:oxtrust-server:war:4.3.1-SNAPSHOT
[WARNING] 'build.plugins.plugin.version' for org.apache.maven.plugins:maven-javadoc-plugin is missing. @ org.gluu:oxtrust-server:[unknown-version], /home/jenkins/.jenkins/jobs/oxTrust/workspace/server/pom.xml, line 69, column 12
[WARNING] 
[WARNING] Some problems were encountered while building the effective model for org.gluu:oxtrust-openid-auth-client:jar:4.3.1-SNAPSHOT
[WARNING] 'build.plugins.plugin.version' for org.apache.maven.plugins:maven-javadoc-plugin is missing. @ org.gluu:oxtrust-openid-auth-client:[unknown-version], /home/jenkins/.jenkins/jobs/oxTrust/workspace/openid-auth-client/pom.xml, line 22, column 21
[WARNING] 
[WARNING] Some problems were encountered while building the effective model for org.gluu:oxtrust-saml-openid-auth-client:jar:4.3.1-SNAPSHOT
[WARNING] 'build.plugins.plugin.version' for org.apache.maven.plugins:maven-javadoc-plugin is missing. @ org.gluu:oxtrust-saml-openid-auth-client:[unknown-version], /home/jenkins/.jenkins/jobs/oxTrust/workspace/saml-openid-auth-client/pom.xml, line 22, column 21
[WARNING] 
[WARNING] Some problems were encountered while building the effective model for org.gluu:oxtrust-cas-openid-auth-client:jar:4.3.1-SNAPSHOT
[WARNING] 'build.plugins.plugin.version' for org.apache.maven.plugins:maven-javadoc-plugin is missing. @ org.gluu:oxtrust-cas-openid-auth-client:[unknown-version], /home/jenkins/.jenkins/jobs/oxTrust/workspace/cas-openid-auth-client/pom.xml, line 27, column 12
[WARNING] 
[WARNING] It is highly recommended to fix these problems because they threaten the stability of your build.
[WARNING] 
[WARNING] For this reason, future Maven versions might no longer support building such malformed projects.
[WARNING] 
[INFO] ------------------------------------------------------------------------
[INFO] Reactor Build Order:
[INFO] 
[INFO] oxTrust
[INFO] oxTrust static resources
[INFO] oxTrust configuration
[INFO] oxTrust Model library
[INFO] oxTrust Client library
[INFO] oxTrust Service
[INFO] OpenId authentication module
[INFO] oxTrust Server
[INFO] OpenId authentication module for Saml
[INFO] OpenId authentication module for CAS
[INFO] oxTrust Server Test
[INFO] API Server
[INFO]                                                                         
[INFO] ------------------------------------------------------------------------
[INFO] Building oxTrust 4.3.1-SNAPSHOT
[INFO] ------------------------------------------------------------------------
[INFO] 
[INFO] --- maven-clean-plugin:2.5:clean (default-clean) @ oxtrust ---
[INFO] Deleting /home/jenkins/.jenkins/jobs/oxTrust/workspace/target
[INFO] 
[INFO] --- maven-install-plugin:2.3.1:install (default-install) @ oxtrust ---
[INFO] Installing /home/jenkins/.jenkins/jobs/oxTrust/workspace/pom.xml to /var/www/html/maven/org/gluu/oxtrust/4.3.1-SNAPSHOT/oxtrust-4.3.1-SNAPSHOT.pom
[INFO] 
[INFO] --- findbugs-maven-plugin:3.0.4:findbugs (default-cli) @ oxtrust ---
WARNING: An illegal reflective access operation has occurred
WARNING: Illegal reflective access by org.codehaus.groovy.reflection.CachedClass$3$1 (file:/var/www/html/maven/org/codehaus/groovy/groovy/2.4.7/groovy-2.4.7.jar) to method java.lang.Object.finalize()
WARNING: Please consider reporting this to the maintainers of org.codehaus.groovy.reflection.CachedClass$3$1
WARNING: Use --illegal-access=warn to enable warnings of further illegal reflective access operations
WARNING: All illegal access operations will be denied in a future release
[INFO] 
[INFO] --- maven-site-plugin:2.1.1:site (default-site) @ oxtrust ---
Downloading: https://repo1.maven.org/maven2/org/apache/maven/skins/maven-default-skin/maven-metadata.xml
Downloading: https://build.shibboleth.net/nexus/content/repositories/releases/org/apache/maven/skins/maven-default-skin/maven-metadata.xml
428/428 B   
            
Downloaded: https://repo1.maven.org/maven2/org/apache/maven/skins/maven-default-skin/maven-metadata.xml (428 B at 13.1 KB/sec)
            
[INFO]                                                                         
[INFO] ------------------------------------------------------------------------
[INFO] Building oxTrust static resources 4.3.1-SNAPSHOT
[INFO] ------------------------------------------------------------------------
[INFO] 
[INFO] --- maven-clean-plugin:2.5:clean (default-clean) @ oxtrust-static ---
[INFO] Deleting /home/jenkins/.jenkins/jobs/oxTrust/workspace/static/target
[INFO] 
[INFO] --- maven-resources-plugin:2.6:resources (default-resources) @ oxtrust-static ---
[INFO] Using 'UTF-8' encoding to copy filtered resources.
[INFO] Copying 337 resources
[INFO] 
[INFO] --- maven-compiler-plugin:2.3.2:compile (default-compile) @ oxtrust-static ---
[INFO] No sources to compile
[INFO] 
[INFO] --- maven-resources-plugin:2.6:resources (default-resources) @ oxtrust-static ---
[INFO] Using 'UTF-8' encoding to copy filtered resources.
[INFO] Copying 337 resources
[INFO] 
[INFO] --- maven-compiler-plugin:2.3.2:compile (default-compile) @ oxtrust-static ---
[INFO] No sources to compile
[INFO] 
[INFO] --- maven-resources-plugin:2.6:testResources (default-testResources) @ oxtrust-static ---
[INFO] Using 'UTF-8' encoding to copy filtered resources.
[INFO] skip non existing resourceDirectory /home/jenkins/.jenkins/jobs/oxTrust/workspace/static/src/test/resources
[INFO] 
[INFO] --- maven-compiler-plugin:2.3.2:testCompile (default-testCompile) @ oxtrust-static ---
[INFO] No sources to compile
[INFO] 
[INFO] --- maven-surefire-plugin:2.19.1:test (default-test) @ oxtrust-static ---
[INFO] No tests to run.
[INFO] 
[INFO] --- maven-jar-plugin:2.4:jar (default-jar) @ oxtrust-static ---
[INFO] Building jar: /home/jenkins/.jenkins/jobs/oxTrust/workspace/static/target/oxtrust-static-4.3.1-SNAPSHOT.jar
[INFO] 
[INFO] --- maven-jar-plugin:2.4:test-jar (default) @ oxtrust-static ---
[WARNING] JAR will be empty - no content was marked for inclusion!
[INFO] Building jar: /home/jenkins/.jenkins/jobs/oxTrust/workspace/static/target/oxtrust-static-4.3.1-SNAPSHOT-tests.jar
[INFO] 
[INFO] --- maven-install-plugin:2.3.1:install (default-install) @ oxtrust-static ---
[INFO] Installing /home/jenkins/.jenkins/jobs/oxTrust/workspace/static/target/oxtrust-static-4.3.1-SNAPSHOT.jar to /var/www/html/maven/org/gluu/oxtrust-static/4.3.1-SNAPSHOT/oxtrust-static-4.3.1-SNAPSHOT.jar
[INFO] Installing /home/jenkins/.jenkins/jobs/oxTrust/workspace/static/pom.xml to /var/www/html/maven/org/gluu/oxtrust-static/4.3.1-SNAPSHOT/oxtrust-static-4.3.1-SNAPSHOT.pom
[INFO] Installing /home/jenkins/.jenkins/jobs/oxTrust/workspace/static/target/oxtrust-static-4.3.1-SNAPSHOT-tests.jar to /var/www/html/maven/org/gluu/oxtrust-static/4.3.1-SNAPSHOT/oxtrust-static-4.3.1-SNAPSHOT-tests.jar
[INFO] 
[INFO] --- findbugs-maven-plugin:3.0.4:findbugs (default-cli) @ oxtrust-static ---
[INFO] 
[INFO] --- maven-site-plugin:2.1.1:site (default-site) @ oxtrust-static ---
[INFO]                                                                         
[INFO] ------------------------------------------------------------------------
[INFO] Building oxTrust configuration 4.3.1-SNAPSHOT
[INFO] ------------------------------------------------------------------------
[INFO] 
[INFO] --- maven-clean-plugin:2.5:clean (default-clean) @ oxtrust-configuration ---
[INFO] Deleting /home/jenkins/.jenkins/jobs/oxTrust/workspace/configuration/target
[INFO] 
[INFO] --- maven-resources-plugin:2.6:resources (default-resources) @ oxtrust-configuration ---
[INFO] Using 'UTF-8' encoding to copy filtered resources.
[INFO] Copying 3 resources
[INFO] Copying 32 resources
[INFO] 
[INFO] --- maven-compiler-plugin:2.3.2:compile (default-compile) @ oxtrust-configuration ---
[INFO] No sources to compile
[INFO] 
[INFO] --- maven-resources-plugin:2.6:resources (default-resources) @ oxtrust-configuration ---
[INFO] Using 'UTF-8' encoding to copy filtered resources.
[INFO] Copying 3 resources
[INFO] Copying 32 resources
[INFO] 
[INFO] --- maven-compiler-plugin:2.3.2:compile (default-compile) @ oxtrust-configuration ---
[INFO] No sources to compile
[INFO] 
[INFO] --- maven-resources-plugin:2.6:testResources (default-testResources) @ oxtrust-configuration ---
[INFO] Using 'UTF-8' encoding to copy filtered resources.
[INFO] skip non existing resourceDirectory /home/jenkins/.jenkins/jobs/oxTrust/workspace/configuration/src/test/resources
[INFO] 
[INFO] --- maven-compiler-plugin:2.3.2:testCompile (default-testCompile) @ oxtrust-configuration ---
[INFO] No sources to compile
[INFO] 
[INFO] --- maven-surefire-plugin:2.19.1:test (default-test) @ oxtrust-configuration ---
[INFO] No tests to run.
[INFO] 
[INFO] --- maven-jar-plugin:2.4:jar (default-jar) @ oxtrust-configuration ---
[INFO] Building jar: /home/jenkins/.jenkins/jobs/oxTrust/workspace/configuration/target/oxtrust-configuration-4.3.1-SNAPSHOT.jar
[INFO] 
[INFO] --- maven-jar-plugin:2.4:test-jar (default) @ oxtrust-configuration ---
[WARNING] JAR will be empty - no content was marked for inclusion!
[INFO] Building jar: /home/jenkins/.jenkins/jobs/oxTrust/workspace/configuration/target/oxtrust-configuration-4.3.1-SNAPSHOT-tests.jar
[INFO] 
[INFO] --- maven-install-plugin:2.3.1:install (default-install) @ oxtrust-configuration ---
[INFO] Installing /home/jenkins/.jenkins/jobs/oxTrust/workspace/configuration/target/oxtrust-configuration-4.3.1-SNAPSHOT.jar to /var/www/html/maven/org/gluu/oxtrust-configuration/4.3.1-SNAPSHOT/oxtrust-configuration-4.3.1-SNAPSHOT.jar
[INFO] Installing /home/jenkins/.jenkins/jobs/oxTrust/workspace/configuration/pom.xml to /var/www/html/maven/org/gluu/oxtrust-configuration/4.3.1-SNAPSHOT/oxtrust-configuration-4.3.1-SNAPSHOT.pom
[INFO] Installing /home/jenkins/.jenkins/jobs/oxTrust/workspace/configuration/target/oxtrust-configuration-4.3.1-SNAPSHOT-tests.jar to /var/www/html/maven/org/gluu/oxtrust-configuration/4.3.1-SNAPSHOT/oxtrust-configuration-4.3.1-SNAPSHOT-tests.jar
[INFO] 
[INFO] --- findbugs-maven-plugin:3.0.4:findbugs (default-cli) @ oxtrust-configuration ---
[INFO] 
[INFO] --- maven-site-plugin:2.1.1:site (default-site) @ oxtrust-configuration ---
[INFO]                                                                         
[INFO] ------------------------------------------------------------------------
[INFO] Building oxTrust Model library 4.3.1-SNAPSHOT
[INFO] ------------------------------------------------------------------------
Downloading: https://repo1.maven.org/maven2/org/gluu/oxcore-model/4.3.1-SNAPSHOT/maven-metadata.xml
Downloading: https://build.shibboleth.net/nexus/content/repositories/releases/org/gluu/oxcore-model/4.3.1-SNAPSHOT/maven-metadata.xml
Downloading: https://ox.gluu.org/maven/org/gluu/oxcore-model/4.3.1-SNAPSHOT/maven-metadata.xml
Downloading: https://repository.jboss.org/nexus/content/groups/public-jboss/org/gluu/oxcore-model/4.3.1-SNAPSHOT/maven-metadata.xml
            
            
            
            
Downloading: https://ox.gluu.org/maven/org/gluu/oxcore/4.3.1-SNAPSHOT/maven-metadata.xml
Downloading: https://repository.jboss.org/nexus/content/groups/public-jboss/org/gluu/oxcore/4.3.1-SNAPSHOT/maven-metadata.xml
Downloading: https://repo1.maven.org/maven2/org/gluu/oxcore/4.3.1-SNAPSHOT/maven-metadata.xml
Downloading: https://build.shibboleth.net/nexus/content/repositories/releases/org/gluu/oxcore/4.3.1-SNAPSHOT/maven-metadata.xml
            
            
            
            
Downloading: https://repository.jboss.org/nexus/content/groups/public-jboss/org/gluu/gluu-orm-annotation/4.3.1-SNAPSHOT/maven-metadata.xml
Downloading: https://ox.gluu.org/maven/org/gluu/gluu-orm-annotation/4.3.1-SNAPSHOT/maven-metadata.xml
Downloading: https://repo1.maven.org/maven2/org/gluu/gluu-orm-annotation/4.3.1-SNAPSHOT/maven-metadata.xml
Downloading: https://build.shibboleth.net/nexus/content/repositories/releases/org/gluu/gluu-orm-annotation/4.3.1-SNAPSHOT/maven-metadata.xml
            
            
            
            
Downloading: https://build.shibboleth.net/nexus/content/repositories/releases/org/gluu/gluu-orm-parent/4.3.1-SNAPSHOT/maven-metadata.xml
Downloading: https://ox.gluu.org/maven/org/gluu/gluu-orm-parent/4.3.1-SNAPSHOT/maven-metadata.xml
Downloading: https://repo1.maven.org/maven2/org/gluu/gluu-orm-parent/4.3.1-SNAPSHOT/maven-metadata.xml
Downloading: https://repository.jboss.org/nexus/content/groups/public-jboss/org/gluu/gluu-orm-parent/4.3.1-SNAPSHOT/maven-metadata.xml
            
            
            
            
Downloading: https://repository.jboss.org/nexus/content/groups/public-jboss/org/gluu/gluu-orm-model/4.3.1-SNAPSHOT/maven-metadata.xml
Downloading: https://ox.gluu.org/maven/org/gluu/gluu-orm-model/4.3.1-SNAPSHOT/maven-metadata.xml
Downloading: https://repo1.maven.org/maven2/org/gluu/gluu-orm-model/4.3.1-SNAPSHOT/maven-metadata.xml
Downloading: https://build.shibboleth.net/nexus/content/repositories/releases/org/gluu/gluu-orm-model/4.3.1-SNAPSHOT/maven-metadata.xml
            
            
            
            
Downloading: https://repo1.maven.org/maven2/org/gluu/gluu-orm-util/4.3.1-SNAPSHOT/maven-metadata.xml
Downloading: https://ox.gluu.org/maven/org/gluu/gluu-orm-util/4.3.1-SNAPSHOT/maven-metadata.xml
Downloading: https://repository.jboss.org/nexus/content/groups/public-jboss/org/gluu/gluu-orm-util/4.3.1-SNAPSHOT/maven-metadata.xml
Downloading: https://build.shibboleth.net/nexus/content/repositories/releases/org/gluu/gluu-orm-util/4.3.1-SNAPSHOT/maven-metadata.xml
            
            
            
            
Downloading: https://ox.gluu.org/maven/org/gluu/oxcore-util/4.3.1-SNAPSHOT/maven-metadata.xml
Downloading: https://repository.jboss.org/nexus/content/groups/public-jboss/org/gluu/oxcore-util/4.3.1-SNAPSHOT/maven-metadata.xml
Downloading: https://build.shibboleth.net/nexus/content/repositories/releases/org/gluu/oxcore-util/4.3.1-SNAPSHOT/maven-metadata.xml
Downloading: https://repo1.maven.org/maven2/org/gluu/oxcore-util/4.3.1-SNAPSHOT/maven-metadata.xml
            
            
            
            
Downloading: https://ox.gluu.org/maven/org/gluu/gluu-orm-ldap/4.3.1-SNAPSHOT/maven-metadata.xml
Downloading: https://repository.jboss.org/nexus/content/groups/public-jboss/org/gluu/gluu-orm-ldap/4.3.1-SNAPSHOT/maven-metadata.xml
Downloading: https://build.shibboleth.net/nexus/content/repositories/releases/org/gluu/gluu-orm-ldap/4.3.1-SNAPSHOT/maven-metadata.xml
Downloading: https://repo1.maven.org/maven2/org/gluu/gluu-orm-ldap/4.3.1-SNAPSHOT/maven-metadata.xml
            
            
            
            
Downloading: https://build.shibboleth.net/nexus/content/repositories/releases/org/gluu/gluu-orm-core/4.3.1-SNAPSHOT/maven-metadata.xml
Downloading: https://repository.jboss.org/nexus/content/groups/public-jboss/org/gluu/gluu-orm-core/4.3.1-SNAPSHOT/maven-metadata.xml
Downloading: https://ox.gluu.org/maven/org/gluu/gluu-orm-core/4.3.1-SNAPSHOT/maven-metadata.xml
Downloading: https://repo1.maven.org/maven2/org/gluu/gluu-orm-core/4.3.1-SNAPSHOT/maven-metadata.xml
            
            
            
            
Downloading: https://repository.jboss.org/nexus/content/groups/public-jboss/org/gluu/gluu-orm-filter/4.3.1-SNAPSHOT/maven-metadata.xml
Downloading: https://repo1.maven.org/maven2/org/gluu/gluu-orm-filter/4.3.1-SNAPSHOT/maven-metadata.xml
Downloading: https://build.shibboleth.net/nexus/content/repositories/releases/org/gluu/gluu-orm-filter/4.3.1-SNAPSHOT/maven-metadata.xml
Downloading: https://ox.gluu.org/maven/org/gluu/gluu-orm-filter/4.3.1-SNAPSHOT/maven-metadata.xml
            
            
            
            
Downloading: https://repository.jboss.org/nexus/content/groups/public-jboss/org/gluu/oxcore-service/4.3.1-SNAPSHOT/maven-metadata.xml
Downloading: https://ox.gluu.org/maven/org/gluu/oxcore-service/4.3.1-SNAPSHOT/maven-metadata.xml
Downloading: https://build.shibboleth.net/nexus/content/repositories/releases/org/gluu/oxcore-service/4.3.1-SNAPSHOT/maven-metadata.xml
Downloading: https://repo1.maven.org/maven2/org/gluu/oxcore-service/4.3.1-SNAPSHOT/maven-metadata.xml
            
            
            
            
Downloading: https://repo1.maven.org/maven2/org/gluu/gluu-orm-couchbase/4.3.1-SNAPSHOT/maven-metadata.xml
Downloading: https://build.shibboleth.net/nexus/content/repositories/releases/org/gluu/gluu-orm-couchbase/4.3.1-SNAPSHOT/maven-metadata.xml
Downloading: https://repository.jboss.org/nexus/content/groups/public-jboss/org/gluu/gluu-orm-couchbase/4.3.1-SNAPSHOT/maven-metadata.xml
Downloading: https://ox.gluu.org/maven/org/gluu/gluu-orm-couchbase/4.3.1-SNAPSHOT/maven-metadata.xml
            
            
            
            
Downloading: https://repository.jboss.org/nexus/content/groups/public-jboss/org/gluu/gluu-orm-spanner/4.3.1-SNAPSHOT/maven-metadata.xml
Downloading: https://repo1.maven.org/maven2/org/gluu/gluu-orm-spanner/4.3.1-SNAPSHOT/maven-metadata.xml
Downloading: https://ox.gluu.org/maven/org/gluu/gluu-orm-spanner/4.3.1-SNAPSHOT/maven-metadata.xml
Downloading: https://build.shibboleth.net/nexus/content/repositories/releases/org/gluu/gluu-orm-spanner/4.3.1-SNAPSHOT/maven-metadata.xml
            
            
            
            
Downloading: https://ox.gluu.org/maven/org/gluu/gluu-orm-sql/4.3.1-SNAPSHOT/maven-metadata.xml
Downloading: https://build.shibboleth.net/nexus/content/repositories/releases/org/gluu/gluu-orm-sql/4.3.1-SNAPSHOT/maven-metadata.xml
Downloading: https://repository.jboss.org/nexus/content/groups/public-jboss/org/gluu/gluu-orm-sql/4.3.1-SNAPSHOT/maven-metadata.xml
Downloading: https://repo1.maven.org/maven2/org/gluu/gluu-orm-sql/4.3.1-SNAPSHOT/maven-metadata.xml
            
            
            
            
Downloading: https://ox.gluu.org/maven/org/gluu/gluu-orm-hybrid/4.3.1-SNAPSHOT/maven-metadata.xml
Downloading: https://repository.jboss.org/nexus/content/groups/public-jboss/org/gluu/gluu-orm-hybrid/4.3.1-SNAPSHOT/maven-metadata.xml
Downloading: https://build.shibboleth.net/nexus/content/repositories/releases/org/gluu/gluu-orm-hybrid/4.3.1-SNAPSHOT/maven-metadata.xml
Downloading: https://repo1.maven.org/maven2/org/gluu/gluu-orm-hybrid/4.3.1-SNAPSHOT/maven-metadata.xml
            
            
            
            
Downloading: https://ox.gluu.org/maven/org/gluu/gluu-orm-cdi/4.3.1-SNAPSHOT/maven-metadata.xml
Downloading: https://repository.jboss.org/nexus/content/groups/public-jboss/org/gluu/gluu-orm-cdi/4.3.1-SNAPSHOT/maven-metadata.xml
Downloading: https://build.shibboleth.net/nexus/content/repositories/releases/org/gluu/gluu-orm-cdi/4.3.1-SNAPSHOT/maven-metadata.xml
Downloading: https://repo1.maven.org/maven2/org/gluu/gluu-orm-cdi/4.3.1-SNAPSHOT/maven-metadata.xml
            
            
            
            
Downloading: https://repository.jboss.org/nexus/content/groups/public-jboss/org/gluu/oxcore-cache/4.3.1-SNAPSHOT/maven-metadata.xml
Downloading: https://ox.gluu.org/maven/org/gluu/oxcore-cache/4.3.1-SNAPSHOT/maven-metadata.xml
Downloading: https://build.shibboleth.net/nexus/content/repositories/releases/org/gluu/oxcore-cache/4.3.1-SNAPSHOT/maven-metadata.xml
Downloading: https://repo1.maven.org/maven2/org/gluu/oxcore-cache/4.3.1-SNAPSHOT/maven-metadata.xml
            
            
            
            
Downloading: https://repository.jboss.org/nexus/content/groups/public-jboss/org/gluu/oxcore-script/4.3.1-SNAPSHOT/maven-metadata.xml
Downloading: https://repo1.maven.org/maven2/org/gluu/oxcore-script/4.3.1-SNAPSHOT/maven-metadata.xml
Downloading: https://build.shibboleth.net/nexus/content/repositories/releases/org/gluu/oxcore-script/4.3.1-SNAPSHOT/maven-metadata.xml
Downloading: https://ox.gluu.org/maven/org/gluu/oxcore-script/4.3.1-SNAPSHOT/maven-metadata.xml
            
            
            
            
Downloading: https://repo1.maven.org/maven2/org/gluu/oxcore-cdi/4.3.1-SNAPSHOT/maven-metadata.xml
Downloading: https://ox.gluu.org/maven/org/gluu/oxcore-cdi/4.3.1-SNAPSHOT/maven-metadata.xml
Downloading: https://build.shibboleth.net/nexus/content/repositories/releases/org/gluu/oxcore-cdi/4.3.1-SNAPSHOT/maven-metadata.xml
Downloading: https://repository.jboss.org/nexus/content/groups/public-jboss/org/gluu/oxcore-cdi/4.3.1-SNAPSHOT/maven-metadata.xml
            
            
            
            
Downloading: https://repository.jboss.org/nexus/content/groups/public-jboss/org/gluu/oxcore-server/4.3.1-SNAPSHOT/maven-metadata.xml
Downloading: https://repo1.maven.org/maven2/org/gluu/oxcore-server/4.3.1-SNAPSHOT/maven-metadata.xml
Downloading: https://build.shibboleth.net/nexus/content/repositories/releases/org/gluu/oxcore-server/4.3.1-SNAPSHOT/maven-metadata.xml
Downloading: https://ox.gluu.org/maven/org/gluu/oxcore-server/4.3.1-SNAPSHOT/maven-metadata.xml
            
            
            
            
Downloading: https://build.shibboleth.net/nexus/content/repositories/releases/org/gluu/oxcore-saml/4.3.1-SNAPSHOT/maven-metadata.xml
Downloading: https://ox.gluu.org/maven/org/gluu/oxcore-saml/4.3.1-SNAPSHOT/maven-metadata.xml
Downloading: https://repo1.maven.org/maven2/org/gluu/oxcore-saml/4.3.1-SNAPSHOT/maven-metadata.xml
Downloading: https://repository.jboss.org/nexus/content/groups/public-jboss/org/gluu/oxcore-saml/4.3.1-SNAPSHOT/maven-metadata.xml
            
            
            
            
Downloading: https://ox.gluu.org/maven/org/gluu/oxcore-document-store/4.3.1-SNAPSHOT/maven-metadata.xml
Downloading: https://build.shibboleth.net/nexus/content/repositories/releases/org/gluu/oxcore-document-store/4.3.1-SNAPSHOT/maven-metadata.xml
Downloading: https://repo1.maven.org/maven2/org/gluu/oxcore-document-store/4.3.1-SNAPSHOT/maven-metadata.xml
Downloading: https://repository.jboss.org/nexus/content/groups/public-jboss/org/gluu/oxcore-document-store/4.3.1-SNAPSHOT/maven-metadata.xml
            
            
            
            
Downloading: https://repository.jboss.org/nexus/content/groups/public-jboss/org/gluu/oxauth-model/4.3.1-SNAPSHOT/maven-metadata.xml
Downloading: https://ox.gluu.org/maven/org/gluu/oxauth-model/4.3.1-SNAPSHOT/maven-metadata.xml
Downloading: https://build.shibboleth.net/nexus/content/repositories/releases/org/gluu/oxauth-model/4.3.1-SNAPSHOT/maven-metadata.xml
Downloading: https://repo1.maven.org/maven2/org/gluu/oxauth-model/4.3.1-SNAPSHOT/maven-metadata.xml
            
            
            
            
Downloading: https://repository.jboss.org/nexus/content/groups/public-jboss/org/gluu/oxauth/4.3.1-SNAPSHOT/maven-metadata.xml
Downloading: https://ox.gluu.org/maven/org/gluu/oxauth/4.3.1-SNAPSHOT/maven-metadata.xml
Downloading: https://repo1.maven.org/maven2/org/gluu/oxauth/4.3.1-SNAPSHOT/maven-metadata.xml
Downloading: https://build.shibboleth.net/nexus/content/repositories/releases/org/gluu/oxauth/4.3.1-SNAPSHOT/maven-metadata.xml
            
            
            
            
Downloading: https://build.shibboleth.net/nexus/content/repositories/releases/org/gluu/oxeleven-client/4.3.1-SNAPSHOT/maven-metadata.xml
Downloading: https://repository.jboss.org/nexus/content/groups/public-jboss/org/gluu/oxeleven-client/4.3.1-SNAPSHOT/maven-metadata.xml
Downloading: https://ox.gluu.org/maven/org/gluu/oxeleven-client/4.3.1-SNAPSHOT/maven-metadata.xml
Downloading: https://repo1.maven.org/maven2/org/gluu/oxeleven-client/4.3.1-SNAPSHOT/maven-metadata.xml
            
Downloading: https://repo2.maven.org/maven2/org/bouncycastle/org/gluu/oxeleven-client/4.3.1-SNAPSHOT/maven-metadata.xml
            
            
            
            
[WARNING] Could not transfer metadata org.gluu:oxeleven-client:4.3.1-SNAPSHOT/maven-metadata.xml from/to bouncycastle (https://repo2.maven.org/maven2/org/bouncycastle): repo2.maven.org: Name or service not known
[WARNING] Failure to transfer org.gluu:oxeleven-client:4.3.1-SNAPSHOT/maven-metadata.xml from https://repo2.maven.org/maven2/org/bouncycastle was cached in the local repository, resolution will not be reattempted until the update interval of bouncycastle has elapsed or updates are forced. Original error: Could not transfer metadata org.gluu:oxeleven-client:4.3.1-SNAPSHOT/maven-metadata.xml from/to bouncycastle (https://repo2.maven.org/maven2/org/bouncycastle): repo2.maven.org: Name or service not known
[WARNING] The POM for org.gluu:oxeleven-client:jar:4.3.1-SNAPSHOT is invalid, transitive dependencies (if any) will not be available, enable debug logging for more details
Downloading: https://repository.jboss.org/nexus/content/groups/public-jboss/org/gluu/oxauth-persistence-model/4.3.1-SNAPSHOT/maven-metadata.xml
Downloading: https://build.shibboleth.net/nexus/content/repositories/releases/org/gluu/oxauth-persistence-model/4.3.1-SNAPSHOT/maven-metadata.xml
Downloading: https://repo1.maven.org/maven2/org/gluu/oxauth-persistence-model/4.3.1-SNAPSHOT/maven-metadata.xml
Downloading: https://ox.gluu.org/maven/org/gluu/oxauth-persistence-model/4.3.1-SNAPSHOT/maven-metadata.xml
            
            
            
            
[INFO] 
[INFO] --- maven-clean-plugin:2.5:clean (default-clean) @ oxtrust-model ---
[INFO] Deleting /home/jenkins/.jenkins/jobs/oxTrust/workspace/model/target
[INFO] 
[INFO] --- maven-resources-plugin:2.6:resources (default-resources) @ oxtrust-model ---
[INFO] Using 'UTF-8' encoding to copy filtered resources.
[INFO] skip non existing resourceDirectory /home/jenkins/.jenkins/jobs/oxTrust/workspace/model/src/main/resources
[INFO] 
[INFO] --- maven-compiler-plugin:2.3.2:compile (default-compile) @ oxtrust-model ---
[INFO] Compiling 84 source files to /home/jenkins/.jenkins/jobs/oxTrust/workspace/model/target/classes
[INFO] 
[INFO] --- maven-resources-plugin:2.6:resources (default-resources) @ oxtrust-model ---
[INFO] Using 'UTF-8' encoding to copy filtered resources.
[INFO] skip non existing resourceDirectory /home/jenkins/.jenkins/jobs/oxTrust/workspace/model/src/main/resources
[INFO] 
[INFO] --- maven-compiler-plugin:2.3.2:compile (default-compile) @ oxtrust-model ---
[INFO] Nothing to compile - all classes are up to date
[INFO] 
[INFO] --- maven-resources-plugin:2.6:testResources (default-testResources) @ oxtrust-model ---
[INFO] Using 'UTF-8' encoding to copy filtered resources.
[INFO] skip non existing resourceDirectory /home/jenkins/.jenkins/jobs/oxTrust/workspace/model/src/test/resources
[INFO] 
[INFO] --- maven-compiler-plugin:2.3.2:testCompile (default-testCompile) @ oxtrust-model ---
[INFO] No sources to compile
[INFO] 
[INFO] --- maven-surefire-plugin:2.19.1:test (default-test) @ oxtrust-model ---
[INFO] No tests to run.
[INFO] 
[INFO] --- maven-jar-plugin:2.4:jar (default-jar) @ oxtrust-model ---
[INFO] Building jar: /home/jenkins/.jenkins/jobs/oxTrust/workspace/model/target/oxtrust-model-4.3.1-SNAPSHOT.jar
[INFO] 
[INFO] --- maven-jar-plugin:2.4:test-jar (default) @ oxtrust-model ---
[WARNING] JAR will be empty - no content was marked for inclusion!
[INFO] Building jar: /home/jenkins/.jenkins/jobs/oxTrust/workspace/model/target/oxtrust-model-4.3.1-SNAPSHOT-tests.jar
[INFO] 
[INFO] --- maven-install-plugin:2.3.1:install (default-install) @ oxtrust-model ---
[INFO] Installing /home/jenkins/.jenkins/jobs/oxTrust/workspace/model/target/oxtrust-model-4.3.1-SNAPSHOT.jar to /var/www/html/maven/org/gluu/oxtrust-model/4.3.1-SNAPSHOT/oxtrust-model-4.3.1-SNAPSHOT.jar
[INFO] Installing /home/jenkins/.jenkins/jobs/oxTrust/workspace/model/pom.xml to /var/www/html/maven/org/gluu/oxtrust-model/4.3.1-SNAPSHOT/oxtrust-model-4.3.1-SNAPSHOT.pom
[INFO] Installing /home/jenkins/.jenkins/jobs/oxTrust/workspace/model/target/oxtrust-model-4.3.1-SNAPSHOT-tests.jar to /var/www/html/maven/org/gluu/oxtrust-model/4.3.1-SNAPSHOT/oxtrust-model-4.3.1-SNAPSHOT-tests.jar
[INFO] 
[INFO] --- findbugs-maven-plugin:3.0.4:findbugs (default-cli) @ oxtrust-model ---
[INFO] Fork Value is true
     [java] The following classes needed for analysis were missing:
     [java]   java.lang.Object
     [java]   java.lang.Enum
     [java]   java.io.Serializable
     [java]   java.lang.Cloneable
     [java]   java.lang.Comparable
     [java]   java.lang.String
     [java]   java.util.Date
     [java]   java.lang.StringBuilder
     [java]   java.util.List
     [java]   java.util.Map
     [java]   java.lang.StringBuffer
     [java]   java.util.HashMap
     [java]   java.util.ArrayList
     [java]   java.util.Iterator
     [java]   java.util.Arrays
     [java]   java.lang.Integer
     [java]   java.util.Set
     [java]   java.util.Collection
     [java]   java.lang.Boolean
     [java]   java.security.cert.X509Certificate
     [java]   java.security.Principal
     [java]   java.lang.System
     [java]   java.io.File
     [java]   java.util.TreeSet
     [java]   java.lang.IllegalArgumentException
     [java]   java.lang.Math
     [java]   java.time.LocalDate
     [java]   java.time.ZoneId
     [java]   java.time.ZonedDateTime
     [java]   java.lang.Long
     [java]   java.lang.NoSuchFieldError
     [java]   java.lang.UnsatisfiedLinkError
     [java]   java.lang.NoClassDefFoundError
     [java]   java.lang.CloneNotSupportedException
     [java]   java.lang.IllegalAccessError
     [java] Warnings generated: 90
     [java] Missing classes: 29
[INFO] Done FindBugs Analysis....
[INFO] 
[INFO] --- maven-site-plugin:2.1.1:site (default-site) @ oxtrust-model ---
[INFO]                                                                         
[INFO] ------------------------------------------------------------------------
[INFO] Building oxTrust Client library 4.3.1-SNAPSHOT
[INFO] ------------------------------------------------------------------------
Downloading: https://repository.jboss.org/nexus/content/groups/public-jboss/org/gluu/oxauth-client/4.3.1-SNAPSHOT/maven-metadata.xml
Downloading: https://ox.gluu.org/maven/org/gluu/oxauth-client/4.3.1-SNAPSHOT/maven-metadata.xml
Downloading: https://repo1.maven.org/maven2/org/gluu/oxauth-client/4.3.1-SNAPSHOT/maven-metadata.xml
Downloading: https://build.shibboleth.net/nexus/content/repositories/releases/org/gluu/oxauth-client/4.3.1-SNAPSHOT/maven-metadata.xml
            
            
            
            
Downloading: https://repo2.maven.org/maven2/org/bouncycastle/org/gluu/gluu-orm-annotation/4.3.1-SNAPSHOT/maven-metadata.xml
            
[WARNING] Could not transfer metadata org.gluu:gluu-orm-annotation:4.3.1-SNAPSHOT/maven-metadata.xml from/to bouncycastle (https://repo2.maven.org/maven2/org/bouncycastle): repo2.maven.org
Downloading: https://repo2.maven.org/maven2/org/bouncycastle/org/gluu/oxcore-model/4.3.1-SNAPSHOT/maven-metadata.xml
            
[WARNING] Could not transfer metadata org.gluu:oxcore-model:4.3.1-SNAPSHOT/maven-metadata.xml from/to bouncycastle (https://repo2.maven.org/maven2/org/bouncycastle): repo2.maven.org
Downloading: https://repo2.maven.org/maven2/org/bouncycastle/org/gluu/gluu-orm-model/4.3.1-SNAPSHOT/maven-metadata.xml
            
[WARNING] Could not transfer metadata org.gluu:gluu-orm-model:4.3.1-SNAPSHOT/maven-metadata.xml from/to bouncycastle (https://repo2.maven.org/maven2/org/bouncycastle): repo2.maven.org
Downloading: https://repo2.maven.org/maven2/org/bouncycastle/org/gluu/gluu-orm-util/4.3.1-SNAPSHOT/maven-metadata.xml
            
[WARNING] Could not transfer metadata org.gluu:gluu-orm-util:4.3.1-SNAPSHOT/maven-metadata.xml from/to bouncycastle (https://repo2.maven.org/maven2/org/bouncycastle): repo2.maven.org
[INFO] 
[INFO] --- maven-clean-plugin:2.5:clean (default-clean) @ oxtrust-client ---
[INFO] Deleting /home/jenkins/.jenkins/jobs/oxTrust/workspace/client/target
[INFO] 
[INFO] --- maven-resources-plugin:2.6:resources (default-resources) @ oxtrust-client ---
[INFO] Using 'UTF-8' encoding to copy filtered resources.
[INFO] skip non existing resourceDirectory /home/jenkins/.jenkins/jobs/oxTrust/workspace/client/src/main/resources
[INFO] 
[INFO] --- maven-compiler-plugin:2.3.2:compile (default-compile) @ oxtrust-client ---
[INFO] No sources to compile
[INFO] 
[INFO] --- maven-resources-plugin:2.6:resources (default-resources) @ oxtrust-client ---
[INFO] Using 'UTF-8' encoding to copy filtered resources.
[INFO] skip non existing resourceDirectory /home/jenkins/.jenkins/jobs/oxTrust/workspace/client/src/main/resources
[INFO] 
[INFO] --- maven-compiler-plugin:2.3.2:compile (default-compile) @ oxtrust-client ---
[INFO] No sources to compile
[INFO] 
[INFO] --- maven-resources-plugin:2.6:testResources (default-testResources) @ oxtrust-client ---
[INFO] Using 'UTF-8' encoding to copy filtered resources.
[INFO] skip non existing resourceDirectory /home/jenkins/.jenkins/jobs/oxTrust/workspace/client/src/test/resources
[INFO] 
[INFO] --- maven-compiler-plugin:2.3.2:testCompile (default-testCompile) @ oxtrust-client ---
[INFO] No sources to compile
[INFO] 
[INFO] --- maven-surefire-plugin:2.19.1:test (default-test) @ oxtrust-client ---
[INFO] No tests to run.
[INFO] 
[INFO] --- maven-jar-plugin:2.4:jar (default-jar) @ oxtrust-client ---
[WARNING] JAR will be empty - no content was marked for inclusion!
[INFO] Building jar: /home/jenkins/.jenkins/jobs/oxTrust/workspace/client/target/oxtrust-client-4.3.1-SNAPSHOT.jar
[INFO] 
[INFO] --- maven-jar-plugin:2.4:test-jar (default) @ oxtrust-client ---
[WARNING] JAR will be empty - no content was marked for inclusion!
[INFO] Building jar: /home/jenkins/.jenkins/jobs/oxTrust/workspace/client/target/oxtrust-client-4.3.1-SNAPSHOT-tests.jar
[INFO] 
[INFO] --- maven-install-plugin:2.3.1:install (default-install) @ oxtrust-client ---
[INFO] Installing /home/jenkins/.jenkins/jobs/oxTrust/workspace/client/target/oxtrust-client-4.3.1-SNAPSHOT.jar to /var/www/html/maven/org/gluu/oxtrust-client/4.3.1-SNAPSHOT/oxtrust-client-4.3.1-SNAPSHOT.jar
[INFO] Installing /home/jenkins/.jenkins/jobs/oxTrust/workspace/client/pom.xml to /var/www/html/maven/org/gluu/oxtrust-client/4.3.1-SNAPSHOT/oxtrust-client-4.3.1-SNAPSHOT.pom
[INFO] Installing /home/jenkins/.jenkins/jobs/oxTrust/workspace/client/target/oxtrust-client-4.3.1-SNAPSHOT-tests.jar to /var/www/html/maven/org/gluu/oxtrust-client/4.3.1-SNAPSHOT/oxtrust-client-4.3.1-SNAPSHOT-tests.jar
[INFO] 
[INFO] --- findbugs-maven-plugin:3.0.4:findbugs (default-cli) @ oxtrust-client ---
[INFO] 
[INFO] --- maven-site-plugin:2.1.1:site (default-site) @ oxtrust-client ---
[INFO]                                                                         
[INFO] ------------------------------------------------------------------------
[INFO] Building oxTrust Service 4.3.1-SNAPSHOT
[INFO] ------------------------------------------------------------------------
Downloading: https://ox.gluu.org/maven/org/gluu/oxcore-radius/4.3.1-SNAPSHOT/maven-metadata.xml
Downloading: https://repository.jboss.org/nexus/content/groups/public-jboss/org/gluu/oxcore-radius/4.3.1-SNAPSHOT/maven-metadata.xml
Downloading: https://build.shibboleth.net/nexus/content/repositories/releases/org/gluu/oxcore-radius/4.3.1-SNAPSHOT/maven-metadata.xml
Downloading: https://repo1.maven.org/maven2/org/gluu/oxcore-radius/4.3.1-SNAPSHOT/maven-metadata.xml
            
            
            
            
[INFO] 
[INFO] --- maven-clean-plugin:2.5:clean (default-clean) @ oxtrust-service ---
[INFO] Deleting /home/jenkins/.jenkins/jobs/oxTrust/workspace/service/target
[INFO] 
[INFO] --- maven-resources-plugin:2.6:resources (default-resources) @ oxtrust-service ---
[INFO] Using 'UTF-8' encoding to copy filtered resources.
[INFO] Copying 1 resource
[INFO] 
[INFO] --- maven-compiler-plugin:2.3.2:compile (default-compile) @ oxtrust-service ---
[INFO] Compiling 87 source files to /home/jenkins/.jenkins/jobs/oxTrust/workspace/service/target/classes
[INFO] -------------------------------------------------------------
[ERROR] COMPILATION ERROR : 
[INFO] -------------------------------------------------------------
[ERROR] /home/jenkins/.jenkins/jobs/oxTrust/workspace/service/src/main/java/org/gluu/oxtrust/auth/uma/BaseUmaProtectionService.java:[117,26] error: cannot access ClientExecutor
[INFO] 1 error
[INFO] -------------------------------------------------------------
[INFO] ------------------------------------------------------------------------
[INFO] Reactor Summary:
[INFO] 
[INFO] oxTrust ............................................ SUCCESS [  1.727 s]
[INFO] oxTrust static resources ........................... SUCCESS [  1.405 s]
[INFO] oxTrust configuration .............................. SUCCESS [  0.366 s]
[INFO] oxTrust Model library .............................. SUCCESS [ 15.926 s]
[INFO] oxTrust Client library ............................. SUCCESS [  0.403 s]
[INFO] oxTrust Service .................................... FAILURE [  2.560 s]
[INFO] OpenId authentication module ....................... SKIPPED
[INFO] oxTrust Server ..................................... SKIPPED
[INFO] OpenId authentication module for Saml .............. SKIPPED
[INFO] OpenId authentication module for CAS ............... SKIPPED
[INFO] oxTrust Server Test ................................ SKIPPED
[INFO] API Server ......................................... SKIPPED
[INFO] ------------------------------------------------------------------------
[INFO] BUILD FAILURE
[INFO] ------------------------------------------------------------------------
[INFO] Total time: 24.912 s
[INFO] Finished at: 2021-10-28T09:55:41+00:00
[INFO] Final Memory: 73M/250M
[INFO] ------------------------------------------------------------------------
[ERROR] Failed to execute goal org.apache.maven.plugins:maven-compiler-plugin:2.3.2:compile (default-compile) on project oxtrust-service: Compilation failure
[ERROR] /home/jenkins/.jenkins/jobs/oxTrust/workspace/service/src/main/java/org/gluu/oxtrust/auth/uma/BaseUmaProtectionService.java:[117,26] error: cannot access ClientExecutor
[ERROR] -> [Help 1]
[ERROR] 
[ERROR] To see the full stack trace of the errors, re-run Maven with the -e switch.
[ERROR] Re-run Maven using the -X switch to enable full debug logging.
[ERROR] 
[ERROR] For more information about the errors and possible solutions, please read the following articles:
[ERROR] [Help 1] http://cwiki.apache.org/confluence/display/MAVEN/MojoFailureException
[ERROR] 
[ERROR] After correcting the problems, you can resume the build with the command
[ERROR]   mvn <goals> -rf :oxtrust-service
Build step 'Invoke top-level Maven targets' marked build as failure
[FINDBUGS] Skipping publisher since build result is FAILURE
Publishing Javadoc
TestNG Reports Processing: START
Looking for TestNG results report in workspace using pattern: **/testng-results.xml
Did not find any matching files.
Not sending mail to unregistered user Yuriy.Movchan@gmail.com
Sending e-mails to: support@gluu.org
ERROR: Could not connect to SMTP host: webmail.gluu.org, port: 465
javax.mail.MessagingException: Could not connect to SMTP host: webmail.gluu.org, port: 465;
  nested exception is:
	javax.net.ssl.SSLHandshakeException: sun.security.validator.ValidatorException: PKIX path building failed: sun.security.provider.certpath.SunCertPathBuilderException: unable to find valid certification path to requested target
	at com.sun.mail.smtp.SMTPTransport.openServer(SMTPTransport.java:2212)
	at com.sun.mail.smtp.SMTPTransport.protocolConnect(SMTPTransport.java:722)
	at javax.mail.Service.connect(Service.java:310)
	at javax.mail.Service.connect(Service.java:169)
	at javax.mail.Service.connect(Service.java:118)
	at javax.mail.Transport.send0(Transport.java:188)
	at javax.mail.Transport.send(Transport.java:118)
	at hudson.tasks.MailSender.run(MailSender.java:130)
	at hudson.tasks.Mailer.perform(Mailer.java:176)
	at hudson.tasks.Mailer.perform(Mailer.java:139)
	at hudson.tasks.BuildStepMonitor$1.perform(BuildStepMonitor.java:20)
	at hudson.model.AbstractBuild$AbstractBuildExecution.perform(AbstractBuild.java:741)
	at hudson.model.AbstractBuild$AbstractBuildExecution.performAllBuildSteps(AbstractBuild.java:690)
	at hudson.model.Build$BuildExecution.post2(Build.java:186)
	at hudson.model.AbstractBuild$AbstractBuildExecution.post(AbstractBuild.java:635)
	at hudson.model.Run.execute(Run.java:1905)
	at hudson.model.FreeStyleBuild.run(FreeStyleBuild.java:43)
	at hudson.model.ResourceController.execute(ResourceController.java:97)
	at hudson.model.Executor.run(Executor.java:428)
Caused by: javax.net.ssl.SSLHandshakeException: sun.security.validator.ValidatorException: PKIX path building failed: sun.security.provider.certpath.SunCertPathBuilderException: unable to find valid certification path to requested target
	at sun.security.ssl.Alerts.getSSLException(Alerts.java:192)
	at sun.security.ssl.SSLSocketImpl.fatal(SSLSocketImpl.java:1949)
	at sun.security.ssl.Handshaker.fatalSE(Handshaker.java:302)
	at sun.security.ssl.Handshaker.fatalSE(Handshaker.java:296)
	at sun.security.ssl.ClientHandshaker.serverCertificate(ClientHandshaker.java:1514)
	at sun.security.ssl.ClientHandshaker.processMessage(ClientHandshaker.java:216)
	at sun.security.ssl.Handshaker.processLoop(Handshaker.java:1026)
	at sun.security.ssl.Handshaker.process_record(Handshaker.java:961)
	at sun.security.ssl.SSLSocketImpl.readRecord(SSLSocketImpl.java:1062)
	at sun.security.ssl.SSLSocketImpl.performInitialHandshake(SSLSocketImpl.java:1375)
	at sun.security.ssl.SSLSocketImpl.startHandshake(SSLSocketImpl.java:1403)
	at sun.security.ssl.SSLSocketImpl.startHandshake(SSLSocketImpl.java:1387)
	at com.sun.mail.util.SocketFetcher.configureSSLSocket(SocketFetcher.java:602)
	at com.sun.mail.util.SocketFetcher.createSocket(SocketFetcher.java:376)
	at com.sun.mail.util.SocketFetcher.getSocket(SocketFetcher.java:193)
	at com.sun.mail.smtp.SMTPTransport.openServer(SMTPTransport.java:2160)
	... 18 more
Caused by: sun.security.validator.ValidatorException: PKIX path building failed: sun.security.provider.certpath.SunCertPathBuilderException: unable to find valid certification path to requested target
	at sun.security.validator.PKIXValidator.doBuild(PKIXValidator.java:387)
	at sun.security.validator.PKIXValidator.engineValidate(PKIXValidator.java:230)
	at sun.security.validator.Validator.validate(Validator.java:260)
	at sun.security.ssl.X509TrustManagerImpl.validate(X509TrustManagerImpl.java:324)
	at sun.security.ssl.X509TrustManagerImpl.checkTrusted(X509TrustManagerImpl.java:229)
	at sun.security.ssl.X509TrustManagerImpl.checkServerTrusted(X509TrustManagerImpl.java:124)
	at sun.security.ssl.ClientHandshaker.serverCertificate(ClientHandshaker.java:1496)
	... 29 more
Caused by: sun.security.provider.certpath.SunCertPathBuilderException: unable to find valid certification path to requested target
	at sun.security.provider.certpath.SunCertPathBuilder.build(SunCertPathBuilder.java:141)
	at sun.security.provider.certpath.SunCertPathBuilder.engineBuild(SunCertPathBuilder.java:126)
	at java.security.cert.CertPathBuilder.build(CertPathBuilder.java:280)
	at sun.security.validator.PKIXValidator.doBuild(PKIXValidator.java:382)
	... 35 more
[Boolean condition] checking [true] against [^(1|y|yes|t|true|on|run)$] (origin token: $DEPLOY_BUILD)
Run condition [Boolean condition] enabling perform for step [Builder to mark whether executed]
Finished: FAILURE