FailedConsole Output

Started by an SCM change
Running as SYSTEM
Building on master in workspace /home/jenkins/.jenkins/jobs/oxTrust/workspace
The recommended git tool is: NONE
No credentials specified
 > git rev-parse --is-inside-work-tree # timeout=10
Fetching changes from the remote Git repository
 > git config remote.origin.url https://github.com/GluuFederation/oxTrust # timeout=10
Fetching upstream changes from https://github.com/GluuFederation/oxTrust
 > git --version # timeout=10
 > git --version # 'git version 1.8.3.1'
 > git fetch --tags --progress https://github.com/GluuFederation/oxTrust +refs/heads/*:refs/remotes/origin/* # timeout=10
 > git rev-parse refs/remotes/origin/master^{commit} # timeout=10
 > git rev-parse refs/remotes/origin/origin/master^{commit} # timeout=10
Checking out Revision a99f42e2641a69e5391341c9b20bd5663358ee57 (refs/remotes/origin/master)
 > git config core.sparsecheckout # timeout=10
 > git checkout -f a99f42e2641a69e5391341c9b20bd5663358ee57 # timeout=10
Commit message: "chore: update to conform resteasy 4"
 > git rev-list --no-walk d9ba3be9196f7898b555089705cadaf237259fe8 # timeout=10
Run condition [Boolean condition] enabling prebuild for step [Trigger/call builds on other projects]
[workspace] $ /bin/bash /opt/jetty/temp/jenkins385952016668971320.sh
Cloning into 'oxHudsonProfiles'...
[workspace] $ /home/jenkins/.jenkins/tools/hudson.tasks.Maven_MavenInstallation/maven_3.3.9/bin/mvn -DDEPLOY_BUILD=true -DVERSION_NAME=master -DPROFILE_NAME=ce-dev5.gluu.org -DDEVELOPMENT_BUILD=false -DMAVEN_SKIP_TESTS=false -Dpython.import.site=false -DPYTHON_HOME=/opt/jython -Dcfg=ce-dev5.gluu.org -Dmaven.test.skip=false -Ddevelopment-build=false -Dskip.qa.test=true clean compile install findbugs:findbugs site
[INFO] Scanning for projects...
[WARNING] 
[WARNING] Some problems were encountered while building the effective model for org.gluu:oxtrust-model:jar:4.3.1-SNAPSHOT
[WARNING] 'dependencies.dependency.(groupId:artifactId:type:classifier)' must be unique: com.fasterxml.jackson.core:jackson-annotations:jar -> duplicate declaration of version (?) @ org.gluu:oxtrust-model:[unknown-version], /home/jenkins/.jenkins/jobs/oxTrust/workspace/model/pom.xml, line 85, column 15
[WARNING] 'dependencies.dependency.(groupId:artifactId:type:classifier)' must be unique: com.fasterxml.jackson.core:jackson-core:jar -> duplicate declaration of version (?) @ org.gluu:oxtrust-model:[unknown-version], /home/jenkins/.jenkins/jobs/oxTrust/workspace/model/pom.xml, line 89, column 15
[WARNING] 'dependencies.dependency.(groupId:artifactId:type:classifier)' must be unique: com.fasterxml.jackson.core:jackson-databind:jar -> duplicate declaration of version (?) @ org.gluu:oxtrust-model:[unknown-version], /home/jenkins/.jenkins/jobs/oxTrust/workspace/model/pom.xml, line 93, column 15
[WARNING] 
[WARNING] Some problems were encountered while building the effective model for org.gluu:oxtrust-service:jar:4.3.1-SNAPSHOT
[WARNING] 'build.plugins.plugin.version' for org.apache.maven.plugins:maven-javadoc-plugin is missing. @ org.gluu:oxtrust-service:[unknown-version], /home/jenkins/.jenkins/jobs/oxTrust/workspace/service/pom.xml, line 42, column 12
[WARNING] 
[WARNING] Some problems were encountered while building the effective model for org.gluu:oxtrust-server:war:4.3.1-SNAPSHOT
[WARNING] 'build.plugins.plugin.version' for org.apache.maven.plugins:maven-javadoc-plugin is missing. @ org.gluu:oxtrust-server:[unknown-version], /home/jenkins/.jenkins/jobs/oxTrust/workspace/server/pom.xml, line 69, column 12
[WARNING] 
[WARNING] Some problems were encountered while building the effective model for org.gluu:oxtrust-openid-auth-client:jar:4.3.1-SNAPSHOT
[WARNING] 'build.plugins.plugin.version' for org.apache.maven.plugins:maven-javadoc-plugin is missing. @ org.gluu:oxtrust-openid-auth-client:[unknown-version], /home/jenkins/.jenkins/jobs/oxTrust/workspace/openid-auth-client/pom.xml, line 22, column 21
[WARNING] 
[WARNING] Some problems were encountered while building the effective model for org.gluu:oxtrust-saml-openid-auth-client:jar:4.3.1-SNAPSHOT
[WARNING] 'build.plugins.plugin.version' for org.apache.maven.plugins:maven-javadoc-plugin is missing. @ org.gluu:oxtrust-saml-openid-auth-client:[unknown-version], /home/jenkins/.jenkins/jobs/oxTrust/workspace/saml-openid-auth-client/pom.xml, line 22, column 21
[WARNING] 
[WARNING] Some problems were encountered while building the effective model for org.gluu:oxtrust-cas-openid-auth-client:jar:4.3.1-SNAPSHOT
[WARNING] 'build.plugins.plugin.version' for org.apache.maven.plugins:maven-javadoc-plugin is missing. @ org.gluu:oxtrust-cas-openid-auth-client:[unknown-version], /home/jenkins/.jenkins/jobs/oxTrust/workspace/cas-openid-auth-client/pom.xml, line 27, column 12
[WARNING] 
[WARNING] It is highly recommended to fix these problems because they threaten the stability of your build.
[WARNING] 
[WARNING] For this reason, future Maven versions might no longer support building such malformed projects.
[WARNING] 
[INFO] ------------------------------------------------------------------------
[INFO] Reactor Build Order:
[INFO] 
[INFO] oxTrust
[INFO] oxTrust static resources
[INFO] oxTrust configuration
[INFO] oxTrust Model library
[INFO] oxTrust Client library
[INFO] oxTrust Service
[INFO] OpenId authentication module
[INFO] oxTrust Server
[INFO] OpenId authentication module for Saml
[INFO] OpenId authentication module for CAS
[INFO] oxTrust Server Test
[INFO] API Server
[INFO]                                                                         
[INFO] ------------------------------------------------------------------------
[INFO] Building oxTrust 4.3.1-SNAPSHOT
[INFO] ------------------------------------------------------------------------
[INFO] 
[INFO] --- maven-clean-plugin:2.5:clean (default-clean) @ oxtrust ---
[INFO] Deleting /home/jenkins/.jenkins/jobs/oxTrust/workspace/target
[INFO] 
[INFO] --- maven-install-plugin:2.3.1:install (default-install) @ oxtrust ---
[INFO] Installing /home/jenkins/.jenkins/jobs/oxTrust/workspace/pom.xml to /var/www/html/maven/org/gluu/oxtrust/4.3.1-SNAPSHOT/oxtrust-4.3.1-SNAPSHOT.pom
[INFO] 
[INFO] --- findbugs-maven-plugin:3.0.4:findbugs (default-cli) @ oxtrust ---
WARNING: An illegal reflective access operation has occurred
WARNING: Illegal reflective access by org.codehaus.groovy.reflection.CachedClass$3$1 (file:/var/www/html/maven/org/codehaus/groovy/groovy/2.4.7/groovy-2.4.7.jar) to method java.lang.Object.finalize()
WARNING: Please consider reporting this to the maintainers of org.codehaus.groovy.reflection.CachedClass$3$1
WARNING: Use --illegal-access=warn to enable warnings of further illegal reflective access operations
WARNING: All illegal access operations will be denied in a future release
[INFO] 
[INFO] --- maven-site-plugin:2.1.1:site (default-site) @ oxtrust ---
[INFO]                                                                         
[INFO] ------------------------------------------------------------------------
[INFO] Building oxTrust static resources 4.3.1-SNAPSHOT
[INFO] ------------------------------------------------------------------------
[INFO] 
[INFO] --- maven-clean-plugin:2.5:clean (default-clean) @ oxtrust-static ---
[INFO] Deleting /home/jenkins/.jenkins/jobs/oxTrust/workspace/static/target
[INFO] 
[INFO] --- maven-resources-plugin:2.6:resources (default-resources) @ oxtrust-static ---
[INFO] Using 'UTF-8' encoding to copy filtered resources.
[INFO] Copying 337 resources
[INFO] 
[INFO] --- maven-compiler-plugin:2.3.2:compile (default-compile) @ oxtrust-static ---
[INFO] No sources to compile
[INFO] 
[INFO] --- maven-resources-plugin:2.6:resources (default-resources) @ oxtrust-static ---
[INFO] Using 'UTF-8' encoding to copy filtered resources.
[INFO] Copying 337 resources
[INFO] 
[INFO] --- maven-compiler-plugin:2.3.2:compile (default-compile) @ oxtrust-static ---
[INFO] No sources to compile
[INFO] 
[INFO] --- maven-resources-plugin:2.6:testResources (default-testResources) @ oxtrust-static ---
[INFO] Using 'UTF-8' encoding to copy filtered resources.
[INFO] skip non existing resourceDirectory /home/jenkins/.jenkins/jobs/oxTrust/workspace/static/src/test/resources
[INFO] 
[INFO] --- maven-compiler-plugin:2.3.2:testCompile (default-testCompile) @ oxtrust-static ---
[INFO] No sources to compile
[INFO] 
[INFO] --- maven-surefire-plugin:2.19.1:test (default-test) @ oxtrust-static ---
[INFO] No tests to run.
[INFO] 
[INFO] --- maven-jar-plugin:2.4:jar (default-jar) @ oxtrust-static ---
[INFO] Building jar: /home/jenkins/.jenkins/jobs/oxTrust/workspace/static/target/oxtrust-static-4.3.1-SNAPSHOT.jar
[INFO] 
[INFO] --- maven-jar-plugin:2.4:test-jar (default) @ oxtrust-static ---
[WARNING] JAR will be empty - no content was marked for inclusion!
[INFO] Building jar: /home/jenkins/.jenkins/jobs/oxTrust/workspace/static/target/oxtrust-static-4.3.1-SNAPSHOT-tests.jar
[INFO] 
[INFO] --- maven-install-plugin:2.3.1:install (default-install) @ oxtrust-static ---
[INFO] Installing /home/jenkins/.jenkins/jobs/oxTrust/workspace/static/target/oxtrust-static-4.3.1-SNAPSHOT.jar to /var/www/html/maven/org/gluu/oxtrust-static/4.3.1-SNAPSHOT/oxtrust-static-4.3.1-SNAPSHOT.jar
[INFO] Installing /home/jenkins/.jenkins/jobs/oxTrust/workspace/static/pom.xml to /var/www/html/maven/org/gluu/oxtrust-static/4.3.1-SNAPSHOT/oxtrust-static-4.3.1-SNAPSHOT.pom
[INFO] Installing /home/jenkins/.jenkins/jobs/oxTrust/workspace/static/target/oxtrust-static-4.3.1-SNAPSHOT-tests.jar to /var/www/html/maven/org/gluu/oxtrust-static/4.3.1-SNAPSHOT/oxtrust-static-4.3.1-SNAPSHOT-tests.jar
[INFO] 
[INFO] --- findbugs-maven-plugin:3.0.4:findbugs (default-cli) @ oxtrust-static ---
[INFO] 
[INFO] --- maven-site-plugin:2.1.1:site (default-site) @ oxtrust-static ---
[INFO]                                                                         
[INFO] ------------------------------------------------------------------------
[INFO] Building oxTrust configuration 4.3.1-SNAPSHOT
[INFO] ------------------------------------------------------------------------
[INFO] 
[INFO] --- maven-clean-plugin:2.5:clean (default-clean) @ oxtrust-configuration ---
[INFO] Deleting /home/jenkins/.jenkins/jobs/oxTrust/workspace/configuration/target
[INFO] 
[INFO] --- maven-resources-plugin:2.6:resources (default-resources) @ oxtrust-configuration ---
[INFO] Using 'UTF-8' encoding to copy filtered resources.
[INFO] Copying 3 resources
[INFO] Copying 32 resources
[INFO] 
[INFO] --- maven-compiler-plugin:2.3.2:compile (default-compile) @ oxtrust-configuration ---
[INFO] No sources to compile
[INFO] 
[INFO] --- maven-resources-plugin:2.6:resources (default-resources) @ oxtrust-configuration ---
[INFO] Using 'UTF-8' encoding to copy filtered resources.
[INFO] Copying 3 resources
[INFO] Copying 32 resources
[INFO] 
[INFO] --- maven-compiler-plugin:2.3.2:compile (default-compile) @ oxtrust-configuration ---
[INFO] No sources to compile
[INFO] 
[INFO] --- maven-resources-plugin:2.6:testResources (default-testResources) @ oxtrust-configuration ---
[INFO] Using 'UTF-8' encoding to copy filtered resources.
[INFO] skip non existing resourceDirectory /home/jenkins/.jenkins/jobs/oxTrust/workspace/configuration/src/test/resources
[INFO] 
[INFO] --- maven-compiler-plugin:2.3.2:testCompile (default-testCompile) @ oxtrust-configuration ---
[INFO] No sources to compile
[INFO] 
[INFO] --- maven-surefire-plugin:2.19.1:test (default-test) @ oxtrust-configuration ---
[INFO] No tests to run.
[INFO] 
[INFO] --- maven-jar-plugin:2.4:jar (default-jar) @ oxtrust-configuration ---
[INFO] Building jar: /home/jenkins/.jenkins/jobs/oxTrust/workspace/configuration/target/oxtrust-configuration-4.3.1-SNAPSHOT.jar
[INFO] 
[INFO] --- maven-jar-plugin:2.4:test-jar (default) @ oxtrust-configuration ---
[WARNING] JAR will be empty - no content was marked for inclusion!
[INFO] Building jar: /home/jenkins/.jenkins/jobs/oxTrust/workspace/configuration/target/oxtrust-configuration-4.3.1-SNAPSHOT-tests.jar
[INFO] 
[INFO] --- maven-install-plugin:2.3.1:install (default-install) @ oxtrust-configuration ---
[INFO] Installing /home/jenkins/.jenkins/jobs/oxTrust/workspace/configuration/target/oxtrust-configuration-4.3.1-SNAPSHOT.jar to /var/www/html/maven/org/gluu/oxtrust-configuration/4.3.1-SNAPSHOT/oxtrust-configuration-4.3.1-SNAPSHOT.jar
[INFO] Installing /home/jenkins/.jenkins/jobs/oxTrust/workspace/configuration/pom.xml to /var/www/html/maven/org/gluu/oxtrust-configuration/4.3.1-SNAPSHOT/oxtrust-configuration-4.3.1-SNAPSHOT.pom
[INFO] Installing /home/jenkins/.jenkins/jobs/oxTrust/workspace/configuration/target/oxtrust-configuration-4.3.1-SNAPSHOT-tests.jar to /var/www/html/maven/org/gluu/oxtrust-configuration/4.3.1-SNAPSHOT/oxtrust-configuration-4.3.1-SNAPSHOT-tests.jar
[INFO] 
[INFO] --- findbugs-maven-plugin:3.0.4:findbugs (default-cli) @ oxtrust-configuration ---
[INFO] 
[INFO] --- maven-site-plugin:2.1.1:site (default-site) @ oxtrust-configuration ---
[INFO]                                                                         
[INFO] ------------------------------------------------------------------------
[INFO] Building oxTrust Model library 4.3.1-SNAPSHOT
[INFO] ------------------------------------------------------------------------
[INFO] 
[INFO] --- maven-clean-plugin:2.5:clean (default-clean) @ oxtrust-model ---
[INFO] Deleting /home/jenkins/.jenkins/jobs/oxTrust/workspace/model/target
[INFO] 
[INFO] --- maven-resources-plugin:2.6:resources (default-resources) @ oxtrust-model ---
[INFO] Using 'UTF-8' encoding to copy filtered resources.
[INFO] skip non existing resourceDirectory /home/jenkins/.jenkins/jobs/oxTrust/workspace/model/src/main/resources
[INFO] 
[INFO] --- maven-compiler-plugin:2.3.2:compile (default-compile) @ oxtrust-model ---
[INFO] Compiling 84 source files to /home/jenkins/.jenkins/jobs/oxTrust/workspace/model/target/classes
[INFO] 
[INFO] --- maven-resources-plugin:2.6:resources (default-resources) @ oxtrust-model ---
[INFO] Using 'UTF-8' encoding to copy filtered resources.
[INFO] skip non existing resourceDirectory /home/jenkins/.jenkins/jobs/oxTrust/workspace/model/src/main/resources
[INFO] 
[INFO] --- maven-compiler-plugin:2.3.2:compile (default-compile) @ oxtrust-model ---
[INFO] Nothing to compile - all classes are up to date
[INFO] 
[INFO] --- maven-resources-plugin:2.6:testResources (default-testResources) @ oxtrust-model ---
[INFO] Using 'UTF-8' encoding to copy filtered resources.
[INFO] skip non existing resourceDirectory /home/jenkins/.jenkins/jobs/oxTrust/workspace/model/src/test/resources
[INFO] 
[INFO] --- maven-compiler-plugin:2.3.2:testCompile (default-testCompile) @ oxtrust-model ---
[INFO] No sources to compile
[INFO] 
[INFO] --- maven-surefire-plugin:2.19.1:test (default-test) @ oxtrust-model ---
[INFO] No tests to run.
[INFO] 
[INFO] --- maven-jar-plugin:2.4:jar (default-jar) @ oxtrust-model ---
[INFO] Building jar: /home/jenkins/.jenkins/jobs/oxTrust/workspace/model/target/oxtrust-model-4.3.1-SNAPSHOT.jar
[INFO] 
[INFO] --- maven-jar-plugin:2.4:test-jar (default) @ oxtrust-model ---
[WARNING] JAR will be empty - no content was marked for inclusion!
[INFO] Building jar: /home/jenkins/.jenkins/jobs/oxTrust/workspace/model/target/oxtrust-model-4.3.1-SNAPSHOT-tests.jar
[INFO] 
[INFO] --- maven-install-plugin:2.3.1:install (default-install) @ oxtrust-model ---
[INFO] Installing /home/jenkins/.jenkins/jobs/oxTrust/workspace/model/target/oxtrust-model-4.3.1-SNAPSHOT.jar to /var/www/html/maven/org/gluu/oxtrust-model/4.3.1-SNAPSHOT/oxtrust-model-4.3.1-SNAPSHOT.jar
[INFO] Installing /home/jenkins/.jenkins/jobs/oxTrust/workspace/model/pom.xml to /var/www/html/maven/org/gluu/oxtrust-model/4.3.1-SNAPSHOT/oxtrust-model-4.3.1-SNAPSHOT.pom
[INFO] Installing /home/jenkins/.jenkins/jobs/oxTrust/workspace/model/target/oxtrust-model-4.3.1-SNAPSHOT-tests.jar to /var/www/html/maven/org/gluu/oxtrust-model/4.3.1-SNAPSHOT/oxtrust-model-4.3.1-SNAPSHOT-tests.jar
[INFO] 
[INFO] --- findbugs-maven-plugin:3.0.4:findbugs (default-cli) @ oxtrust-model ---
[INFO] Fork Value is true
     [java] The following classes needed for analysis were missing:
     [java]   java.lang.Object
     [java]   java.lang.Enum
     [java]   java.io.Serializable
     [java]   java.lang.Cloneable
     [java]   java.lang.Comparable
     [java]   java.lang.String
     [java]   java.util.Date
     [java]   java.lang.StringBuilder
     [java]   java.util.List
     [java]   java.util.Map
     [java]   java.lang.StringBuffer
     [java]   java.util.HashMap
     [java]   java.util.ArrayList
     [java]   java.util.Iterator
     [java]   java.util.Arrays
     [java]   java.lang.Integer
     [java]   java.util.Set
     [java]   java.util.Collection
     [java]   java.lang.Boolean
     [java]   java.security.cert.X509Certificate
     [java]   java.security.Principal
     [java]   java.lang.System
     [java]   java.io.File
     [java]   java.util.TreeSet
     [java]   java.lang.IllegalArgumentException
     [java]   java.lang.Math
     [java]   java.time.LocalDate
     [java]   java.time.ZoneId
     [java]   java.time.ZonedDateTime
     [java]   java.lang.Long
     [java]   java.lang.NoSuchFieldError
     [java]   java.lang.UnsatisfiedLinkError
     [java]   java.lang.NoClassDefFoundError
     [java]   java.lang.CloneNotSupportedException
     [java]   java.lang.IllegalAccessError
     [java] Warnings generated: 90
     [java] Missing classes: 29
[INFO] Done FindBugs Analysis....
[INFO] 
[INFO] --- maven-site-plugin:2.1.1:site (default-site) @ oxtrust-model ---
[INFO]                                                                         
[INFO] ------------------------------------------------------------------------
[INFO] Building oxTrust Client library 4.3.1-SNAPSHOT
[INFO] ------------------------------------------------------------------------
[INFO] 
[INFO] --- maven-clean-plugin:2.5:clean (default-clean) @ oxtrust-client ---
[INFO] Deleting /home/jenkins/.jenkins/jobs/oxTrust/workspace/client/target
[INFO] 
[INFO] --- maven-resources-plugin:2.6:resources (default-resources) @ oxtrust-client ---
[INFO] Using 'UTF-8' encoding to copy filtered resources.
[INFO] skip non existing resourceDirectory /home/jenkins/.jenkins/jobs/oxTrust/workspace/client/src/main/resources
[INFO] 
[INFO] --- maven-compiler-plugin:2.3.2:compile (default-compile) @ oxtrust-client ---
[INFO] No sources to compile
[INFO] 
[INFO] --- maven-resources-plugin:2.6:resources (default-resources) @ oxtrust-client ---
[INFO] Using 'UTF-8' encoding to copy filtered resources.
[INFO] skip non existing resourceDirectory /home/jenkins/.jenkins/jobs/oxTrust/workspace/client/src/main/resources
[INFO] 
[INFO] --- maven-compiler-plugin:2.3.2:compile (default-compile) @ oxtrust-client ---
[INFO] No sources to compile
[INFO] 
[INFO] --- maven-resources-plugin:2.6:testResources (default-testResources) @ oxtrust-client ---
[INFO] Using 'UTF-8' encoding to copy filtered resources.
[INFO] skip non existing resourceDirectory /home/jenkins/.jenkins/jobs/oxTrust/workspace/client/src/test/resources
[INFO] 
[INFO] --- maven-compiler-plugin:2.3.2:testCompile (default-testCompile) @ oxtrust-client ---
[INFO] No sources to compile
[INFO] 
[INFO] --- maven-surefire-plugin:2.19.1:test (default-test) @ oxtrust-client ---
[INFO] No tests to run.
[INFO] 
[INFO] --- maven-jar-plugin:2.4:jar (default-jar) @ oxtrust-client ---
[WARNING] JAR will be empty - no content was marked for inclusion!
[INFO] Building jar: /home/jenkins/.jenkins/jobs/oxTrust/workspace/client/target/oxtrust-client-4.3.1-SNAPSHOT.jar
[INFO] 
[INFO] --- maven-jar-plugin:2.4:test-jar (default) @ oxtrust-client ---
[WARNING] JAR will be empty - no content was marked for inclusion!
[INFO] Building jar: /home/jenkins/.jenkins/jobs/oxTrust/workspace/client/target/oxtrust-client-4.3.1-SNAPSHOT-tests.jar
[INFO] 
[INFO] --- maven-install-plugin:2.3.1:install (default-install) @ oxtrust-client ---
[INFO] Installing /home/jenkins/.jenkins/jobs/oxTrust/workspace/client/target/oxtrust-client-4.3.1-SNAPSHOT.jar to /var/www/html/maven/org/gluu/oxtrust-client/4.3.1-SNAPSHOT/oxtrust-client-4.3.1-SNAPSHOT.jar
[INFO] Installing /home/jenkins/.jenkins/jobs/oxTrust/workspace/client/pom.xml to /var/www/html/maven/org/gluu/oxtrust-client/4.3.1-SNAPSHOT/oxtrust-client-4.3.1-SNAPSHOT.pom
[INFO] Installing /home/jenkins/.jenkins/jobs/oxTrust/workspace/client/target/oxtrust-client-4.3.1-SNAPSHOT-tests.jar to /var/www/html/maven/org/gluu/oxtrust-client/4.3.1-SNAPSHOT/oxtrust-client-4.3.1-SNAPSHOT-tests.jar
[INFO] 
[INFO] --- findbugs-maven-plugin:3.0.4:findbugs (default-cli) @ oxtrust-client ---
[INFO] 
[INFO] --- maven-site-plugin:2.1.1:site (default-site) @ oxtrust-client ---
[INFO]                                                                         
[INFO] ------------------------------------------------------------------------
[INFO] Building oxTrust Service 4.3.1-SNAPSHOT
[INFO] ------------------------------------------------------------------------
[INFO] 
[INFO] --- maven-clean-plugin:2.5:clean (default-clean) @ oxtrust-service ---
[INFO] Deleting /home/jenkins/.jenkins/jobs/oxTrust/workspace/service/target
[INFO] 
[INFO] --- maven-resources-plugin:2.6:resources (default-resources) @ oxtrust-service ---
[INFO] Using 'UTF-8' encoding to copy filtered resources.
[INFO] Copying 1 resource
[INFO] 
[INFO] --- maven-compiler-plugin:2.3.2:compile (default-compile) @ oxtrust-service ---
[INFO] Compiling 87 source files to /home/jenkins/.jenkins/jobs/oxTrust/workspace/service/target/classes
[INFO] 
[INFO] --- maven-resources-plugin:2.6:resources (default-resources) @ oxtrust-service ---
[INFO] Using 'UTF-8' encoding to copy filtered resources.
[INFO] Copying 1 resource
[INFO] 
[INFO] --- maven-compiler-plugin:2.3.2:compile (default-compile) @ oxtrust-service ---
[INFO] Nothing to compile - all classes are up to date
[INFO] 
[INFO] --- maven-resources-plugin:2.6:testResources (default-testResources) @ oxtrust-service ---
[INFO] Using 'UTF-8' encoding to copy filtered resources.
[INFO] skip non existing resourceDirectory /home/jenkins/.jenkins/jobs/oxTrust/workspace/service/src/test/resources
[INFO] 
[INFO] --- maven-compiler-plugin:2.3.2:testCompile (default-testCompile) @ oxtrust-service ---
[INFO] No sources to compile
[INFO] 
[INFO] --- maven-surefire-plugin:2.19.1:test (default-test) @ oxtrust-service ---
[INFO] No tests to run.
[INFO] 
[INFO] --- maven-jar-plugin:2.4:jar (default-jar) @ oxtrust-service ---
[INFO] Building jar: /home/jenkins/.jenkins/jobs/oxTrust/workspace/service/target/oxtrust-service-4.3.1-SNAPSHOT.jar
[INFO] 
[INFO] --- maven-jar-plugin:2.4:test-jar (default) @ oxtrust-service ---
[WARNING] JAR will be empty - no content was marked for inclusion!
[INFO] Building jar: /home/jenkins/.jenkins/jobs/oxTrust/workspace/service/target/oxtrust-service-4.3.1-SNAPSHOT-tests.jar
[INFO] 
[INFO] --- maven-install-plugin:2.3.1:install (default-install) @ oxtrust-service ---
[INFO] Installing /home/jenkins/.jenkins/jobs/oxTrust/workspace/service/target/oxtrust-service-4.3.1-SNAPSHOT.jar to /var/www/html/maven/org/gluu/oxtrust-service/4.3.1-SNAPSHOT/oxtrust-service-4.3.1-SNAPSHOT.jar
[INFO] Installing /home/jenkins/.jenkins/jobs/oxTrust/workspace/service/pom.xml to /var/www/html/maven/org/gluu/oxtrust-service/4.3.1-SNAPSHOT/oxtrust-service-4.3.1-SNAPSHOT.pom
[INFO] Installing /home/jenkins/.jenkins/jobs/oxTrust/workspace/service/target/oxtrust-service-4.3.1-SNAPSHOT-tests.jar to /var/www/html/maven/org/gluu/oxtrust-service/4.3.1-SNAPSHOT/oxtrust-service-4.3.1-SNAPSHOT-tests.jar
[INFO] 
[INFO] --- findbugs-maven-plugin:3.0.4:findbugs (default-cli) @ oxtrust-service ---
[INFO] Fork Value is true
     [java] The following classes needed for analysis were missing:
     [java]   java.lang.Object
     [java]   java.io.Serializable
     [java]   java.io.FilenameFilter
     [java]   java.lang.annotation.Annotation
     [java]   java.lang.Exception
     [java]   java.lang.RuntimeException
     [java]   java.lang.Enum
     [java]   java.util.function.Function
     [java]   java.util.function.Supplier
     [java]   java.util.function.Predicate
     [java]   java.lang.Cloneable
     [java]   java.lang.Class
     [java]   java.lang.StringBuilder
     [java]   java.util.Arrays
     [java]   java.util.List
     [java]   java.util.ArrayList
     [java]   java.util.Date
     [java]   java.lang.Throwable
     [java]   java.lang.String
     [java]   java.time.Instant
     [java]   java.util.Iterator
     [java]   java.util.UUID
     [java]   java.lang.Integer
     [java]   java.lang.Boolean
     [java]   java.io.File
     [java]   java.util.Properties
     [java]   java.io.StringWriter
     [java]   java.io.IOException
     [java]   java.lang.ClassLoader
     [java]   java.io.InputStream
     [java]   java.lang.Thread
     [java]   java.net.URLClassLoader
     [java]   java.net.URL
     [java]   java.util.HashSet
     [java]   java.util.Set
     [java]   java.net.JarURLConnection
     [java]   java.util.jar.JarFile
     [java]   java.util.Enumeration
     [java]   java.util.jar.JarEntry
     [java]   java.lang.System
     [java]   java.security.KeyStore
     [java]   java.io.FileInputStream
     [java]   javax.net.ssl.SSLContext
     [java]   java.util.Map
     [java]   java.util.Objects
     [java]   java.util.stream.Stream
     [java]   java.util.Optional
     [java]   java.util.HashMap
     [java]   java.util.Collections
     [java]   java.lang.Iterable
     [java]   java.security.SecureRandom
     [java]   java.lang.Math
     [java]   java.lang.IllegalArgumentException
     [java]   java.io.ByteArrayInputStream
     [java]   java.io.FileOutputStream
     [java]   java.io.ByteArrayOutputStream
     [java]   java.lang.StringBuffer
     [java]   java.time.format.DateTimeFormatter
     [java]   java.time.LocalDateTime
     [java]   java.lang.Package
     [java]   java.text.SimpleDateFormat
     [java]   java.util.LinkedList
     [java]   java.util.Collection
     [java]   java.lang.Long
     [java]   java.lang.reflect.AnnotatedElement
     [java]   java.util.Comparator
     [java]   java.nio.charset.Charset
     [java]   java.io.InputStreamReader
     [java]   java.net.HttpURLConnection
     [java]   java.util.stream.Collectors
     [java]   java.util.concurrent.atomic.AtomicBoolean
     [java]   java.util.concurrent.locks.ReentrantLock
     [java]   java.util.Calendar
     [java]   java.lang.reflect.Method
     [java]   java.security.cert.Certificate
     [java]   java.io.Reader
     [java]   java.security.cert.CertificateFactory
     [java]   java.security.cert.CertPath
     [java]   java.lang.NoSuchFieldError
     [java]   java.lang.UnsatisfiedLinkError
     [java]   java.lang.IllegalAccessError
     [java]   java.lang.IncompatibleClassChangeError
     [java]   java.lang.AbstractMethodError
     [java]   java.lang.ClassFormatError
     [java]   java.lang.VerifyError
     [java]   java.lang.ExceptionInInitializerError
     [java]   java.lang.Error
     [java]   java.lang.NegativeArraySizeException
     [java]   java.lang.ArrayIndexOutOfBoundsException
     [java]   java.lang.NullPointerException
     [java]   java.net.MalformedURLException
     [java]   java.lang.InterruptedException
     [java]   java.lang.invoke.LambdaMetafactory
     [java]   java.lang.invoke.MethodHandles$Lookup
     [java]   java.lang.invoke.MethodHandles
     [java]   java.io.BufferedReader
     [java]   java.security.cert.X509CRL
     [java]   java.security.KeyStoreException
     [java]   java.security.KeyManagementException
     [java]   java.util.Arrays$ArrayList
     [java]   java.lang.NoClassDefFoundError
     [java] Warnings generated: 39
     [java] Missing classes: 82
[INFO] Done FindBugs Analysis....
[INFO] 
[INFO] --- maven-site-plugin:2.1.1:site (default-site) @ oxtrust-service ---
[INFO]                                                                         
[INFO] ------------------------------------------------------------------------
[INFO] Building OpenId authentication module 4.3.1-SNAPSHOT
[INFO] ------------------------------------------------------------------------
[INFO] 
[INFO] --- maven-clean-plugin:2.5:clean (default-clean) @ oxtrust-openid-auth-client ---
[INFO] Deleting /home/jenkins/.jenkins/jobs/oxTrust/workspace/openid-auth-client/target
[INFO] 
[INFO] --- maven-resources-plugin:2.6:resources (default-resources) @ oxtrust-openid-auth-client ---
[INFO] Using 'UTF-8' encoding to copy filtered resources.
[INFO] skip non existing resourceDirectory /home/jenkins/.jenkins/jobs/oxTrust/workspace/openid-auth-client/src/main/resources
[INFO] 
[INFO] --- maven-compiler-plugin:2.3.2:compile (default-compile) @ oxtrust-openid-auth-client ---
[INFO] Compiling 6 source files to /home/jenkins/.jenkins/jobs/oxTrust/workspace/openid-auth-client/target/classes
[INFO] 
[INFO] --- maven-resources-plugin:2.6:resources (default-resources) @ oxtrust-openid-auth-client ---
[INFO] Using 'UTF-8' encoding to copy filtered resources.
[INFO] skip non existing resourceDirectory /home/jenkins/.jenkins/jobs/oxTrust/workspace/openid-auth-client/src/main/resources
[INFO] 
[INFO] --- maven-compiler-plugin:2.3.2:compile (default-compile) @ oxtrust-openid-auth-client ---
[INFO] Nothing to compile - all classes are up to date
[INFO] 
[INFO] --- maven-resources-plugin:2.6:testResources (default-testResources) @ oxtrust-openid-auth-client ---
[INFO] Using 'UTF-8' encoding to copy filtered resources.
[INFO] skip non existing resourceDirectory /home/jenkins/.jenkins/jobs/oxTrust/workspace/openid-auth-client/src/test/resources
[INFO] 
[INFO] --- maven-compiler-plugin:2.3.2:testCompile (default-testCompile) @ oxtrust-openid-auth-client ---
[INFO] No sources to compile
[INFO] 
[INFO] --- maven-surefire-plugin:2.19.1:test (default-test) @ oxtrust-openid-auth-client ---
[INFO] No tests to run.
[INFO] 
[INFO] --- maven-jar-plugin:2.4:jar (default-jar) @ oxtrust-openid-auth-client ---
[INFO] Building jar: /home/jenkins/.jenkins/jobs/oxTrust/workspace/openid-auth-client/target/oxtrust-openid-auth-client-4.3.1-SNAPSHOT.jar
[INFO] 
[INFO] --- maven-jar-plugin:2.4:test-jar (default) @ oxtrust-openid-auth-client ---
[WARNING] JAR will be empty - no content was marked for inclusion!
[INFO] Building jar: /home/jenkins/.jenkins/jobs/oxTrust/workspace/openid-auth-client/target/oxtrust-openid-auth-client-4.3.1-SNAPSHOT-tests.jar
[INFO] 
[INFO] --- maven-install-plugin:2.3.1:install (default-install) @ oxtrust-openid-auth-client ---
[INFO] Installing /home/jenkins/.jenkins/jobs/oxTrust/workspace/openid-auth-client/target/oxtrust-openid-auth-client-4.3.1-SNAPSHOT.jar to /var/www/html/maven/org/gluu/oxtrust-openid-auth-client/4.3.1-SNAPSHOT/oxtrust-openid-auth-client-4.3.1-SNAPSHOT.jar
[INFO] Installing /home/jenkins/.jenkins/jobs/oxTrust/workspace/openid-auth-client/pom.xml to /var/www/html/maven/org/gluu/oxtrust-openid-auth-client/4.3.1-SNAPSHOT/oxtrust-openid-auth-client-4.3.1-SNAPSHOT.pom
[INFO] Installing /home/jenkins/.jenkins/jobs/oxTrust/workspace/openid-auth-client/target/oxtrust-openid-auth-client-4.3.1-SNAPSHOT-tests.jar to /var/www/html/maven/org/gluu/oxtrust-openid-auth-client/4.3.1-SNAPSHOT/oxtrust-openid-auth-client-4.3.1-SNAPSHOT-tests.jar
[INFO] 
[INFO] --- findbugs-maven-plugin:3.0.4:findbugs (default-cli) @ oxtrust-openid-auth-client ---
[INFO] Fork Value is true
     [java] The following classes needed for analysis were missing:
     [java]   java.lang.Object
     [java]   java.lang.RuntimeException
     [java]   java.io.Serializable
     [java]   java.util.HashMap
     [java]   java.util.Collections
     [java]   java.util.Map
     [java]   java.lang.StringBuilder
     [java]   java.util.concurrent.locks.ReentrantLock
     [java]   java.lang.System
     [java]   java.util.Date
     [java]   java.util.Arrays
     [java]   java.lang.Class
     [java]   java.util.Set
     [java]   java.util.Iterator
     [java]   java.util.Map$Entry
     [java]   java.lang.Boolean
     [java]   java.lang.Integer
     [java]   java.util.List
     [java]   java.lang.NoSuchFieldError
     [java]   java.lang.UnsatisfiedLinkError
     [java]   java.lang.String
     [java]   java.lang.IllegalAccessError
     [java]   java.lang.IncompatibleClassChangeError
     [java]   java.lang.AbstractMethodError
     [java]   java.lang.Error
     [java]   java.lang.Exception
     [java]   java.lang.Enum
     [java] Missing classes: 24
[INFO] Done FindBugs Analysis....
[INFO] 
[INFO] --- maven-site-plugin:2.1.1:site (default-site) @ oxtrust-openid-auth-client ---
[INFO]                                                                         
[INFO] ------------------------------------------------------------------------
[INFO] Building oxTrust Server 4.3.1-SNAPSHOT
[INFO] ------------------------------------------------------------------------
Downloading: https://repository.jboss.org/nexus/content/groups/public-jboss/org/gluu/scim-model/4.3.1-SNAPSHOT/maven-metadata.xml
Downloading: https://ox.gluu.org/maven/org/gluu/scim-model/4.3.1-SNAPSHOT/maven-metadata.xml
Downloading: https://build.shibboleth.net/nexus/content/repositories/releases/org/gluu/scim-model/4.3.1-SNAPSHOT/maven-metadata.xml
Downloading: https://repo1.maven.org/maven2/org/gluu/scim-model/4.3.1-SNAPSHOT/maven-metadata.xml




Downloading: https://ox.gluu.org/maven/org/gluu/scim/4.3.1-SNAPSHOT/maven-metadata.xml
Downloading: https://repo1.maven.org/maven2/org/gluu/scim/4.3.1-SNAPSHOT/maven-metadata.xml
Downloading: https://build.shibboleth.net/nexus/content/repositories/releases/org/gluu/scim/4.3.1-SNAPSHOT/maven-metadata.xml
Downloading: https://repository.jboss.org/nexus/content/groups/public-jboss/org/gluu/scim/4.3.1-SNAPSHOT/maven-metadata.xml




[INFO] 
[INFO] --- maven-clean-plugin:2.5:clean (default-clean) @ oxtrust-server ---
[INFO] Deleting /home/jenkins/.jenkins/jobs/oxTrust/workspace/server/target
[INFO] 
[INFO] --- buildnumber-maven-plugin:1.1:create (default) @ oxtrust-server ---
[INFO] Checking for local modifications: skipped.
[INFO] Updating project files from SCM: skipped.
[INFO] Executing: /bin/sh -c cd /home/jenkins/.jenkins/jobs/oxTrust/workspace/server && git rev-parse --verify HEAD
[INFO] Working directory: /home/jenkins/.jenkins/jobs/oxTrust/workspace/server
[INFO] Storing buildNumber: a99f42e2641a69e5391341c9b20bd5663358ee57 at timestamp: 1635269965543
[INFO] Executing: /bin/sh -c cd /home/jenkins/.jenkins/jobs/oxTrust/workspace/server && git rev-parse --verify HEAD
[INFO] Working directory: /home/jenkins/.jenkins/jobs/oxTrust/workspace/server
[INFO] Storing buildScmBranch: UNKNOWN
[INFO] 
[INFO] --- git-commit-id-plugin:2.2.6:revision (get-the-git-infos) @ oxtrust-server ---
[INFO] 
[INFO] --- maven-resources-plugin:2.6:resources (default-resources) @ oxtrust-server ---
[INFO] Using 'UTF-8' encoding to copy filtered resources.
[INFO] Copying 109 resources
[INFO] 
[INFO] --- maven-compiler-plugin:2.3.2:compile (default-compile) @ oxtrust-server ---
[INFO] Compiling 179 source files to /home/jenkins/.jenkins/jobs/oxTrust/workspace/server/target/classes
[INFO] 
[INFO] --- maven-jar-plugin:2.4:jar (make-a-jar) @ oxtrust-server ---
[INFO] Building jar: /home/jenkins/.jenkins/jobs/oxTrust/workspace/server/target/oxtrust-server.jar
[INFO] 
[INFO] --- buildnumber-maven-plugin:1.1:create (default) @ oxtrust-server ---
[INFO] Checking for local modifications: skipped.
[INFO] Updating project files from SCM: skipped.
[INFO] Executing: /bin/sh -c cd /home/jenkins/.jenkins/jobs/oxTrust/workspace/server && git rev-parse --verify HEAD
[INFO] Working directory: /home/jenkins/.jenkins/jobs/oxTrust/workspace/server
[INFO] Storing buildNumber: a99f42e2641a69e5391341c9b20bd5663358ee57 at timestamp: 1635269971604
[INFO] Executing: /bin/sh -c cd /home/jenkins/.jenkins/jobs/oxTrust/workspace/server && git rev-parse --verify HEAD
[INFO] Working directory: /home/jenkins/.jenkins/jobs/oxTrust/workspace/server
[INFO] Storing buildScmBranch: UNKNOWN
[INFO] 
[INFO] --- git-commit-id-plugin:2.2.6:revision (get-the-git-infos) @ oxtrust-server ---
[INFO] 
[INFO] --- maven-resources-plugin:2.6:resources (default-resources) @ oxtrust-server ---
[INFO] Using 'UTF-8' encoding to copy filtered resources.
[INFO] Copying 109 resources
[INFO] 
[INFO] --- maven-compiler-plugin:2.3.2:compile (default-compile) @ oxtrust-server ---
[INFO] Nothing to compile - all classes are up to date
[INFO] 
[INFO] --- maven-jar-plugin:2.4:jar (make-a-jar) @ oxtrust-server ---
[INFO] Building jar: /home/jenkins/.jenkins/jobs/oxTrust/workspace/server/target/oxtrust-server.jar
[INFO] 
[INFO] --- maven-resources-plugin:2.6:testResources (default-testResources) @ oxtrust-server ---
[INFO] Using 'UTF-8' encoding to copy filtered resources.
[INFO] Copying 96 resources
[INFO] Copying 6 resources
[INFO] 
[INFO] --- maven-resources-plugin:2.6:copy-resources (prepare-configuration-files) @ oxtrust-server ---
[INFO] Using 'UTF-8' encoding to copy filtered resources.
[INFO] Copying 98 resources
[INFO] 
[INFO] --- maven-compiler-plugin:2.3.2:testCompile (default-testCompile) @ oxtrust-server ---
[INFO] Compiling 13 source files to /home/jenkins/.jenkins/jobs/oxTrust/workspace/server/target/test-classes
[INFO] 
[INFO] --- maven-surefire-plugin:2.19.1:test (default-test) @ oxtrust-server ---

-------------------------------------------------------
 T E S T S
-------------------------------------------------------
Running TestSuite
Invoked init test suite method
2021-10-26 17:39:37,085 INFO  [main] [org.reflections.Reflections] (Reflections.java:229) - Reflections took 88 ms to scan 1 urls, producing 8 keys and 13 values 
Oct 26, 2021 5:39:37 PM org.eu.ingwar.tools.arquillian.extension.suite.DeploymentClassFinder getDeploymentClassFromAnnotation
INFO: arquillian-suite-deployment: Found class annotated with @ArquillianSuiteDeployment: org.gluu.oxtrust.action.ConfigurableTest
Oct 26, 2021 5:39:37 PM org.jboss.arquillian.container.impl.MapObject populate
WARNING: Configuration contain properties not supported by the backing object org.jboss.arquillian.container.jetty.embedded_9.JettyEmbeddedConfiguration
Unused property entries: {javaVmArguments=-Xms256m -Xmx512m -XX:MaxPermSize=256m}
Supported property names: [tempDirectory, dumpServerAfterStart, mimeTypes, bindHttpPort, idleTimeoutMillis, headerBufferSize, defaultsDescriptor, classloaderBehavior, configurationClasses, bindAddress, realmProperties, httpConfiguration]
Oct 26, 2021 5:39:37 PM org.eclipse.jetty.util.log.Log initialized
INFO: Logging initialized @2692ms to org.eclipse.jetty.util.log.JavaUtilLog
Oct 26, 2021 5:39:37 PM org.jboss.arquillian.container.jetty.embedded_9.JettyEmbeddedContainer start
INFO: Starting Jetty Embedded Server 9.4.9.v20180320 [id:1846345504]
Oct 26, 2021 5:39:37 PM org.eclipse.jetty.server.Server doStart
INFO: jetty-9.4.9.v20180320; built: 2018-03-20T12:21:10Z; git: 1f8159b1e4a42d3f79997021ea1609f2fbac6de5; jvm 11.0.7+10-LTS
Oct 26, 2021 5:39:37 PM org.eclipse.jetty.server.AbstractConnector doStart
INFO: Started ServerConnector@43034809{HTTP/1.1,[http/1.1]}{localhost:9980}
Oct 26, 2021 5:39:37 PM org.eclipse.jetty.server.Server doStart
INFO: Started @2887ms
Oct 26, 2021 5:39:41 PM org.jboss.arquillian.container.jetty.embedded_9.ArquillianAppProvider createApp
INFO: Webapp archive location: file:/home/jenkins/.jenkins/jobs/oxTrust/workspace/server/target/arquillian-jetty-temp/export4039690275338673376oxtrust.war
Oct 26, 2021 5:39:41 PM org.eclipse.jetty.annotations.AnnotationConfiguration scanForAnnotations
INFO: Scanning elapsed time=157ms
Oct 26, 2021 5:39:41 PM org.eclipse.jetty.webapp.StandardDescriptorProcessor visitServlet
INFO: NO JSP Support for /export4039690275338673376oxtrust, did not find org.eclipse.jetty.jsp.JettyJspServlet
2021-10-26 17:39:48,251 INFO  [main] [org.gluu.oxauth.model.util.SecurityProviderUtility] (SecurityProviderUtility.java:24) - Adding Bouncy Castle Provider
2021-10-26 17:39:48,513 INFO  [main] [org.gluu.oxtrust.util.BuildVersionService] (BuildVersionService.java:80) - Root element :beans
2021-10-26 17:39:48,518 INFO  [main] [org.gluu.oxtrust.service.AppInitializer] (AppInitializer.java:261) - Build date 2021-10-26 17:38. Code revision a99f42e2641a69e5391341c9b20bd5663358ee57 on 2021-10-26T17:37:07+0000. Build 482
2021-10-26 17:39:48,527 INFO  [main] [org.gluu.service.config.ConfigurationFactory] (ConfigurationFactory.java:127) - Creating oxTrustConfiguration
2021-10-26 17:39:48,681 INFO  [main] [org.gluu.service.config.ConfigurationFactory] (ConfigurationFactory.java:289) - Loading configuration from 'ldap' DB...
2021-10-26 17:39:50,176 INFO  [main] [org.gluu.oxtrust.service.AppInitializer] (AppInitializer.java:305) - Created persistenceEntryManager: org.gluu.persist.ldap.impl.LdapEntryManager@55e2bb1d with operation service: org.gluu.persist.ldap.operation.impl.LdapOperationServiceImpl@2608d45d
2021-10-26 17:39:50,290 ERROR [main] [org.gluu.oxtrust.service.config.ConfigurationFactory] (ConfigurationFactory.java:70) - Failed to load configuration from LDAP
org.gluu.persist.exception.EntryPersistenceException: Failed to find entry: ou=oxtrust,ou=configuration,o=gluu
	at org.gluu.persist.ldap.impl.LdapEntryManager.find(LdapEntryManager.java:405) ~[gluu-orm-ldap-4.3.1-SNAPSHOT.jar:?]
	at org.gluu.persist.impl.BaseEntryManager.find(BaseEntryManager.java:713) ~[gluu-orm-core-4.3.1-SNAPSHOT.jar:?]
	at org.gluu.persist.impl.BaseEntryManager.find(BaseEntryManager.java:592) ~[gluu-orm-core-4.3.1-SNAPSHOT.jar:?]
	at jdk.internal.reflect.NativeMethodAccessorImpl.invoke0(Native Method) ~[?:?]
	at jdk.internal.reflect.NativeMethodAccessorImpl.invoke(NativeMethodAccessorImpl.java:62) ~[?:?]
	at jdk.internal.reflect.DelegatingMethodAccessorImpl.invoke(DelegatingMethodAccessorImpl.java:43) ~[?:?]
	at java.lang.reflect.Method.invoke(Method.java:566) ~[?:?]
	at org.jboss.weld.bean.proxy.AbstractBeanInstance.invoke(AbstractBeanInstance.java:38) ~[weld-core-impl-3.1.8.Final.jar:3.1.8.Final]
	at org.jboss.weld.bean.proxy.ProxyMethodHandler.invoke(ProxyMethodHandler.java:106) ~[weld-core-impl-3.1.8.Final.jar:3.1.8.Final]
	at org.gluu.persist.PersistenceEntryManager$EntityManager$735981338$Proxy$_$$_WeldClientProxy.find(Unknown Source) ~[gluu-orm-core-4.3.1-SNAPSHOT.jar:?]
	at org.gluu.oxtrust.service.config.ConfigurationFactory.loadConfigurationFromDb(ConfigurationFactory.java:65) [classes/:?]
	at org.gluu.oxtrust.service.config.ConfigurationFactory$Proxy$_$$_WeldSubclass.loadConfigurationFromDb(Unknown Source) [classes/:?]
	at org.gluu.oxtrust.service.config.ConfigurationFactory.loadConfigurationFromDb(ConfigurationFactory.java:29) [classes/:?]
	at org.gluu.service.config.ConfigurationFactory.createFromDb(ConfigurationFactory.java:291) [oxtrust-service-4.3.1-SNAPSHOT.jar:?]
	at org.gluu.service.config.ConfigurationFactory.create(ConfigurationFactory.java:146) [oxtrust-service-4.3.1-SNAPSHOT.jar:?]
	at org.gluu.oxtrust.service.config.ConfigurationFactory$Proxy$_$$_WeldSubclass.create(Unknown Source) [classes/:?]
	at org.gluu.oxtrust.service.config.ConfigurationFactory$Proxy$_$$_WeldClientProxy.create(Unknown Source) [classes/:?]
	at org.gluu.oxtrust.service.AppInitializer.applicationInitialized(AppInitializer.java:187) [classes/:?]
	at jdk.internal.reflect.NativeMethodAccessorImpl.invoke0(Native Method) ~[?:?]
	at jdk.internal.reflect.NativeMethodAccessorImpl.invoke(NativeMethodAccessorImpl.java:62) ~[?:?]
	at jdk.internal.reflect.DelegatingMethodAccessorImpl.invoke(DelegatingMethodAccessorImpl.java:43) ~[?:?]
	at java.lang.reflect.Method.invoke(Method.java:566) ~[?:?]
	at org.jboss.weld.injection.StaticMethodInjectionPoint.invoke(StaticMethodInjectionPoint.java:95) [weld-core-impl-3.1.8.Final.jar:3.1.8.Final]
	at org.jboss.weld.injection.StaticMethodInjectionPoint.invoke(StaticMethodInjectionPoint.java:85) [weld-core-impl-3.1.8.Final.jar:3.1.8.Final]
	at org.jboss.weld.injection.MethodInvocationStrategy$SimpleMethodInvocationStrategy.invoke(MethodInvocationStrategy.java:168) [weld-core-impl-3.1.8.Final.jar:3.1.8.Final]
	at org.jboss.weld.event.ObserverMethodImpl.sendEvent(ObserverMethodImpl.java:330) [weld-core-impl-3.1.8.Final.jar:3.1.8.Final]
	at org.jboss.weld.event.ObserverMethodImpl.sendEvent(ObserverMethodImpl.java:308) [weld-core-impl-3.1.8.Final.jar:3.1.8.Final]
	at org.jboss.weld.event.ObserverMethodImpl.notify(ObserverMethodImpl.java:286) [weld-core-impl-3.1.8.Final.jar:3.1.8.Final]
	at javax.enterprise.inject.spi.ObserverMethod.notify(ObserverMethod.java:124) [cdi-api-2.0.SP1.jar:${parsedVersion.osgiVersion}]
	at org.jboss.weld.util.Observers.notify(Observers.java:166) [weld-core-impl-3.1.8.Final.jar:3.1.8.Final]
	at org.jboss.weld.event.ObserverNotifier.notifySyncObservers(ObserverNotifier.java:285) [weld-core-impl-3.1.8.Final.jar:3.1.8.Final]
	at org.jboss.weld.event.ObserverNotifier.notify(ObserverNotifier.java:273) [weld-core-impl-3.1.8.Final.jar:3.1.8.Final]
	at org.jboss.weld.event.ObserverNotifier.fireEvent(ObserverNotifier.java:177) [weld-core-impl-3.1.8.Final.jar:3.1.8.Final]
	at org.jboss.weld.bootstrap.BeanDeploymentModule.fireEvent(BeanDeploymentModule.java:93) [weld-core-impl-3.1.8.Final.jar:3.1.8.Final]
	at org.jboss.weld.module.web.servlet.HttpContextLifecycle.fireEventForApplicationScope(HttpContextLifecycle.java:161) [weld-web-3.1.8.Final.jar:3.1.8.Final]
	at org.jboss.weld.module.web.servlet.HttpContextLifecycle.contextInitialized(HttpContextLifecycle.java:147) [weld-web-3.1.8.Final.jar:3.1.8.Final]
	at org.jboss.weld.module.web.servlet.WeldInitialListener.contextInitialized(WeldInitialListener.java:99) [weld-web-3.1.8.Final.jar:3.1.8.Final]
	at org.jboss.weld.servlet.api.helpers.ForwardingServletListener.contextInitialized(ForwardingServletListener.java:34) [weld-spi-3.1.SP4.jar:3.1.0.SP4]
	at org.jboss.weld.environment.servlet.EnhancedListener.onStartup(EnhancedListener.java:66) [weld-servlet-core-3.1.8.Final.jar:3.1.8.Final]
	at org.eclipse.jetty.plus.annotation.ContainerInitializer.callStartup(ContainerInitializer.java:140) [jetty-plus-9.4.9.v20180320.jar:9.4.9.v20180320]
	at org.eclipse.jetty.annotations.ServletContainerInitializersStarter.doStart(ServletContainerInitializersStarter.java:64) [jetty-annotations-9.4.9.v20180320.jar:9.4.9.v20180320]
	at org.eclipse.jetty.util.component.AbstractLifeCycle.start(AbstractLifeCycle.java:68) [jetty-util-9.4.9.v20180320.jar:9.4.9.v20180320]
	at org.eclipse.jetty.servlet.ServletContextHandler.startContext(ServletContextHandler.java:355) [jetty-servlet-9.4.9.v20180320.jar:9.4.9.v20180320]
	at org.eclipse.jetty.webapp.WebAppContext.startWebapp(WebAppContext.java:1497) [jetty-webapp-9.4.9.v20180320.jar:9.4.9.v20180320]
	at org.eclipse.jetty.webapp.WebAppContext.startContext(WebAppContext.java:1459) [jetty-webapp-9.4.9.v20180320.jar:9.4.9.v20180320]
	at org.eclipse.jetty.server.handler.ContextHandler.doStart(ContextHandler.java:785) [jetty-server-9.4.9.v20180320.jar:9.4.9.v20180320]
	at org.eclipse.jetty.servlet.ServletContextHandler.doStart(ServletContextHandler.java:287) [jetty-servlet-9.4.9.v20180320.jar:9.4.9.v20180320]
	at org.eclipse.jetty.webapp.WebAppContext.doStart(WebAppContext.java:545) [jetty-webapp-9.4.9.v20180320.jar:9.4.9.v20180320]
	at org.eclipse.jetty.util.component.AbstractLifeCycle.start(AbstractLifeCycle.java:68) [jetty-util-9.4.9.v20180320.jar:9.4.9.v20180320]
	at org.eclipse.jetty.deploy.bindings.StandardStarter.processBinding(StandardStarter.java:46) [jetty-deploy-9.4.9.v20180320.jar:9.4.9.v20180320]
	at org.eclipse.jetty.deploy.AppLifeCycle.runBindings(AppLifeCycle.java:192) [jetty-deploy-9.4.9.v20180320.jar:9.4.9.v20180320]
	at org.eclipse.jetty.deploy.DeploymentManager.requestAppGoal(DeploymentManager.java:505) [jetty-deploy-9.4.9.v20180320.jar:9.4.9.v20180320]
	at org.eclipse.jetty.deploy.DeploymentManager.addApp(DeploymentManager.java:151) [jetty-deploy-9.4.9.v20180320.jar:9.4.9.v20180320]
	at org.jboss.arquillian.container.jetty.embedded_9.JettyEmbeddedContainer.deploy(JettyEmbeddedContainer.java:295) [arquillian-jetty-embedded-9-1.0.0.CR3.jar:1.0.0.CR3]
	at org.jboss.arquillian.container.impl.client.container.ContainerDeployController$3.call(ContainerDeployController.java:151) [arquillian-container-impl-base-1.7.0.Alpha9.jar:1.7.0.Alpha9]
	at org.jboss.arquillian.container.impl.client.container.ContainerDeployController$3.call(ContainerDeployController.java:118) [arquillian-container-impl-base-1.7.0.Alpha9.jar:1.7.0.Alpha9]
	at org.jboss.arquillian.container.impl.client.container.ContainerDeployController.executeOperation(ContainerDeployController.java:239) [arquillian-container-impl-base-1.7.0.Alpha9.jar:1.7.0.Alpha9]
	at org.jboss.arquillian.container.impl.client.container.ContainerDeployController.deploy(ContainerDeployController.java:118) [arquillian-container-impl-base-1.7.0.Alpha9.jar:1.7.0.Alpha9]
	at jdk.internal.reflect.NativeMethodAccessorImpl.invoke0(Native Method) ~[?:?]
	at jdk.internal.reflect.NativeMethodAccessorImpl.invoke(NativeMethodAccessorImpl.java:62) ~[?:?]
	at jdk.internal.reflect.DelegatingMethodAccessorImpl.invoke(DelegatingMethodAccessorImpl.java:43) ~[?:?]
	at java.lang.reflect.Method.invoke(Method.java:566) ~[?:?]
	at org.jboss.arquillian.core.impl.ObserverImpl.invoke(ObserverImpl.java:86) [arquillian-core-impl-base-1.7.0.Alpha9.jar:1.7.0.Alpha9]
	at org.jboss.arquillian.core.impl.EventContextImpl.invokeObservers(EventContextImpl.java:103) [arquillian-core-impl-base-1.7.0.Alpha9.jar:1.7.0.Alpha9]
	at org.jboss.arquillian.core.impl.EventContextImpl.proceed(EventContextImpl.java:90) [arquillian-core-impl-base-1.7.0.Alpha9.jar:1.7.0.Alpha9]
	at org.jboss.arquillian.container.impl.client.ContainerDeploymentContextHandler.createDeploymentContext(ContainerDeploymentContextHandler.java:71) [arquillian-container-impl-base-1.7.0.Alpha9.jar:1.7.0.Alpha9]
	at jdk.internal.reflect.NativeMethodAccessorImpl.invoke0(Native Method) ~[?:?]
	at jdk.internal.reflect.NativeMethodAccessorImpl.invoke(NativeMethodAccessorImpl.java:62) ~[?:?]
	at jdk.internal.reflect.DelegatingMethodAccessorImpl.invoke(DelegatingMethodAccessorImpl.java:43) ~[?:?]
	at java.lang.reflect.Method.invoke(Method.java:566) ~[?:?]
	at org.jboss.arquillian.core.impl.ObserverImpl.invoke(ObserverImpl.java:86) [arquillian-core-impl-base-1.7.0.Alpha9.jar:1.7.0.Alpha9]
	at org.jboss.arquillian.core.impl.EventContextImpl.proceed(EventContextImpl.java:95) [arquillian-core-impl-base-1.7.0.Alpha9.jar:1.7.0.Alpha9]
	at org.jboss.arquillian.container.impl.client.ContainerDeploymentContextHandler.createContainerContext(ContainerDeploymentContextHandler.java:54) [arquillian-container-impl-base-1.7.0.Alpha9.jar:1.7.0.Alpha9]
	at jdk.internal.reflect.NativeMethodAccessorImpl.invoke0(Native Method) ~[?:?]
	at jdk.internal.reflect.NativeMethodAccessorImpl.invoke(NativeMethodAccessorImpl.java:62) ~[?:?]
	at jdk.internal.reflect.DelegatingMethodAccessorImpl.invoke(DelegatingMethodAccessorImpl.java:43) ~[?:?]
	at java.lang.reflect.Method.invoke(Method.java:566) ~[?:?]
	at org.jboss.arquillian.core.impl.ObserverImpl.invoke(ObserverImpl.java:86) [arquillian-core-impl-base-1.7.0.Alpha9.jar:1.7.0.Alpha9]
	at org.jboss.arquillian.core.impl.EventContextImpl.proceed(EventContextImpl.java:95) [arquillian-core-impl-base-1.7.0.Alpha9.jar:1.7.0.Alpha9]
	at org.jboss.arquillian.container.impl.client.container.DeploymentExceptionHandler.verifyExpectedExceptionDuringDeploy(DeploymentExceptionHandler.java:47) [arquillian-container-impl-base-1.7.0.Alpha9.jar:1.7.0.Alpha9]
	at jdk.internal.reflect.NativeMethodAccessorImpl.invoke0(Native Method) ~[?:?]
	at jdk.internal.reflect.NativeMethodAccessorImpl.invoke(NativeMethodAccessorImpl.java:62) ~[?:?]
	at jdk.internal.reflect.DelegatingMethodAccessorImpl.invoke(DelegatingMethodAccessorImpl.java:43) ~[?:?]
	at java.lang.reflect.Method.invoke(Method.java:566) ~[?:?]
	at org.jboss.arquillian.core.impl.ObserverImpl.invoke(ObserverImpl.java:86) [arquillian-core-impl-base-1.7.0.Alpha9.jar:1.7.0.Alpha9]
	at org.jboss.arquillian.core.impl.EventContextImpl.proceed(EventContextImpl.java:95) [arquillian-core-impl-base-1.7.0.Alpha9.jar:1.7.0.Alpha9]
	at org.jboss.arquillian.core.impl.ManagerImpl.fire(ManagerImpl.java:133) [arquillian-core-impl-base-1.7.0.Alpha9.jar:1.7.0.Alpha9]
	at org.jboss.arquillian.core.impl.ManagerImpl.fire(ManagerImpl.java:105) [arquillian-core-impl-base-1.7.0.Alpha9.jar:1.7.0.Alpha9]
	at org.jboss.arquillian.core.impl.EventImpl.fire(EventImpl.java:62) [arquillian-core-impl-base-1.7.0.Alpha9.jar:1.7.0.Alpha9]
	at org.jboss.arquillian.container.impl.client.container.ContainerDeployController$1.perform(ContainerDeployController.java:92) [arquillian-container-impl-base-1.7.0.Alpha9.jar:1.7.0.Alpha9]
	at org.jboss.arquillian.container.impl.client.container.ContainerDeployController$1.perform(ContainerDeployController.java:77) [arquillian-container-impl-base-1.7.0.Alpha9.jar:1.7.0.Alpha9]
	at org.jboss.arquillian.container.impl.client.container.ContainerDeployController.forEachDeployment(ContainerDeployController.java:232) [arquillian-container-impl-base-1.7.0.Alpha9.jar:1.7.0.Alpha9]
	at org.jboss.arquillian.container.impl.client.container.ContainerDeployController.forEachManagedDeployment(ContainerDeployController.java:212) [arquillian-container-impl-base-1.7.0.Alpha9.jar:1.7.0.Alpha9]
	at org.jboss.arquillian.container.impl.client.container.ContainerDeployController.deployManaged(ContainerDeployController.java:77) [arquillian-container-impl-base-1.7.0.Alpha9.jar:1.7.0.Alpha9]
	at jdk.internal.reflect.NativeMethodAccessorImpl.invoke0(Native Method) ~[?:?]
	at jdk.internal.reflect.NativeMethodAccessorImpl.invoke(NativeMethodAccessorImpl.java:62) ~[?:?]
	at jdk.internal.reflect.DelegatingMethodAccessorImpl.invoke(DelegatingMethodAccessorImpl.java:43) ~[?:?]
	at java.lang.reflect.Method.invoke(Method.java:566) ~[?:?]
	at org.jboss.arquillian.core.impl.ObserverImpl.invoke(ObserverImpl.java:86) [arquillian-core-impl-base-1.7.0.Alpha9.jar:1.7.0.Alpha9]
	at org.jboss.arquillian.core.impl.EventContextImpl.invokeObservers(EventContextImpl.java:103) [arquillian-core-impl-base-1.7.0.Alpha9.jar:1.7.0.Alpha9]
	at org.jboss.arquillian.core.impl.EventContextImpl.proceed(EventContextImpl.java:90) [arquillian-core-impl-base-1.7.0.Alpha9.jar:1.7.0.Alpha9]
	at org.eu.ingwar.tools.arquillian.extension.suite.SuiteDeployer.blockDeployManagedDeploymentsWhenNeeded(SuiteDeployer.java:95) [arquillian-suite-extension-1.2.0.jar:?]
	at jdk.internal.reflect.NativeMethodAccessorImpl.invoke0(Native Method) ~[?:?]
	at jdk.internal.reflect.NativeMethodAccessorImpl.invoke(NativeMethodAccessorImpl.java:62) ~[?:?]
	at jdk.internal.reflect.DelegatingMethodAccessorImpl.invoke(DelegatingMethodAccessorImpl.java:43) ~[?:?]
	at java.lang.reflect.Method.invoke(Method.java:566) ~[?:?]
	at org.jboss.arquillian.core.impl.ObserverImpl.invoke(ObserverImpl.java:86) [arquillian-core-impl-base-1.7.0.Alpha9.jar:1.7.0.Alpha9]
	at org.jboss.arquillian.core.impl.EventContextImpl.proceed(EventContextImpl.java:95) [arquillian-core-impl-base-1.7.0.Alpha9.jar:1.7.0.Alpha9]
	at org.jboss.arquillian.core.impl.ManagerImpl.fire(ManagerImpl.java:133) [arquillian-core-impl-base-1.7.0.Alpha9.jar:1.7.0.Alpha9]
	at org.jboss.arquillian.core.impl.ManagerImpl.fire(ManagerImpl.java:105) [arquillian-core-impl-base-1.7.0.Alpha9.jar:1.7.0.Alpha9]
	at org.jboss.arquillian.core.impl.EventImpl.fire(EventImpl.java:62) [arquillian-core-impl-base-1.7.0.Alpha9.jar:1.7.0.Alpha9]
	at org.jboss.arquillian.container.test.impl.client.ContainerEventController.execute(ContainerEventController.java:96) [arquillian-container-test-impl-base-1.4.0.Final.jar:1.4.0.Final]
	at jdk.internal.reflect.NativeMethodAccessorImpl.invoke0(Native Method) ~[?:?]
	at jdk.internal.reflect.NativeMethodAccessorImpl.invoke(NativeMethodAccessorImpl.java:62) ~[?:?]
	at jdk.internal.reflect.DelegatingMethodAccessorImpl.invoke(DelegatingMethodAccessorImpl.java:43) ~[?:?]
	at java.lang.reflect.Method.invoke(Method.java:566) ~[?:?]
	at org.jboss.arquillian.core.impl.ObserverImpl.invoke(ObserverImpl.java:86) [arquillian-core-impl-base-1.7.0.Alpha9.jar:1.7.0.Alpha9]
	at org.jboss.arquillian.core.impl.EventContextImpl.invokeObservers(EventContextImpl.java:103) [arquillian-core-impl-base-1.7.0.Alpha9.jar:1.7.0.Alpha9]
	at org.jboss.arquillian.core.impl.EventContextImpl.proceed(EventContextImpl.java:90) [arquillian-core-impl-base-1.7.0.Alpha9.jar:1.7.0.Alpha9]
	at org.jboss.arquillian.test.impl.TestContextHandler.createClassContext(TestContextHandler.java:83) [arquillian-test-impl-base-1.7.0.Alpha9.jar:1.7.0.Alpha9]
	at jdk.internal.reflect.NativeMethodAccessorImpl.invoke0(Native Method) ~[?:?]
	at jdk.internal.reflect.NativeMethodAccessorImpl.invoke(NativeMethodAccessorImpl.java:62) ~[?:?]
	at jdk.internal.reflect.DelegatingMethodAccessorImpl.invoke(DelegatingMethodAccessorImpl.java:43) ~[?:?]
	at java.lang.reflect.Method.invoke(Method.java:566) ~[?:?]
	at org.jboss.arquillian.core.impl.ObserverImpl.invoke(ObserverImpl.java:86) [arquillian-core-impl-base-1.7.0.Alpha9.jar:1.7.0.Alpha9]
	at org.jboss.arquillian.core.impl.EventContextImpl.proceed(EventContextImpl.java:95) [arquillian-core-impl-base-1.7.0.Alpha9.jar:1.7.0.Alpha9]
	at org.jboss.arquillian.test.impl.TestContextHandler.createSuiteContext(TestContextHandler.java:69) [arquillian-test-impl-base-1.7.0.Alpha9.jar:1.7.0.Alpha9]
	at jdk.internal.reflect.NativeMethodAccessorImpl.invoke0(Native Method) ~[?:?]
	at jdk.internal.reflect.NativeMethodAccessorImpl.invoke(NativeMethodAccessorImpl.java:62) ~[?:?]
	at jdk.internal.reflect.DelegatingMethodAccessorImpl.invoke(DelegatingMethodAccessorImpl.java:43) ~[?:?]
	at java.lang.reflect.Method.invoke(Method.java:566) ~[?:?]
	at org.jboss.arquillian.core.impl.ObserverImpl.invoke(ObserverImpl.java:86) [arquillian-core-impl-base-1.7.0.Alpha9.jar:1.7.0.Alpha9]
	at org.jboss.arquillian.core.impl.EventContextImpl.proceed(EventContextImpl.java:95) [arquillian-core-impl-base-1.7.0.Alpha9.jar:1.7.0.Alpha9]
	at org.jboss.arquillian.core.impl.ManagerImpl.fire(ManagerImpl.java:133) [arquillian-core-impl-base-1.7.0.Alpha9.jar:1.7.0.Alpha9]
	at org.jboss.arquillian.core.impl.ManagerImpl.fire(ManagerImpl.java:105) [arquillian-core-impl-base-1.7.0.Alpha9.jar:1.7.0.Alpha9]
	at org.jboss.arquillian.test.impl.EventTestRunnerAdaptor.beforeClass(EventTestRunnerAdaptor.java:89) [arquillian-test-impl-base-1.7.0.Alpha9.jar:1.7.0.Alpha9]
	at org.jboss.arquillian.testng.Arquillian.arquillianBeforeClass(Arquillian.java:99) [arquillian-testng-core-1.7.0.Alpha9.jar:1.7.0.Alpha9]
	at jdk.internal.reflect.NativeMethodAccessorImpl.invoke0(Native Method) ~[?:?]
	at jdk.internal.reflect.NativeMethodAccessorImpl.invoke(NativeMethodAccessorImpl.java:62) ~[?:?]
	at jdk.internal.reflect.DelegatingMethodAccessorImpl.invoke(DelegatingMethodAccessorImpl.java:43) ~[?:?]
	at java.lang.reflect.Method.invoke(Method.java:566) ~[?:?]
	at org.testng.internal.MethodInvocationHelper.invokeMethod(MethodInvocationHelper.java:124) [testng-6.14.3.jar:?]
	at org.testng.internal.MethodInvocationHelper.invokeMethodConsideringTimeout(MethodInvocationHelper.java:59) [testng-6.14.3.jar:?]
	at org.testng.internal.Invoker.invokeConfigurationMethod(Invoker.java:458) [testng-6.14.3.jar:?]
	at org.testng.internal.Invoker.invokeConfigurations(Invoker.java:222) [testng-6.14.3.jar:?]
	at org.testng.internal.Invoker.invokeConfigurations(Invoker.java:142) [testng-6.14.3.jar:?]
	at org.testng.internal.TestMethodWorker.invokeBeforeClassMethods(TestMethodWorker.java:168) [testng-6.14.3.jar:?]
	at org.testng.internal.TestMethodWorker.run(TestMethodWorker.java:105) [testng-6.14.3.jar:?]
	at org.testng.TestRunner.privateRun(TestRunner.java:648) [testng-6.14.3.jar:?]
	at org.testng.TestRunner.run(TestRunner.java:505) [testng-6.14.3.jar:?]
	at org.testng.SuiteRunner.runTest(SuiteRunner.java:455) [testng-6.14.3.jar:?]
	at org.testng.SuiteRunner.runSequentially(SuiteRunner.java:450) [testng-6.14.3.jar:?]
	at org.testng.SuiteRunner.privateRun(SuiteRunner.java:415) [testng-6.14.3.jar:?]
	at org.testng.SuiteRunner.run(SuiteRunner.java:364) [testng-6.14.3.jar:?]
	at org.testng.SuiteRunnerWorker.runSuite(SuiteRunnerWorker.java:52) [testng-6.14.3.jar:?]
	at org.testng.SuiteRunnerWorker.run(SuiteRunnerWorker.java:84) [testng-6.14.3.jar:?]
	at org.testng.TestNG.runSuitesSequentially(TestNG.java:1208) [testng-6.14.3.jar:?]
	at org.testng.TestNG.runSuitesLocally(TestNG.java:1137) [testng-6.14.3.jar:?]
	at org.testng.TestNG.runSuites(TestNG.java:1049) [testng-6.14.3.jar:?]
	at org.testng.TestNG.run(TestNG.java:1017) [testng-6.14.3.jar:?]
	at org.apache.maven.surefire.testng.TestNGExecutor.run(TestNGExecutor.java:281) [surefire-testng-2.19.1.jar:2.19.1]
	at org.apache.maven.surefire.testng.TestNGXmlTestSuite.execute(TestNGXmlTestSuite.java:75) [surefire-testng-2.19.1.jar:2.19.1]
	at org.apache.maven.surefire.testng.TestNGProvider.invoke(TestNGProvider.java:121) [surefire-testng-2.19.1.jar:2.19.1]
	at org.apache.maven.surefire.booter.ForkedBooter.invokeProviderInSameClassLoader(ForkedBooter.java:290) [surefire-booter-2.19.1.jar:2.19.1]
	at org.apache.maven.surefire.booter.ForkedBooter.runSuitesInProcess(ForkedBooter.java:242) [surefire-booter-2.19.1.jar:2.19.1]
	at org.apache.maven.surefire.booter.ForkedBooter.main(ForkedBooter.java:121) [surefire-booter-2.19.1.jar:2.19.1]
Caused by: org.gluu.persist.exception.operation.ConnectionException: Failed to lookup entry
	at org.gluu.persist.ldap.operation.impl.LdapOperationServiceImpl.lookupImpl(LdapOperationServiceImpl.java:626) ~[gluu-orm-ldap-4.3.1-SNAPSHOT.jar:?]
	at org.gluu.persist.ldap.operation.impl.LdapOperationServiceImpl.lookup(LdapOperationServiceImpl.java:605) ~[gluu-orm-ldap-4.3.1-SNAPSHOT.jar:?]
	at org.gluu.persist.ldap.impl.LdapEntryManager.find(LdapEntryManager.java:399) ~[gluu-orm-ldap-4.3.1-SNAPSHOT.jar:?]
	... 165 more
Caused by: com.unboundid.ldap.sdk.LDAPSearchException: com.sleepycat.je.LogWriteException: (JE 5.0.104) Environment must be closed, caused by: com.sleepycat.je.LogWriteException: Environment invalid because of previous exception: (JE 5.0.104) /opt/opendj/db/userRoot java.io.IOException: No space left on device LOG_WRITE: IOException on write, log is likely incomplete. Environment is invalid and must be closed.
	at com.unboundid.ldap.sdk.LDAPConnection.search(LDAPConnection.java:3966) ~[unboundid-ldapsdk-6.0.0.jar:6.0.0]
	at com.unboundid.ldap.sdk.LDAPConnection.getEntry(LDAPConnection.java:1882) ~[unboundid-ldapsdk-6.0.0.jar:6.0.0]
	at com.unboundid.ldap.sdk.AbstractConnectionPool.getEntry(AbstractConnectionPool.java:646) ~[unboundid-ldapsdk-6.0.0.jar:6.0.0]
	at org.gluu.persist.ldap.operation.impl.LdapOperationServiceImpl.lookupImpl(LdapOperationServiceImpl.java:619) ~[gluu-orm-ldap-4.3.1-SNAPSHOT.jar:?]
	at org.gluu.persist.ldap.operation.impl.LdapOperationServiceImpl.lookup(LdapOperationServiceImpl.java:605) ~[gluu-orm-ldap-4.3.1-SNAPSHOT.jar:?]
	at org.gluu.persist.ldap.impl.LdapEntryManager.find(LdapEntryManager.java:399) ~[gluu-orm-ldap-4.3.1-SNAPSHOT.jar:?]
	... 165 more
2021-10-26 17:39:50,307 ERROR [main] [org.gluu.service.config.ConfigurationFactory] (ConfigurationFactory.java:147) - Failed to load configuration from LDAP. Please fix it!!!.
2021-10-26 17:39:50,311 WARN  [main] [org.eclipse.jetty.util.log.JavaUtilLog] (JavaUtilLog.java:169) - 
org.gluu.exception.ConfigurationException: Failed to load configuration from LDAP.
	at org.gluu.service.config.ConfigurationFactory.create(ConfigurationFactory.java:148) ~[oxtrust-service-4.3.1-SNAPSHOT.jar:?]
	at org.gluu.oxtrust.service.config.ConfigurationFactory$Proxy$_$$_WeldSubclass.create(Unknown Source) ~[classes/:?]
	at org.gluu.oxtrust.service.config.ConfigurationFactory$Proxy$_$$_WeldClientProxy.create(Unknown Source) ~[classes/:?]
	at org.gluu.oxtrust.service.AppInitializer.applicationInitialized(AppInitializer.java:187) ~[classes/:?]
	at jdk.internal.reflect.NativeMethodAccessorImpl.invoke0(Native Method) ~[?:?]
	at jdk.internal.reflect.NativeMethodAccessorImpl.invoke(NativeMethodAccessorImpl.java:62) ~[?:?]
	at jdk.internal.reflect.DelegatingMethodAccessorImpl.invoke(DelegatingMethodAccessorImpl.java:43) ~[?:?]
	at java.lang.reflect.Method.invoke(Method.java:566) ~[?:?]
	at org.jboss.weld.injection.StaticMethodInjectionPoint.invoke(StaticMethodInjectionPoint.java:95) ~[weld-core-impl-3.1.8.Final.jar:3.1.8.Final]
	at org.jboss.weld.injection.StaticMethodInjectionPoint.invoke(StaticMethodInjectionPoint.java:85) ~[weld-core-impl-3.1.8.Final.jar:3.1.8.Final]
	at org.jboss.weld.injection.MethodInvocationStrategy$SimpleMethodInvocationStrategy.invoke(MethodInvocationStrategy.java:168) ~[weld-core-impl-3.1.8.Final.jar:3.1.8.Final]
	at org.jboss.weld.event.ObserverMethodImpl.sendEvent(ObserverMethodImpl.java:330) ~[weld-core-impl-3.1.8.Final.jar:3.1.8.Final]
	at org.jboss.weld.event.ObserverMethodImpl.sendEvent(ObserverMethodImpl.java:308) ~[weld-core-impl-3.1.8.Final.jar:3.1.8.Final]
	at org.jboss.weld.event.ObserverMethodImpl.notify(ObserverMethodImpl.java:286) ~[weld-core-impl-3.1.8.Final.jar:3.1.8.Final]
	at javax.enterprise.inject.spi.ObserverMethod.notify(ObserverMethod.java:124) ~[cdi-api-2.0.SP1.jar:${parsedVersion.osgiVersion}]
	at org.jboss.weld.util.Observers.notify(Observers.java:166) ~[weld-core-impl-3.1.8.Final.jar:3.1.8.Final]
	at org.jboss.weld.event.ObserverNotifier.notifySyncObservers(ObserverNotifier.java:285) ~[weld-core-impl-3.1.8.Final.jar:3.1.8.Final]
	at org.jboss.weld.event.ObserverNotifier.notify(ObserverNotifier.java:273) ~[weld-core-impl-3.1.8.Final.jar:3.1.8.Final]
	at org.jboss.weld.event.ObserverNotifier.fireEvent(ObserverNotifier.java:177) ~[weld-core-impl-3.1.8.Final.jar:3.1.8.Final]
	at org.jboss.weld.bootstrap.BeanDeploymentModule.fireEvent(BeanDeploymentModule.java:93) ~[weld-core-impl-3.1.8.Final.jar:3.1.8.Final]
	at org.jboss.weld.module.web.servlet.HttpContextLifecycle.fireEventForApplicationScope(HttpContextLifecycle.java:161) ~[weld-web-3.1.8.Final.jar:3.1.8.Final]
	at org.jboss.weld.module.web.servlet.HttpContextLifecycle.contextInitialized(HttpContextLifecycle.java:147) ~[weld-web-3.1.8.Final.jar:3.1.8.Final]
	at org.jboss.weld.module.web.servlet.WeldInitialListener.contextInitialized(WeldInitialListener.java:99) ~[weld-web-3.1.8.Final.jar:3.1.8.Final]
	at org.jboss.weld.servlet.api.helpers.ForwardingServletListener.contextInitialized(ForwardingServletListener.java:34) ~[weld-spi-3.1.SP4.jar:3.1.0.SP4]
	at org.jboss.weld.environment.servlet.EnhancedListener.onStartup(EnhancedListener.java:66) ~[weld-servlet-core-3.1.8.Final.jar:3.1.8.Final]
	at org.eclipse.jetty.plus.annotation.ContainerInitializer.callStartup(ContainerInitializer.java:140) ~[jetty-plus-9.4.9.v20180320.jar:9.4.9.v20180320]
	at org.eclipse.jetty.annotations.ServletContainerInitializersStarter.doStart(ServletContainerInitializersStarter.java:64) [jetty-annotations-9.4.9.v20180320.jar:9.4.9.v20180320]
	at org.eclipse.jetty.util.component.AbstractLifeCycle.start(AbstractLifeCycle.java:68) [jetty-util-9.4.9.v20180320.jar:9.4.9.v20180320]
	at org.eclipse.jetty.servlet.ServletContextHandler.startContext(ServletContextHandler.java:355) [jetty-servlet-9.4.9.v20180320.jar:9.4.9.v20180320]
	at org.eclipse.jetty.webapp.WebAppContext.startWebapp(WebAppContext.java:1497) [jetty-webapp-9.4.9.v20180320.jar:9.4.9.v20180320]
	at org.eclipse.jetty.webapp.WebAppContext.startContext(WebAppContext.java:1459) [jetty-webapp-9.4.9.v20180320.jar:9.4.9.v20180320]
	at org.eclipse.jetty.server.handler.ContextHandler.doStart(ContextHandler.java:785) [jetty-server-9.4.9.v20180320.jar:9.4.9.v20180320]
	at org.eclipse.jetty.servlet.ServletContextHandler.doStart(ServletContextHandler.java:287) [jetty-servlet-9.4.9.v20180320.jar:9.4.9.v20180320]
	at org.eclipse.jetty.webapp.WebAppContext.doStart(WebAppContext.java:545) [jetty-webapp-9.4.9.v20180320.jar:9.4.9.v20180320]
	at org.eclipse.jetty.util.component.AbstractLifeCycle.start(AbstractLifeCycle.java:68) [jetty-util-9.4.9.v20180320.jar:9.4.9.v20180320]
	at org.eclipse.jetty.deploy.bindings.StandardStarter.processBinding(StandardStarter.java:46) [jetty-deploy-9.4.9.v20180320.jar:9.4.9.v20180320]
	at org.eclipse.jetty.deploy.AppLifeCycle.runBindings(AppLifeCycle.java:192) [jetty-deploy-9.4.9.v20180320.jar:9.4.9.v20180320]
	at org.eclipse.jetty.deploy.DeploymentManager.requestAppGoal(DeploymentManager.java:505) [jetty-deploy-9.4.9.v20180320.jar:9.4.9.v20180320]
	at org.eclipse.jetty.deploy.DeploymentManager.addApp(DeploymentManager.java:151) [jetty-deploy-9.4.9.v20180320.jar:9.4.9.v20180320]
	at org.jboss.arquillian.container.jetty.embedded_9.JettyEmbeddedContainer.deploy(JettyEmbeddedContainer.java:295) [arquillian-jetty-embedded-9-1.0.0.CR3.jar:1.0.0.CR3]
	at org.jboss.arquillian.container.impl.client.container.ContainerDeployController$3.call(ContainerDeployController.java:151) [arquillian-container-impl-base-1.7.0.Alpha9.jar:1.7.0.Alpha9]
	at org.jboss.arquillian.container.impl.client.container.ContainerDeployController$3.call(ContainerDeployController.java:118) [arquillian-container-impl-base-1.7.0.Alpha9.jar:1.7.0.Alpha9]
	at org.jboss.arquillian.container.impl.client.container.ContainerDeployController.executeOperation(ContainerDeployController.java:239) [arquillian-container-impl-base-1.7.0.Alpha9.jar:1.7.0.Alpha9]
	at org.jboss.arquillian.container.impl.client.container.ContainerDeployController.deploy(ContainerDeployController.java:118) [arquillian-container-impl-base-1.7.0.Alpha9.jar:1.7.0.Alpha9]
	at jdk.internal.reflect.NativeMethodAccessorImpl.invoke0(Native Method) ~[?:?]
	at jdk.internal.reflect.NativeMethodAccessorImpl.invoke(NativeMethodAccessorImpl.java:62) ~[?:?]
	at jdk.internal.reflect.DelegatingMethodAccessorImpl.invoke(DelegatingMethodAccessorImpl.java:43) ~[?:?]
	at java.lang.reflect.Method.invoke(Method.java:566) ~[?:?]
	at org.jboss.arquillian.core.impl.ObserverImpl.invoke(ObserverImpl.java:86) [arquillian-core-impl-base-1.7.0.Alpha9.jar:1.7.0.Alpha9]
	at org.jboss.arquillian.core.impl.EventContextImpl.invokeObservers(EventContextImpl.java:103) [arquillian-core-impl-base-1.7.0.Alpha9.jar:1.7.0.Alpha9]
	at org.jboss.arquillian.core.impl.EventContextImpl.proceed(EventContextImpl.java:90) [arquillian-core-impl-base-1.7.0.Alpha9.jar:1.7.0.Alpha9]
	at org.jboss.arquillian.container.impl.client.ContainerDeploymentContextHandler.createDeploymentContext(ContainerDeploymentContextHandler.java:71) [arquillian-container-impl-base-1.7.0.Alpha9.jar:1.7.0.Alpha9]
	at jdk.internal.reflect.NativeMethodAccessorImpl.invoke0(Native Method) ~[?:?]
	at jdk.internal.reflect.NativeMethodAccessorImpl.invoke(NativeMethodAccessorImpl.java:62) ~[?:?]
	at jdk.internal.reflect.DelegatingMethodAccessorImpl.invoke(DelegatingMethodAccessorImpl.java:43) ~[?:?]
	at java.lang.reflect.Method.invoke(Method.java:566) ~[?:?]
	at org.jboss.arquillian.core.impl.ObserverImpl.invoke(ObserverImpl.java:86) [arquillian-core-impl-base-1.7.0.Alpha9.jar:1.7.0.Alpha9]
	at org.jboss.arquillian.core.impl.EventContextImpl.proceed(EventContextImpl.java:95) [arquillian-core-impl-base-1.7.0.Alpha9.jar:1.7.0.Alpha9]
	at org.jboss.arquillian.container.impl.client.ContainerDeploymentContextHandler.createContainerContext(ContainerDeploymentContextHandler.java:54) [arquillian-container-impl-base-1.7.0.Alpha9.jar:1.7.0.Alpha9]
	at jdk.internal.reflect.NativeMethodAccessorImpl.invoke0(Native Method) ~[?:?]
	at jdk.internal.reflect.NativeMethodAccessorImpl.invoke(NativeMethodAccessorImpl.java:62) ~[?:?]
	at jdk.internal.reflect.DelegatingMethodAccessorImpl.invoke(DelegatingMethodAccessorImpl.java:43) ~[?:?]
	at java.lang.reflect.Method.invoke(Method.java:566) ~[?:?]
	at org.jboss.arquillian.core.impl.ObserverImpl.invoke(ObserverImpl.java:86) [arquillian-core-impl-base-1.7.0.Alpha9.jar:1.7.0.Alpha9]
	at org.jboss.arquillian.core.impl.EventContextImpl.proceed(EventContextImpl.java:95) [arquillian-core-impl-base-1.7.0.Alpha9.jar:1.7.0.Alpha9]
	at org.jboss.arquillian.container.impl.client.container.DeploymentExceptionHandler.verifyExpectedExceptionDuringDeploy(DeploymentExceptionHandler.java:47) [arquillian-container-impl-base-1.7.0.Alpha9.jar:1.7.0.Alpha9]
	at jdk.internal.reflect.NativeMethodAccessorImpl.invoke0(Native Method) ~[?:?]
	at jdk.internal.reflect.NativeMethodAccessorImpl.invoke(NativeMethodAccessorImpl.java:62) ~[?:?]
	at jdk.internal.reflect.DelegatingMethodAccessorImpl.invoke(DelegatingMethodAccessorImpl.java:43) ~[?:?]
	at java.lang.reflect.Method.invoke(Method.java:566) ~[?:?]
	at org.jboss.arquillian.core.impl.ObserverImpl.invoke(ObserverImpl.java:86) [arquillian-core-impl-base-1.7.0.Alpha9.jar:1.7.0.Alpha9]
	at org.jboss.arquillian.core.impl.EventContextImpl.proceed(EventContextImpl.java:95) [arquillian-core-impl-base-1.7.0.Alpha9.jar:1.7.0.Alpha9]
	at org.jboss.arquillian.core.impl.ManagerImpl.fire(ManagerImpl.java:133) [arquillian-core-impl-base-1.7.0.Alpha9.jar:1.7.0.Alpha9]
	at org.jboss.arquillian.core.impl.ManagerImpl.fire(ManagerImpl.java:105) [arquillian-core-impl-base-1.7.0.Alpha9.jar:1.7.0.Alpha9]
	at org.jboss.arquillian.core.impl.EventImpl.fire(EventImpl.java:62) [arquillian-core-impl-base-1.7.0.Alpha9.jar:1.7.0.Alpha9]
	at org.jboss.arquillian.container.impl.client.container.ContainerDeployController$1.perform(ContainerDeployController.java:92) [arquillian-container-impl-base-1.7.0.Alpha9.jar:1.7.0.Alpha9]
	at org.jboss.arquillian.container.impl.client.container.ContainerDeployController$1.perform(ContainerDeployController.java:77) [arquillian-container-impl-base-1.7.0.Alpha9.jar:1.7.0.Alpha9]
	at org.jboss.arquillian.container.impl.client.container.ContainerDeployController.forEachDeployment(ContainerDeployController.java:232) [arquillian-container-impl-base-1.7.0.Alpha9.jar:1.7.0.Alpha9]
	at org.jboss.arquillian.container.impl.client.container.ContainerDeployController.forEachManagedDeployment(ContainerDeployController.java:212) [arquillian-container-impl-base-1.7.0.Alpha9.jar:1.7.0.Alpha9]
	at org.jboss.arquillian.container.impl.client.container.ContainerDeployController.deployManaged(ContainerDeployController.java:77) [arquillian-container-impl-base-1.7.0.Alpha9.jar:1.7.0.Alpha9]
	at jdk.internal.reflect.NativeMethodAccessorImpl.invoke0(Native Method) ~[?:?]
	at jdk.internal.reflect.NativeMethodAccessorImpl.invoke(NativeMethodAccessorImpl.java:62) ~[?:?]
	at jdk.internal.reflect.DelegatingMethodAccessorImpl.invoke(DelegatingMethodAccessorImpl.java:43) ~[?:?]
	at java.lang.reflect.Method.invoke(Method.java:566) ~[?:?]
	at org.jboss.arquillian.core.impl.ObserverImpl.invoke(ObserverImpl.java:86) [arquillian-core-impl-base-1.7.0.Alpha9.jar:1.7.0.Alpha9]
	at org.jboss.arquillian.core.impl.EventContextImpl.invokeObservers(EventContextImpl.java:103) [arquillian-core-impl-base-1.7.0.Alpha9.jar:1.7.0.Alpha9]
	at org.jboss.arquillian.core.impl.EventContextImpl.proceed(EventContextImpl.java:90) [arquillian-core-impl-base-1.7.0.Alpha9.jar:1.7.0.Alpha9]
	at org.eu.ingwar.tools.arquillian.extension.suite.SuiteDeployer.blockDeployManagedDeploymentsWhenNeeded(SuiteDeployer.java:95) [arquillian-suite-extension-1.2.0.jar:?]
	at jdk.internal.reflect.NativeMethodAccessorImpl.invoke0(Native Method) ~[?:?]
	at jdk.internal.reflect.NativeMethodAccessorImpl.invoke(NativeMethodAccessorImpl.java:62) ~[?:?]
	at jdk.internal.reflect.DelegatingMethodAccessorImpl.invoke(DelegatingMethodAccessorImpl.java:43) ~[?:?]
	at java.lang.reflect.Method.invoke(Method.java:566) ~[?:?]
	at org.jboss.arquillian.core.impl.ObserverImpl.invoke(ObserverImpl.java:86) [arquillian-core-impl-base-1.7.0.Alpha9.jar:1.7.0.Alpha9]
	at org.jboss.arquillian.core.impl.EventContextImpl.proceed(EventContextImpl.java:95) [arquillian-core-impl-base-1.7.0.Alpha9.jar:1.7.0.Alpha9]
	at org.jboss.arquillian.core.impl.ManagerImpl.fire(ManagerImpl.java:133) [arquillian-core-impl-base-1.7.0.Alpha9.jar:1.7.0.Alpha9]
	at org.jboss.arquillian.core.impl.ManagerImpl.fire(ManagerImpl.java:105) [arquillian-core-impl-base-1.7.0.Alpha9.jar:1.7.0.Alpha9]
	at org.jboss.arquillian.core.impl.EventImpl.fire(EventImpl.java:62) [arquillian-core-impl-base-1.7.0.Alpha9.jar:1.7.0.Alpha9]
	at org.jboss.arquillian.container.test.impl.client.ContainerEventController.execute(ContainerEventController.java:96) [arquillian-container-test-impl-base-1.4.0.Final.jar:1.4.0.Final]
	at jdk.internal.reflect.NativeMethodAccessorImpl.invoke0(Native Method) ~[?:?]
	at jdk.internal.reflect.NativeMethodAccessorImpl.invoke(NativeMethodAccessorImpl.java:62) ~[?:?]
	at jdk.internal.reflect.DelegatingMethodAccessorImpl.invoke(DelegatingMethodAccessorImpl.java:43) ~[?:?]
	at java.lang.reflect.Method.invoke(Method.java:566) ~[?:?]
	at org.jboss.arquillian.core.impl.ObserverImpl.invoke(ObserverImpl.java:86) [arquillian-core-impl-base-1.7.0.Alpha9.jar:1.7.0.Alpha9]
	at org.jboss.arquillian.core.impl.EventContextImpl.invokeObservers(EventContextImpl.java:103) [arquillian-core-impl-base-1.7.0.Alpha9.jar:1.7.0.Alpha9]
	at org.jboss.arquillian.core.impl.EventContextImpl.proceed(EventContextImpl.java:90) [arquillian-core-impl-base-1.7.0.Alpha9.jar:1.7.0.Alpha9]
	at org.jboss.arquillian.test.impl.TestContextHandler.createClassContext(TestContextHandler.java:83) [arquillian-test-impl-base-1.7.0.Alpha9.jar:1.7.0.Alpha9]
	at jdk.internal.reflect.NativeMethodAccessorImpl.invoke0(Native Method) ~[?:?]
	at jdk.internal.reflect.NativeMethodAccessorImpl.invoke(NativeMethodAccessorImpl.java:62) ~[?:?]
	at jdk.internal.reflect.DelegatingMethodAccessorImpl.invoke(DelegatingMethodAccessorImpl.java:43) ~[?:?]
	at java.lang.reflect.Method.invoke(Method.java:566) ~[?:?]
	at org.jboss.arquillian.core.impl.ObserverImpl.invoke(ObserverImpl.java:86) [arquillian-core-impl-base-1.7.0.Alpha9.jar:1.7.0.Alpha9]
	at org.jboss.arquillian.core.impl.EventContextImpl.proceed(EventContextImpl.java:95) [arquillian-core-impl-base-1.7.0.Alpha9.jar:1.7.0.Alpha9]
	at org.jboss.arquillian.test.impl.TestContextHandler.createSuiteContext(TestContextHandler.java:69) [arquillian-test-impl-base-1.7.0.Alpha9.jar:1.7.0.Alpha9]
	at jdk.internal.reflect.NativeMethodAccessorImpl.invoke0(Native Method) ~[?:?]
	at jdk.internal.reflect.NativeMethodAccessorImpl.invoke(NativeMethodAccessorImpl.java:62) ~[?:?]
	at jdk.internal.reflect.DelegatingMethodAccessorImpl.invoke(DelegatingMethodAccessorImpl.java:43) ~[?:?]
	at java.lang.reflect.Method.invoke(Method.java:566) ~[?:?]
	at org.jboss.arquillian.core.impl.ObserverImpl.invoke(ObserverImpl.java:86) [arquillian-core-impl-base-1.7.0.Alpha9.jar:1.7.0.Alpha9]
	at org.jboss.arquillian.core.impl.EventContextImpl.proceed(EventContextImpl.java:95) [arquillian-core-impl-base-1.7.0.Alpha9.jar:1.7.0.Alpha9]
	at org.jboss.arquillian.core.impl.ManagerImpl.fire(ManagerImpl.java:133) [arquillian-core-impl-base-1.7.0.Alpha9.jar:1.7.0.Alpha9]
	at org.jboss.arquillian.core.impl.ManagerImpl.fire(ManagerImpl.java:105) [arquillian-core-impl-base-1.7.0.Alpha9.jar:1.7.0.Alpha9]
	at org.jboss.arquillian.test.impl.EventTestRunnerAdaptor.beforeClass(EventTestRunnerAdaptor.java:89) [arquillian-test-impl-base-1.7.0.Alpha9.jar:1.7.0.Alpha9]
	at org.jboss.arquillian.testng.Arquillian.arquillianBeforeClass(Arquillian.java:99) [arquillian-testng-core-1.7.0.Alpha9.jar:1.7.0.Alpha9]
	at jdk.internal.reflect.NativeMethodAccessorImpl.invoke0(Native Method) ~[?:?]
	at jdk.internal.reflect.NativeMethodAccessorImpl.invoke(NativeMethodAccessorImpl.java:62) ~[?:?]
	at jdk.internal.reflect.DelegatingMethodAccessorImpl.invoke(DelegatingMethodAccessorImpl.java:43) ~[?:?]
	at java.lang.reflect.Method.invoke(Method.java:566) ~[?:?]
	at org.testng.internal.MethodInvocationHelper.invokeMethod(MethodInvocationHelper.java:124) [testng-6.14.3.jar:?]
	at org.testng.internal.MethodInvocationHelper.invokeMethodConsideringTimeout(MethodInvocationHelper.java:59) [testng-6.14.3.jar:?]
	at org.testng.internal.Invoker.invokeConfigurationMethod(Invoker.java:458) [testng-6.14.3.jar:?]
	at org.testng.internal.Invoker.invokeConfigurations(Invoker.java:222) [testng-6.14.3.jar:?]
	at org.testng.internal.Invoker.invokeConfigurations(Invoker.java:142) [testng-6.14.3.jar:?]
	at org.testng.internal.TestMethodWorker.invokeBeforeClassMethods(TestMethodWorker.java:168) [testng-6.14.3.jar:?]
	at org.testng.internal.TestMethodWorker.run(TestMethodWorker.java:105) [testng-6.14.3.jar:?]
	at org.testng.TestRunner.privateRun(TestRunner.java:648) [testng-6.14.3.jar:?]
	at org.testng.TestRunner.run(TestRunner.java:505) [testng-6.14.3.jar:?]
	at org.testng.SuiteRunner.runTest(SuiteRunner.java:455) [testng-6.14.3.jar:?]
	at org.testng.SuiteRunner.runSequentially(SuiteRunner.java:450) [testng-6.14.3.jar:?]
	at org.testng.SuiteRunner.privateRun(SuiteRunner.java:415) [testng-6.14.3.jar:?]
	at org.testng.SuiteRunner.run(SuiteRunner.java:364) [testng-6.14.3.jar:?]
	at org.testng.SuiteRunnerWorker.runSuite(SuiteRunnerWorker.java:52) [testng-6.14.3.jar:?]
	at org.testng.SuiteRunnerWorker.run(SuiteRunnerWorker.java:84) [testng-6.14.3.jar:?]
	at org.testng.TestNG.runSuitesSequentially(TestNG.java:1208) [testng-6.14.3.jar:?]
	at org.testng.TestNG.runSuitesLocally(TestNG.java:1137) [testng-6.14.3.jar:?]
	at org.testng.TestNG.runSuites(TestNG.java:1049) [testng-6.14.3.jar:?]
	at org.testng.TestNG.run(TestNG.java:1017) [testng-6.14.3.jar:?]
	at org.apache.maven.surefire.testng.TestNGExecutor.run(TestNGExecutor.java:281) [surefire-testng-2.19.1.jar:2.19.1]
	at org.apache.maven.surefire.testng.TestNGXmlTestSuite.execute(TestNGXmlTestSuite.java:75) [surefire-testng-2.19.1.jar:2.19.1]
	at org.apache.maven.surefire.testng.TestNGProvider.invoke(TestNGProvider.java:121) [surefire-testng-2.19.1.jar:2.19.1]
	at org.apache.maven.surefire.booter.ForkedBooter.invokeProviderInSameClassLoader(ForkedBooter.java:290) [surefire-booter-2.19.1.jar:2.19.1]
	at org.apache.maven.surefire.booter.ForkedBooter.runSuitesInProcess(ForkedBooter.java:242) [surefire-booter-2.19.1.jar:2.19.1]
	at org.apache.maven.surefire.booter.ForkedBooter.main(ForkedBooter.java:121) [surefire-booter-2.19.1.jar:2.19.1]
2021-10-26 17:39:50,327 WARN  [main] [org.eclipse.jetty.util.log.JavaUtilLog] (JavaUtilLog.java:169) - Failed startup of context o.e.j.w.WebAppContext@6febec41{/export4039690275338673376oxtrust,file:///tmp/jetty-localhost-9980-export4039690275338673376oxtrust.war-_export4039690275338673376oxtrust-any-16238942291235476664.dir/webapp/,UNAVAILABLE}{/home/jenkins/.jenkins/jobs/oxTrust/workspace/server/target/arquillian-jetty-temp/export4039690275338673376oxtrust.war}
java.lang.RuntimeException: org.gluu.exception.ConfigurationException: Failed to load configuration from LDAP.
	at org.eclipse.jetty.annotations.ServletContainerInitializersStarter.doStart(ServletContainerInitializersStarter.java:69) ~[jetty-annotations-9.4.9.v20180320.jar:9.4.9.v20180320]
	at org.eclipse.jetty.util.component.AbstractLifeCycle.start(AbstractLifeCycle.java:68) ~[jetty-util-9.4.9.v20180320.jar:9.4.9.v20180320]
	at org.eclipse.jetty.servlet.ServletContextHandler.startContext(ServletContextHandler.java:355) ~[jetty-servlet-9.4.9.v20180320.jar:9.4.9.v20180320]
	at org.eclipse.jetty.webapp.WebAppContext.startWebapp(WebAppContext.java:1497) ~[jetty-webapp-9.4.9.v20180320.jar:9.4.9.v20180320]
	at org.eclipse.jetty.webapp.WebAppContext.startContext(WebAppContext.java:1459) ~[jetty-webapp-9.4.9.v20180320.jar:9.4.9.v20180320]
	at org.eclipse.jetty.server.handler.ContextHandler.doStart(ContextHandler.java:785) ~[jetty-server-9.4.9.v20180320.jar:9.4.9.v20180320]
	at org.eclipse.jetty.servlet.ServletContextHandler.doStart(ServletContextHandler.java:287) ~[jetty-servlet-9.4.9.v20180320.jar:9.4.9.v20180320]
	at org.eclipse.jetty.webapp.WebAppContext.doStart(WebAppContext.java:545) [jetty-webapp-9.4.9.v20180320.jar:9.4.9.v20180320]
	at org.eclipse.jetty.util.component.AbstractLifeCycle.start(AbstractLifeCycle.java:68) [jetty-util-9.4.9.v20180320.jar:9.4.9.v20180320]
	at org.eclipse.jetty.deploy.bindings.StandardStarter.processBinding(StandardStarter.java:46) [jetty-deploy-9.4.9.v20180320.jar:9.4.9.v20180320]
	at org.eclipse.jetty.deploy.AppLifeCycle.runBindings(AppLifeCycle.java:192) [jetty-deploy-9.4.9.v20180320.jar:9.4.9.v20180320]
	at org.eclipse.jetty.deploy.DeploymentManager.requestAppGoal(DeploymentManager.java:505) [jetty-deploy-9.4.9.v20180320.jar:9.4.9.v20180320]
	at org.eclipse.jetty.deploy.DeploymentManager.addApp(DeploymentManager.java:151) [jetty-deploy-9.4.9.v20180320.jar:9.4.9.v20180320]
	at org.jboss.arquillian.container.jetty.embedded_9.JettyEmbeddedContainer.deploy(JettyEmbeddedContainer.java:295) [arquillian-jetty-embedded-9-1.0.0.CR3.jar:1.0.0.CR3]
	at org.jboss.arquillian.container.impl.client.container.ContainerDeployController$3.call(ContainerDeployController.java:151) [arquillian-container-impl-base-1.7.0.Alpha9.jar:1.7.0.Alpha9]
	at org.jboss.arquillian.container.impl.client.container.ContainerDeployController$3.call(ContainerDeployController.java:118) [arquillian-container-impl-base-1.7.0.Alpha9.jar:1.7.0.Alpha9]
	at org.jboss.arquillian.container.impl.client.container.ContainerDeployController.executeOperation(ContainerDeployController.java:239) [arquillian-container-impl-base-1.7.0.Alpha9.jar:1.7.0.Alpha9]
	at org.jboss.arquillian.container.impl.client.container.ContainerDeployController.deploy(ContainerDeployController.java:118) [arquillian-container-impl-base-1.7.0.Alpha9.jar:1.7.0.Alpha9]
	at jdk.internal.reflect.NativeMethodAccessorImpl.invoke0(Native Method) ~[?:?]
	at jdk.internal.reflect.NativeMethodAccessorImpl.invoke(NativeMethodAccessorImpl.java:62) ~[?:?]
	at jdk.internal.reflect.DelegatingMethodAccessorImpl.invoke(DelegatingMethodAccessorImpl.java:43) ~[?:?]
	at java.lang.reflect.Method.invoke(Method.java:566) ~[?:?]
	at org.jboss.arquillian.core.impl.ObserverImpl.invoke(ObserverImpl.java:86) [arquillian-core-impl-base-1.7.0.Alpha9.jar:1.7.0.Alpha9]
	at org.jboss.arquillian.core.impl.EventContextImpl.invokeObservers(EventContextImpl.java:103) [arquillian-core-impl-base-1.7.0.Alpha9.jar:1.7.0.Alpha9]
	at org.jboss.arquillian.core.impl.EventContextImpl.proceed(EventContextImpl.java:90) [arquillian-core-impl-base-1.7.0.Alpha9.jar:1.7.0.Alpha9]
	at org.jboss.arquillian.container.impl.client.ContainerDeploymentContextHandler.createDeploymentContext(ContainerDeploymentContextHandler.java:71) [arquillian-container-impl-base-1.7.0.Alpha9.jar:1.7.0.Alpha9]
	at jdk.internal.reflect.NativeMethodAccessorImpl.invoke0(Native Method) ~[?:?]
	at jdk.internal.reflect.NativeMethodAccessorImpl.invoke(NativeMethodAccessorImpl.java:62) ~[?:?]
	at jdk.internal.reflect.DelegatingMethodAccessorImpl.invoke(DelegatingMethodAccessorImpl.java:43) ~[?:?]
	at java.lang.reflect.Method.invoke(Method.java:566) ~[?:?]
	at org.jboss.arquillian.core.impl.ObserverImpl.invoke(ObserverImpl.java:86) [arquillian-core-impl-base-1.7.0.Alpha9.jar:1.7.0.Alpha9]
	at org.jboss.arquillian.core.impl.EventContextImpl.proceed(EventContextImpl.java:95) [arquillian-core-impl-base-1.7.0.Alpha9.jar:1.7.0.Alpha9]
	at org.jboss.arquillian.container.impl.client.ContainerDeploymentContextHandler.createContainerContext(ContainerDeploymentContextHandler.java:54) [arquillian-container-impl-base-1.7.0.Alpha9.jar:1.7.0.Alpha9]
	at jdk.internal.reflect.NativeMethodAccessorImpl.invoke0(Native Method) ~[?:?]
	at jdk.internal.reflect.NativeMethodAccessorImpl.invoke(NativeMethodAccessorImpl.java:62) ~[?:?]
	at jdk.internal.reflect.DelegatingMethodAccessorImpl.invoke(DelegatingMethodAccessorImpl.java:43) ~[?:?]
	at java.lang.reflect.Method.invoke(Method.java:566) ~[?:?]
	at org.jboss.arquillian.core.impl.ObserverImpl.invoke(ObserverImpl.java:86) [arquillian-core-impl-base-1.7.0.Alpha9.jar:1.7.0.Alpha9]
	at org.jboss.arquillian.core.impl.EventContextImpl.proceed(EventContextImpl.java:95) [arquillian-core-impl-base-1.7.0.Alpha9.jar:1.7.0.Alpha9]
	at org.jboss.arquillian.container.impl.client.container.DeploymentExceptionHandler.verifyExpectedExceptionDuringDeploy(DeploymentExceptionHandler.java:47) [arquillian-container-impl-base-1.7.0.Alpha9.jar:1.7.0.Alpha9]
	at jdk.internal.reflect.NativeMethodAccessorImpl.invoke0(Native Method) ~[?:?]
	at jdk.internal.reflect.NativeMethodAccessorImpl.invoke(NativeMethodAccessorImpl.java:62) ~[?:?]
	at jdk.internal.reflect.DelegatingMethodAccessorImpl.invoke(DelegatingMethodAccessorImpl.java:43) ~[?:?]
	at java.lang.reflect.Method.invoke(Method.java:566) ~[?:?]
	at org.jboss.arquillian.core.impl.ObserverImpl.invoke(ObserverImpl.java:86) [arquillian-core-impl-base-1.7.0.Alpha9.jar:1.7.0.Alpha9]
	at org.jboss.arquillian.core.impl.EventContextImpl.proceed(EventContextImpl.java:95) [arquillian-core-impl-base-1.7.0.Alpha9.jar:1.7.0.Alpha9]
	at org.jboss.arquillian.core.impl.ManagerImpl.fire(ManagerImpl.java:133) [arquillian-core-impl-base-1.7.0.Alpha9.jar:1.7.0.Alpha9]
	at org.jboss.arquillian.core.impl.ManagerImpl.fire(ManagerImpl.java:105) [arquillian-core-impl-base-1.7.0.Alpha9.jar:1.7.0.Alpha9]
	at org.jboss.arquillian.core.impl.EventImpl.fire(EventImpl.java:62) [arquillian-core-impl-base-1.7.0.Alpha9.jar:1.7.0.Alpha9]
	at org.jboss.arquillian.container.impl.client.container.ContainerDeployController$1.perform(ContainerDeployController.java:92) [arquillian-container-impl-base-1.7.0.Alpha9.jar:1.7.0.Alpha9]
	at org.jboss.arquillian.container.impl.client.container.ContainerDeployController$1.perform(ContainerDeployController.java:77) [arquillian-container-impl-base-1.7.0.Alpha9.jar:1.7.0.Alpha9]
	at org.jboss.arquillian.container.impl.client.container.ContainerDeployController.forEachDeployment(ContainerDeployController.java:232) [arquillian-container-impl-base-1.7.0.Alpha9.jar:1.7.0.Alpha9]
	at org.jboss.arquillian.container.impl.client.container.ContainerDeployController.forEachManagedDeployment(ContainerDeployController.java:212) [arquillian-container-impl-base-1.7.0.Alpha9.jar:1.7.0.Alpha9]
	at org.jboss.arquillian.container.impl.client.container.ContainerDeployController.deployManaged(ContainerDeployController.java:77) [arquillian-container-impl-base-1.7.0.Alpha9.jar:1.7.0.Alpha9]
	at jdk.internal.reflect.NativeMethodAccessorImpl.invoke0(Native Method) ~[?:?]
	at jdk.internal.reflect.NativeMethodAccessorImpl.invoke(NativeMethodAccessorImpl.java:62) ~[?:?]
	at jdk.internal.reflect.DelegatingMethodAccessorImpl.invoke(DelegatingMethodAccessorImpl.java:43) ~[?:?]
	at java.lang.reflect.Method.invoke(Method.java:566) ~[?:?]
	at org.jboss.arquillian.core.impl.ObserverImpl.invoke(ObserverImpl.java:86) [arquillian-core-impl-base-1.7.0.Alpha9.jar:1.7.0.Alpha9]
	at org.jboss.arquillian.core.impl.EventContextImpl.invokeObservers(EventContextImpl.java:103) [arquillian-core-impl-base-1.7.0.Alpha9.jar:1.7.0.Alpha9]
	at org.jboss.arquillian.core.impl.EventContextImpl.proceed(EventContextImpl.java:90) [arquillian-core-impl-base-1.7.0.Alpha9.jar:1.7.0.Alpha9]
	at org.eu.ingwar.tools.arquillian.extension.suite.SuiteDeployer.blockDeployManagedDeploymentsWhenNeeded(SuiteDeployer.java:95) [arquillian-suite-extension-1.2.0.jar:?]
	at jdk.internal.reflect.NativeMethodAccessorImpl.invoke0(Native Method) ~[?:?]
	at jdk.internal.reflect.NativeMethodAccessorImpl.invoke(NativeMethodAccessorImpl.java:62) ~[?:?]
	at jdk.internal.reflect.DelegatingMethodAccessorImpl.invoke(DelegatingMethodAccessorImpl.java:43) ~[?:?]
	at java.lang.reflect.Method.invoke(Method.java:566) ~[?:?]
	at org.jboss.arquillian.core.impl.ObserverImpl.invoke(ObserverImpl.java:86) [arquillian-core-impl-base-1.7.0.Alpha9.jar:1.7.0.Alpha9]
	at org.jboss.arquillian.core.impl.EventContextImpl.proceed(EventContextImpl.java:95) [arquillian-core-impl-base-1.7.0.Alpha9.jar:1.7.0.Alpha9]
	at org.jboss.arquillian.core.impl.ManagerImpl.fire(ManagerImpl.java:133) [arquillian-core-impl-base-1.7.0.Alpha9.jar:1.7.0.Alpha9]
	at org.jboss.arquillian.core.impl.ManagerImpl.fire(ManagerImpl.java:105) [arquillian-core-impl-base-1.7.0.Alpha9.jar:1.7.0.Alpha9]
	at org.jboss.arquillian.core.impl.EventImpl.fire(EventImpl.java:62) [arquillian-core-impl-base-1.7.0.Alpha9.jar:1.7.0.Alpha9]
	at org.jboss.arquillian.container.test.impl.client.ContainerEventController.execute(ContainerEventController.java:96) [arquillian-container-test-impl-base-1.4.0.Final.jar:1.4.0.Final]
	at jdk.internal.reflect.NativeMethodAccessorImpl.invoke0(Native Method) ~[?:?]
	at jdk.internal.reflect.NativeMethodAccessorImpl.invoke(NativeMethodAccessorImpl.java:62) ~[?:?]
	at jdk.internal.reflect.DelegatingMethodAccessorImpl.invoke(DelegatingMethodAccessorImpl.java:43) ~[?:?]
	at java.lang.reflect.Method.invoke(Method.java:566) ~[?:?]
	at org.jboss.arquillian.core.impl.ObserverImpl.invoke(ObserverImpl.java:86) [arquillian-core-impl-base-1.7.0.Alpha9.jar:1.7.0.Alpha9]
	at org.jboss.arquillian.core.impl.EventContextImpl.invokeObservers(EventContextImpl.java:103) [arquillian-core-impl-base-1.7.0.Alpha9.jar:1.7.0.Alpha9]
	at org.jboss.arquillian.core.impl.EventContextImpl.proceed(EventContextImpl.java:90) [arquillian-core-impl-base-1.7.0.Alpha9.jar:1.7.0.Alpha9]
	at org.jboss.arquillian.test.impl.TestContextHandler.createClassContext(TestContextHandler.java:83) [arquillian-test-impl-base-1.7.0.Alpha9.jar:1.7.0.Alpha9]
	at jdk.internal.reflect.NativeMethodAccessorImpl.invoke0(Native Method) ~[?:?]
	at jdk.internal.reflect.NativeMethodAccessorImpl.invoke(NativeMethodAccessorImpl.java:62) ~[?:?]
	at jdk.internal.reflect.DelegatingMethodAccessorImpl.invoke(DelegatingMethodAccessorImpl.java:43) ~[?:?]
	at java.lang.reflect.Method.invoke(Method.java:566) ~[?:?]
	at org.jboss.arquillian.core.impl.ObserverImpl.invoke(ObserverImpl.java:86) [arquillian-core-impl-base-1.7.0.Alpha9.jar:1.7.0.Alpha9]
	at org.jboss.arquillian.core.impl.EventContextImpl.proceed(EventContextImpl.java:95) [arquillian-core-impl-base-1.7.0.Alpha9.jar:1.7.0.Alpha9]
	at org.jboss.arquillian.test.impl.TestContextHandler.createSuiteContext(TestContextHandler.java:69) [arquillian-test-impl-base-1.7.0.Alpha9.jar:1.7.0.Alpha9]
	at jdk.internal.reflect.NativeMethodAccessorImpl.invoke0(Native Method) ~[?:?]
	at jdk.internal.reflect.NativeMethodAccessorImpl.invoke(NativeMethodAccessorImpl.java:62) ~[?:?]
	at jdk.internal.reflect.DelegatingMethodAccessorImpl.invoke(DelegatingMethodAccessorImpl.java:43) ~[?:?]
	at java.lang.reflect.Method.invoke(Method.java:566) ~[?:?]
	at org.jboss.arquillian.core.impl.ObserverImpl.invoke(ObserverImpl.java:86) [arquillian-core-impl-base-1.7.0.Alpha9.jar:1.7.0.Alpha9]
	at org.jboss.arquillian.core.impl.EventContextImpl.proceed(EventContextImpl.java:95) [arquillian-core-impl-base-1.7.0.Alpha9.jar:1.7.0.Alpha9]
	at org.jboss.arquillian.core.impl.ManagerImpl.fire(ManagerImpl.java:133) [arquillian-core-impl-base-1.7.0.Alpha9.jar:1.7.0.Alpha9]
	at org.jboss.arquillian.core.impl.ManagerImpl.fire(ManagerImpl.java:105) [arquillian-core-impl-base-1.7.0.Alpha9.jar:1.7.0.Alpha9]
	at org.jboss.arquillian.test.impl.EventTestRunnerAdaptor.beforeClass(EventTestRunnerAdaptor.java:89) [arquillian-test-impl-base-1.7.0.Alpha9.jar:1.7.0.Alpha9]
	at org.jboss.arquillian.testng.Arquillian.arquillianBeforeClass(Arquillian.java:99) [arquillian-testng-core-1.7.0.Alpha9.jar:1.7.0.Alpha9]
	at jdk.internal.reflect.NativeMethodAccessorImpl.invoke0(Native Method) ~[?:?]
	at jdk.internal.reflect.NativeMethodAccessorImpl.invoke(NativeMethodAccessorImpl.java:62) ~[?:?]
	at jdk.internal.reflect.DelegatingMethodAccessorImpl.invoke(DelegatingMethodAccessorImpl.java:43) ~[?:?]
	at java.lang.reflect.Method.invoke(Method.java:566) ~[?:?]
	at org.testng.internal.MethodInvocationHelper.invokeMethod(MethodInvocationHelper.java:124) [testng-6.14.3.jar:?]
	at org.testng.internal.MethodInvocationHelper.invokeMethodConsideringTimeout(MethodInvocationHelper.java:59) [testng-6.14.3.jar:?]
	at org.testng.internal.Invoker.invokeConfigurationMethod(Invoker.java:458) [testng-6.14.3.jar:?]
	at org.testng.internal.Invoker.invokeConfigurations(Invoker.java:222) [testng-6.14.3.jar:?]
	at org.testng.internal.Invoker.invokeConfigurations(Invoker.java:142) [testng-6.14.3.jar:?]
	at org.testng.internal.TestMethodWorker.invokeBeforeClassMethods(TestMethodWorker.java:168) [testng-6.14.3.jar:?]
	at org.testng.internal.TestMethodWorker.run(TestMethodWorker.java:105) [testng-6.14.3.jar:?]
	at org.testng.TestRunner.privateRun(TestRunner.java:648) [testng-6.14.3.jar:?]
	at org.testng.TestRunner.run(TestRunner.java:505) [testng-6.14.3.jar:?]
	at org.testng.SuiteRunner.runTest(SuiteRunner.java:455) [testng-6.14.3.jar:?]
	at org.testng.SuiteRunner.runSequentially(SuiteRunner.java:450) [testng-6.14.3.jar:?]
	at org.testng.SuiteRunner.privateRun(SuiteRunner.java:415) [testng-6.14.3.jar:?]
	at org.testng.SuiteRunner.run(SuiteRunner.java:364) [testng-6.14.3.jar:?]
	at org.testng.SuiteRunnerWorker.runSuite(SuiteRunnerWorker.java:52) [testng-6.14.3.jar:?]
	at org.testng.SuiteRunnerWorker.run(SuiteRunnerWorker.java:84) [testng-6.14.3.jar:?]
	at org.testng.TestNG.runSuitesSequentially(TestNG.java:1208) [testng-6.14.3.jar:?]
	at org.testng.TestNG.runSuitesLocally(TestNG.java:1137) [testng-6.14.3.jar:?]
	at org.testng.TestNG.runSuites(TestNG.java:1049) [testng-6.14.3.jar:?]
	at org.testng.TestNG.run(TestNG.java:1017) [testng-6.14.3.jar:?]
	at org.apache.maven.surefire.testng.TestNGExecutor.run(TestNGExecutor.java:281) [surefire-testng-2.19.1.jar:2.19.1]
	at org.apache.maven.surefire.testng.TestNGXmlTestSuite.execute(TestNGXmlTestSuite.java:75) [surefire-testng-2.19.1.jar:2.19.1]
	at org.apache.maven.surefire.testng.TestNGProvider.invoke(TestNGProvider.java:121) [surefire-testng-2.19.1.jar:2.19.1]
	at org.apache.maven.surefire.booter.ForkedBooter.invokeProviderInSameClassLoader(ForkedBooter.java:290) [surefire-booter-2.19.1.jar:2.19.1]
	at org.apache.maven.surefire.booter.ForkedBooter.runSuitesInProcess(ForkedBooter.java:242) [surefire-booter-2.19.1.jar:2.19.1]
	at org.apache.maven.surefire.booter.ForkedBooter.main(ForkedBooter.java:121) [surefire-booter-2.19.1.jar:2.19.1]
Caused by: org.gluu.exception.ConfigurationException: Failed to load configuration from LDAP.
	at org.gluu.service.config.ConfigurationFactory.create(ConfigurationFactory.java:148) ~[oxtrust-service-4.3.1-SNAPSHOT.jar:?]
	at org.gluu.oxtrust.service.config.ConfigurationFactory$Proxy$_$$_WeldSubclass.create(Unknown Source) ~[classes/:?]
	at org.gluu.oxtrust.service.config.ConfigurationFactory$Proxy$_$$_WeldClientProxy.create(Unknown Source) ~[classes/:?]
	at org.gluu.oxtrust.service.AppInitializer.applicationInitialized(AppInitializer.java:187) ~[classes/:?]
	at jdk.internal.reflect.NativeMethodAccessorImpl.invoke0(Native Method) ~[?:?]
	at jdk.internal.reflect.NativeMethodAccessorImpl.invoke(NativeMethodAccessorImpl.java:62) ~[?:?]
	at jdk.internal.reflect.DelegatingMethodAccessorImpl.invoke(DelegatingMethodAccessorImpl.java:43) ~[?:?]
	at java.lang.reflect.Method.invoke(Method.java:566) ~[?:?]
	at org.jboss.weld.injection.StaticMethodInjectionPoint.invoke(StaticMethodInjectionPoint.java:95) ~[weld-core-impl-3.1.8.Final.jar:3.1.8.Final]
	at org.jboss.weld.injection.StaticMethodInjectionPoint.invoke(StaticMethodInjectionPoint.java:85) ~[weld-core-impl-3.1.8.Final.jar:3.1.8.Final]
	at org.jboss.weld.injection.MethodInvocationStrategy$SimpleMethodInvocationStrategy.invoke(MethodInvocationStrategy.java:168) ~[weld-core-impl-3.1.8.Final.jar:3.1.8.Final]
	at org.jboss.weld.event.ObserverMethodImpl.sendEvent(ObserverMethodImpl.java:330) ~[weld-core-impl-3.1.8.Final.jar:3.1.8.Final]
	at org.jboss.weld.event.ObserverMethodImpl.sendEvent(ObserverMethodImpl.java:308) ~[weld-core-impl-3.1.8.Final.jar:3.1.8.Final]
	at org.jboss.weld.event.ObserverMethodImpl.notify(ObserverMethodImpl.java:286) ~[weld-core-impl-3.1.8.Final.jar:3.1.8.Final]
	at javax.enterprise.inject.spi.ObserverMethod.notify(ObserverMethod.java:124) ~[cdi-api-2.0.SP1.jar:${parsedVersion.osgiVersion}]
	at org.jboss.weld.util.Observers.notify(Observers.java:166) ~[weld-core-impl-3.1.8.Final.jar:3.1.8.Final]
	at org.jboss.weld.event.ObserverNotifier.notifySyncObservers(ObserverNotifier.java:285) ~[weld-core-impl-3.1.8.Final.jar:3.1.8.Final]
	at org.jboss.weld.event.ObserverNotifier.notify(ObserverNotifier.java:273) ~[weld-core-impl-3.1.8.Final.jar:3.1.8.Final]
	at org.jboss.weld.event.ObserverNotifier.fireEvent(ObserverNotifier.java:177) ~[weld-core-impl-3.1.8.Final.jar:3.1.8.Final]
	at org.jboss.weld.bootstrap.BeanDeploymentModule.fireEvent(BeanDeploymentModule.java:93) ~[weld-core-impl-3.1.8.Final.jar:3.1.8.Final]
	at org.jboss.weld.module.web.servlet.HttpContextLifecycle.fireEventForApplicationScope(HttpContextLifecycle.java:161) ~[weld-web-3.1.8.Final.jar:3.1.8.Final]
	at org.jboss.weld.module.web.servlet.HttpContextLifecycle.contextInitialized(HttpContextLifecycle.java:147) ~[weld-web-3.1.8.Final.jar:3.1.8.Final]
	at org.jboss.weld.module.web.servlet.WeldInitialListener.contextInitialized(WeldInitialListener.java:99) ~[weld-web-3.1.8.Final.jar:3.1.8.Final]
	at org.jboss.weld.servlet.api.helpers.ForwardingServletListener.contextInitialized(ForwardingServletListener.java:34) ~[weld-spi-3.1.SP4.jar:3.1.0.SP4]
	at org.jboss.weld.environment.servlet.EnhancedListener.onStartup(EnhancedListener.java:66) ~[weld-servlet-core-3.1.8.Final.jar:3.1.8.Final]
	at org.eclipse.jetty.plus.annotation.ContainerInitializer.callStartup(ContainerInitializer.java:140) ~[jetty-plus-9.4.9.v20180320.jar:9.4.9.v20180320]
	at org.eclipse.jetty.annotations.ServletContainerInitializersStarter.doStart(ServletContainerInitializersStarter.java:64) ~[jetty-annotations-9.4.9.v20180320.jar:9.4.9.v20180320]
	... 125 more
2021-10-26 17:39:50,540 INFO  [main] [org.eclipse.jetty.util.log.JavaUtilLog] (JavaUtilLog.java:169) - Stopped o.e.j.w.WebAppContext@6febec41{/export4039690275338673376oxtrust,null,UNAVAILABLE}{/home/jenkins/.jenkins/jobs/oxTrust/workspace/server/target/arquillian-jetty-temp/export4039690275338673376oxtrust.war}
2021-10-26 17:39:50,583 INFO  [main] [org.eclipse.jetty.util.log.JavaUtilLog] (JavaUtilLog.java:169) - Stopped ServerConnector@43034809{HTTP/1.1,[http/1.1]}{localhost:9980}
Tests run: 9, Failures: 1, Errors: 0, Skipped: 4, Time elapsed: 15.803 sec <<< FAILURE! - in TestSuite
arquillianBeforeClass(org.gluu.oxtrust.action.ConfigurationStatusTest)  Time elapsed: 15.332 sec  <<< FAILURE!
org.jboss.arquillian.container.spi.client.container.DeploymentException: Could not deploy oxtrust.war
	at org.jboss.arquillian.container.jetty.embedded_9.JettyEmbeddedContainer.deploy(JettyEmbeddedContainer.java:311)
	at org.jboss.arquillian.container.impl.client.container.ContainerDeployController$3.call(ContainerDeployController.java:151)
	at org.jboss.arquillian.container.impl.client.container.ContainerDeployController$3.call(ContainerDeployController.java:118)
	at org.jboss.arquillian.container.impl.client.container.ContainerDeployController.executeOperation(ContainerDeployController.java:239)
	at org.jboss.arquillian.container.impl.client.container.ContainerDeployController.deploy(ContainerDeployController.java:118)
	at java.base/jdk.internal.reflect.NativeMethodAccessorImpl.invoke0(Native Method)
	at java.base/jdk.internal.reflect.NativeMethodAccessorImpl.invoke(NativeMethodAccessorImpl.java:62)
	at java.base/jdk.internal.reflect.DelegatingMethodAccessorImpl.invoke(DelegatingMethodAccessorImpl.java:43)
	at java.base/java.lang.reflect.Method.invoke(Method.java:566)
	at org.jboss.arquillian.core.impl.ObserverImpl.invoke(ObserverImpl.java:86)
	at org.jboss.arquillian.core.impl.EventContextImpl.invokeObservers(EventContextImpl.java:103)
	at org.jboss.arquillian.core.impl.EventContextImpl.proceed(EventContextImpl.java:90)
	at org.jboss.arquillian.container.impl.client.ContainerDeploymentContextHandler.createDeploymentContext(ContainerDeploymentContextHandler.java:71)
	at java.base/jdk.internal.reflect.NativeMethodAccessorImpl.invoke0(Native Method)
	at java.base/jdk.internal.reflect.NativeMethodAccessorImpl.invoke(NativeMethodAccessorImpl.java:62)
	at java.base/jdk.internal.reflect.DelegatingMethodAccessorImpl.invoke(DelegatingMethodAccessorImpl.java:43)
	at java.base/java.lang.reflect.Method.invoke(Method.java:566)
	at org.jboss.arquillian.core.impl.ObserverImpl.invoke(ObserverImpl.java:86)
	at org.jboss.arquillian.core.impl.EventContextImpl.proceed(EventContextImpl.java:95)
	at org.jboss.arquillian.container.impl.client.ContainerDeploymentContextHandler.createContainerContext(ContainerDeploymentContextHandler.java:54)
	at java.base/jdk.internal.reflect.NativeMethodAccessorImpl.invoke0(Native Method)
	at java.base/jdk.internal.reflect.NativeMethodAccessorImpl.invoke(NativeMethodAccessorImpl.java:62)
	at java.base/jdk.internal.reflect.DelegatingMethodAccessorImpl.invoke(DelegatingMethodAccessorImpl.java:43)
	at java.base/java.lang.reflect.Method.invoke(Method.java:566)
	at org.jboss.arquillian.core.impl.ObserverImpl.invoke(ObserverImpl.java:86)
	at org.jboss.arquillian.core.impl.EventContextImpl.proceed(EventContextImpl.java:95)
	at org.jboss.arquillian.container.impl.client.container.DeploymentExceptionHandler.verifyExpectedExceptionDuringDeploy(DeploymentExceptionHandler.java:47)
	at java.base/jdk.internal.reflect.NativeMethodAccessorImpl.invoke0(Native Method)
	at java.base/jdk.internal.reflect.NativeMethodAccessorImpl.invoke(NativeMethodAccessorImpl.java:62)
	at java.base/jdk.internal.reflect.DelegatingMethodAccessorImpl.invoke(DelegatingMethodAccessorImpl.java:43)
	at java.base/java.lang.reflect.Method.invoke(Method.java:566)
	at org.jboss.arquillian.core.impl.ObserverImpl.invoke(ObserverImpl.java:86)
	at org.jboss.arquillian.core.impl.EventContextImpl.proceed(EventContextImpl.java:95)
	at org.jboss.arquillian.core.impl.ManagerImpl.fire(ManagerImpl.java:133)
	at org.jboss.arquillian.core.impl.ManagerImpl.fire(ManagerImpl.java:105)
	at org.jboss.arquillian.core.impl.EventImpl.fire(EventImpl.java:62)
	at org.jboss.arquillian.container.impl.client.container.ContainerDeployController$1.perform(ContainerDeployController.java:92)
	at org.jboss.arquillian.container.impl.client.container.ContainerDeployController$1.perform(ContainerDeployController.java:77)
	at org.jboss.arquillian.container.impl.client.container.ContainerDeployController.forEachDeployment(ContainerDeployController.java:232)
	at org.jboss.arquillian.container.impl.client.container.ContainerDeployController.forEachManagedDeployment(ContainerDeployController.java:212)
	at org.jboss.arquillian.container.impl.client.container.ContainerDeployController.deployManaged(ContainerDeployController.java:77)
	at java.base/jdk.internal.reflect.NativeMethodAccessorImpl.invoke0(Native Method)
	at java.base/jdk.internal.reflect.NativeMethodAccessorImpl.invoke(NativeMethodAccessorImpl.java:62)
	at java.base/jdk.internal.reflect.DelegatingMethodAccessorImpl.invoke(DelegatingMethodAccessorImpl.java:43)
	at java.base/java.lang.reflect.Method.invoke(Method.java:566)
	at org.jboss.arquillian.core.impl.ObserverImpl.invoke(ObserverImpl.java:86)
	at org.jboss.arquillian.core.impl.EventContextImpl.invokeObservers(EventContextImpl.java:103)
	at org.jboss.arquillian.core.impl.EventContextImpl.proceed(EventContextImpl.java:90)
	at org.eu.ingwar.tools.arquillian.extension.suite.SuiteDeployer.blockDeployManagedDeploymentsWhenNeeded(SuiteDeployer.java:95)
	at java.base/jdk.internal.reflect.NativeMethodAccessorImpl.invoke0(Native Method)
	at java.base/jdk.internal.reflect.NativeMethodAccessorImpl.invoke(NativeMethodAccessorImpl.java:62)
	at java.base/jdk.internal.reflect.DelegatingMethodAccessorImpl.invoke(DelegatingMethodAccessorImpl.java:43)
	at java.base/java.lang.reflect.Method.invoke(Method.java:566)
	at org.jboss.arquillian.core.impl.ObserverImpl.invoke(ObserverImpl.java:86)
	at org.jboss.arquillian.core.impl.EventContextImpl.proceed(EventContextImpl.java:95)
	at org.jboss.arquillian.core.impl.ManagerImpl.fire(ManagerImpl.java:133)
	at org.jboss.arquillian.core.impl.ManagerImpl.fire(ManagerImpl.java:105)
	at org.jboss.arquillian.core.impl.EventImpl.fire(EventImpl.java:62)
	at org.jboss.arquillian.container.test.impl.client.ContainerEventController.execute(ContainerEventController.java:96)
	at java.base/jdk.internal.reflect.NativeMethodAccessorImpl.invoke0(Native Method)
	at java.base/jdk.internal.reflect.NativeMethodAccessorImpl.invoke(NativeMethodAccessorImpl.java:62)
	at java.base/jdk.internal.reflect.DelegatingMethodAccessorImpl.invoke(DelegatingMethodAccessorImpl.java:43)
	at java.base/java.lang.reflect.Method.invoke(Method.java:566)
	at org.jboss.arquillian.core.impl.ObserverImpl.invoke(ObserverImpl.java:86)
	at org.jboss.arquillian.core.impl.EventContextImpl.invokeObservers(EventContextImpl.java:103)
	at org.jboss.arquillian.core.impl.EventContextImpl.proceed(EventContextImpl.java:90)
	at org.jboss.arquillian.test.impl.TestContextHandler.createClassContext(TestContextHandler.java:83)
	at java.base/jdk.internal.reflect.NativeMethodAccessorImpl.invoke0(Native Method)
	at java.base/jdk.internal.reflect.NativeMethodAccessorImpl.invoke(NativeMethodAccessorImpl.java:62)
	at java.base/jdk.internal.reflect.DelegatingMethodAccessorImpl.invoke(DelegatingMethodAccessorImpl.java:43)
	at java.base/java.lang.reflect.Method.invoke(Method.java:566)
	at org.jboss.arquillian.core.impl.ObserverImpl.invoke(ObserverImpl.java:86)
	at org.jboss.arquillian.core.impl.EventContextImpl.proceed(EventContextImpl.java:95)
	at org.jboss.arquillian.test.impl.TestContextHandler.createSuiteContext(TestContextHandler.java:69)
	at java.base/jdk.internal.reflect.NativeMethodAccessorImpl.invoke0(Native Method)
	at java.base/jdk.internal.reflect.NativeMethodAccessorImpl.invoke(NativeMethodAccessorImpl.java:62)
	at java.base/jdk.internal.reflect.DelegatingMethodAccessorImpl.invoke(DelegatingMethodAccessorImpl.java:43)
	at java.base/java.lang.reflect.Method.invoke(Method.java:566)
	at org.jboss.arquillian.core.impl.ObserverImpl.invoke(ObserverImpl.java:86)
	at org.jboss.arquillian.core.impl.EventContextImpl.proceed(EventContextImpl.java:95)
	at org.jboss.arquillian.core.impl.ManagerImpl.fire(ManagerImpl.java:133)
	at org.jboss.arquillian.core.impl.ManagerImpl.fire(ManagerImpl.java:105)
	at org.jboss.arquillian.test.impl.EventTestRunnerAdaptor.beforeClass(EventTestRunnerAdaptor.java:89)
	at org.jboss.arquillian.testng.Arquillian.arquillianBeforeClass(Arquillian.java:99)
	at java.base/jdk.internal.reflect.NativeMethodAccessorImpl.invoke0(Native Method)
	at java.base/jdk.internal.reflect.NativeMethodAccessorImpl.invoke(NativeMethodAccessorImpl.java:62)
	at java.base/jdk.internal.reflect.DelegatingMethodAccessorImpl.invoke(DelegatingMethodAccessorImpl.java:43)
	at java.base/java.lang.reflect.Method.invoke(Method.java:566)
	at org.testng.internal.MethodInvocationHelper.invokeMethod(MethodInvocationHelper.java:124)
	at org.testng.internal.MethodInvocationHelper.invokeMethodConsideringTimeout(MethodInvocationHelper.java:59)
	at org.testng.internal.Invoker.invokeConfigurationMethod(Invoker.java:458)
	at org.testng.internal.Invoker.invokeConfigurations(Invoker.java:222)
	at org.testng.internal.Invoker.invokeConfigurations(Invoker.java:142)
	at org.testng.internal.TestMethodWorker.invokeBeforeClassMethods(TestMethodWorker.java:168)
	at org.testng.internal.TestMethodWorker.run(TestMethodWorker.java:105)
	at org.testng.TestRunner.privateRun(TestRunner.java:648)
	at org.testng.TestRunner.run(TestRunner.java:505)
	at org.testng.SuiteRunner.runTest(SuiteRunner.java:455)
	at org.testng.SuiteRunner.runSequentially(SuiteRunner.java:450)
	at org.testng.SuiteRunner.privateRun(SuiteRunner.java:415)
	at org.testng.SuiteRunner.run(SuiteRunner.java:364)
	at org.testng.SuiteRunnerWorker.runSuite(SuiteRunnerWorker.java:52)
	at org.testng.SuiteRunnerWorker.run(SuiteRunnerWorker.java:84)
	at org.testng.TestNG.runSuitesSequentially(TestNG.java:1208)
	at org.testng.TestNG.runSuitesLocally(TestNG.java:1137)
	at org.testng.TestNG.runSuites(TestNG.java:1049)
	at org.testng.TestNG.run(TestNG.java:1017)
	at org.apache.maven.surefire.testng.TestNGExecutor.run(TestNGExecutor.java:281)
	at org.apache.maven.surefire.testng.TestNGXmlTestSuite.execute(TestNGXmlTestSuite.java:75)
	at org.apache.maven.surefire.testng.TestNGProvider.invoke(TestNGProvider.java:121)
	at org.apache.maven.surefire.booter.ForkedBooter.invokeProviderInSameClassLoader(ForkedBooter.java:290)
	at org.apache.maven.surefire.booter.ForkedBooter.runSuitesInProcess(ForkedBooter.java:242)
	at org.apache.maven.surefire.booter.ForkedBooter.main(ForkedBooter.java:121)
Caused by: java.lang.NullPointerException
	at org.eclipse.jetty.servlet.ServletHolder.getContextPath(ServletHolder.java:763)
	at org.jboss.arquillian.container.jetty.embedded_9.JettyEmbeddedContainer.deploy(JettyEmbeddedContainer.java:305)
	... 112 more


Results :

Failed tests: 
  ConfigurationStatusTest>Arquillian.arquillianBeforeClass:99 » Deployment Could...

Tests run: 9, Failures: 1, Errors: 0, Skipped: 4

[INFO] ------------------------------------------------------------------------
[INFO] Reactor Summary:
[INFO] 
[INFO] oxTrust ............................................ SUCCESS [  2.269 s]
[INFO] oxTrust static resources ........................... SUCCESS [  1.715 s]
[INFO] oxTrust configuration .............................. SUCCESS [  0.456 s]
[INFO] oxTrust Model library .............................. SUCCESS [ 17.487 s]
[INFO] oxTrust Client library ............................. SUCCESS [  0.209 s]
[INFO] oxTrust Service .................................... SUCCESS [ 24.152 s]
[INFO] OpenId authentication module ....................... SUCCESS [ 12.844 s]
[INFO] oxTrust Server ..................................... FAILURE [ 29.792 s]
[INFO] OpenId authentication module for Saml .............. SKIPPED
[INFO] OpenId authentication module for CAS ............... SKIPPED
[INFO] oxTrust Server Test ................................ SKIPPED
[INFO] API Server ......................................... SKIPPED
[INFO] ------------------------------------------------------------------------
[INFO] BUILD FAILURE
[INFO] ------------------------------------------------------------------------
[INFO] Total time: 01:31 min
[INFO] Finished at: 2021-10-26T17:39:51+00:00
[INFO] Final Memory: 100M/344M
[INFO] ------------------------------------------------------------------------
[ERROR] Failed to execute goal org.apache.maven.plugins:maven-surefire-plugin:2.19.1:test (default-test) on project oxtrust-server: There are test failures.
[ERROR] 
[ERROR] Please refer to /home/jenkins/.jenkins/jobs/oxTrust/workspace/server/target/surefire-reports for the individual test results.
[ERROR] -> [Help 1]
[ERROR] 
[ERROR] To see the full stack trace of the errors, re-run Maven with the -e switch.
[ERROR] Re-run Maven using the -X switch to enable full debug logging.
[ERROR] 
[ERROR] For more information about the errors and possible solutions, please read the following articles:
[ERROR] [Help 1] http://cwiki.apache.org/confluence/display/MAVEN/MojoFailureException
[ERROR] 
[ERROR] After correcting the problems, you can resume the build with the command
[ERROR]   mvn <goals> -rf :oxtrust-server
Build step 'Invoke top-level Maven targets' marked build as failure
[FINDBUGS] Skipping publisher since build result is FAILURE
Publishing Javadoc
TestNG Reports Processing: START
Looking for TestNG results report in workspace using pattern: **/testng-results.xml
Saving reports...
Processing '/home/jenkins/.jenkins/jobs/oxTrust/builds/482/testng/testng-results.xml'
TestNG Reports Processing: FINISH
Not sending mail to unregistered user Yuriy.Movchan@gmail.com
Sending e-mails to: support@gluu.org
ERROR: Could not connect to SMTP host: webmail.gluu.org, port: 465
javax.mail.MessagingException: Could not connect to SMTP host: webmail.gluu.org, port: 465;
  nested exception is:
	javax.net.ssl.SSLHandshakeException: sun.security.validator.ValidatorException: PKIX path building failed: sun.security.provider.certpath.SunCertPathBuilderException: unable to find valid certification path to requested target
	at com.sun.mail.smtp.SMTPTransport.openServer(SMTPTransport.java:2212)
	at com.sun.mail.smtp.SMTPTransport.protocolConnect(SMTPTransport.java:722)
	at javax.mail.Service.connect(Service.java:310)
	at javax.mail.Service.connect(Service.java:169)
	at javax.mail.Service.connect(Service.java:118)
	at javax.mail.Transport.send0(Transport.java:188)
	at javax.mail.Transport.send(Transport.java:118)
	at hudson.tasks.MailSender.run(MailSender.java:130)
	at hudson.tasks.Mailer.perform(Mailer.java:176)
	at hudson.tasks.Mailer.perform(Mailer.java:139)
	at hudson.tasks.BuildStepMonitor$1.perform(BuildStepMonitor.java:20)
	at hudson.model.AbstractBuild$AbstractBuildExecution.perform(AbstractBuild.java:741)
	at hudson.model.AbstractBuild$AbstractBuildExecution.performAllBuildSteps(AbstractBuild.java:690)
	at hudson.model.Build$BuildExecution.post2(Build.java:186)
	at hudson.model.AbstractBuild$AbstractBuildExecution.post(AbstractBuild.java:635)
	at hudson.model.Run.execute(Run.java:1905)
	at hudson.model.FreeStyleBuild.run(FreeStyleBuild.java:43)
	at hudson.model.ResourceController.execute(ResourceController.java:97)
	at hudson.model.Executor.run(Executor.java:428)
Caused by: javax.net.ssl.SSLHandshakeException: sun.security.validator.ValidatorException: PKIX path building failed: sun.security.provider.certpath.SunCertPathBuilderException: unable to find valid certification path to requested target
	at sun.security.ssl.Alerts.getSSLException(Alerts.java:192)
	at sun.security.ssl.SSLSocketImpl.fatal(SSLSocketImpl.java:1949)
	at sun.security.ssl.Handshaker.fatalSE(Handshaker.java:302)
	at sun.security.ssl.Handshaker.fatalSE(Handshaker.java:296)
	at sun.security.ssl.ClientHandshaker.serverCertificate(ClientHandshaker.java:1514)
	at sun.security.ssl.ClientHandshaker.processMessage(ClientHandshaker.java:216)
	at sun.security.ssl.Handshaker.processLoop(Handshaker.java:1026)
	at sun.security.ssl.Handshaker.process_record(Handshaker.java:961)
	at sun.security.ssl.SSLSocketImpl.readRecord(SSLSocketImpl.java:1062)
	at sun.security.ssl.SSLSocketImpl.performInitialHandshake(SSLSocketImpl.java:1375)
	at sun.security.ssl.SSLSocketImpl.startHandshake(SSLSocketImpl.java:1403)
	at sun.security.ssl.SSLSocketImpl.startHandshake(SSLSocketImpl.java:1387)
	at com.sun.mail.util.SocketFetcher.configureSSLSocket(SocketFetcher.java:602)
	at com.sun.mail.util.SocketFetcher.createSocket(SocketFetcher.java:376)
	at com.sun.mail.util.SocketFetcher.getSocket(SocketFetcher.java:193)
	at com.sun.mail.smtp.SMTPTransport.openServer(SMTPTransport.java:2160)
	... 18 more
Caused by: sun.security.validator.ValidatorException: PKIX path building failed: sun.security.provider.certpath.SunCertPathBuilderException: unable to find valid certification path to requested target
	at sun.security.validator.PKIXValidator.doBuild(PKIXValidator.java:387)
	at sun.security.validator.PKIXValidator.engineValidate(PKIXValidator.java:230)
	at sun.security.validator.Validator.validate(Validator.java:260)
	at sun.security.ssl.X509TrustManagerImpl.validate(X509TrustManagerImpl.java:324)
	at sun.security.ssl.X509TrustManagerImpl.checkTrusted(X509TrustManagerImpl.java:229)
	at sun.security.ssl.X509TrustManagerImpl.checkServerTrusted(X509TrustManagerImpl.java:124)
	at sun.security.ssl.ClientHandshaker.serverCertificate(ClientHandshaker.java:1496)
	... 29 more
Caused by: sun.security.provider.certpath.SunCertPathBuilderException: unable to find valid certification path to requested target
	at sun.security.provider.certpath.SunCertPathBuilder.build(SunCertPathBuilder.java:141)
	at sun.security.provider.certpath.SunCertPathBuilder.engineBuild(SunCertPathBuilder.java:126)
	at java.security.cert.CertPathBuilder.build(CertPathBuilder.java:280)
	at sun.security.validator.PKIXValidator.doBuild(PKIXValidator.java:382)
	... 35 more
[Boolean condition] checking [true] against [^(1|y|yes|t|true|on|run)$] (origin token: $DEPLOY_BUILD)
Run condition [Boolean condition] enabling perform for step [Builder to mark whether executed]
Finished: FAILURE