FailedConsole Output

Started by an SCM change
Running as SYSTEM
Building on master in workspace /home/jenkins/.jenkins/jobs/oxScimClient_4.1.0_Couchbase/workspace
No credentials specified
 > git rev-parse --is-inside-work-tree # timeout=10
Fetching changes from the remote Git repository
 > git config remote.origin.url https://github.com/GluuFederation/SCIM-Client # timeout=10
Fetching upstream changes from https://github.com/GluuFederation/SCIM-Client
 > git --version # timeout=10
 > git fetch --tags --progress https://github.com/GluuFederation/SCIM-Client +refs/heads/*:refs/remotes/origin/* # timeout=10
 > git rev-parse refs/remotes/origin/version_4.1.0^{commit} # timeout=10
 > git rev-parse refs/remotes/origin/origin/version_4.1.0^{commit} # timeout=10
Checking out Revision e07f0b6cb0f76378d8b6cfe0eaab02b6563cc5af (refs/remotes/origin/version_4.1.0)
 > git config core.sparsecheckout # timeout=10
 > git checkout -f e07f0b6cb0f76378d8b6cfe0eaab02b6563cc5af # timeout=10
Commit message: "Merge branch 'version_4.1.0' of https://github.com/GluuFederation/SCIM-Client into version_4.1.0"
First time build. Skipping changelog.
[workspace] $ /bin/sh -xe /opt/jetty/temp/jenkins8314736927180391401.sh
+ rm -rf ./oxHudsonProfiles
+ rm -rf ./profiles/ce-dev8.gluu.org
+ git clone github.com:GluuFederation/oxHudsonProfiles.git
Cloning into 'oxHudsonProfiles'...
+ mkdir -p ./profiles
+ cp -rf ./oxHudsonProfiles/scim-client/profiles/ce-dev8.gluu.org/ profiles
+ rm -rf ./oxHudsonProfiles
[workspace] $ /home/jenkins/.jenkins/tools/hudson.tasks.Maven_MavenInstallation/maven_3.3.9/bin/mvn -DVERSION_NAME=version_4.1.0 -DPROFILE_NAME=ce-dev8.gluu.org -DMAVEN_SKIP_TESTS=false -Dmaven.test.skip=false -Dcfg=ce-dev8.gluu.org clean compile javadoc:javadoc install findbugs:findbugs site
[INFO] Scanning for projects...
[INFO]                                                                         
[INFO] ------------------------------------------------------------------------
[INFO] Building SCIM-Client 4.1.0.Final
[INFO] ------------------------------------------------------------------------
Downloading: http://repository.jboss.org/nexus/content/groups/public-jboss/net/minidev/json-smart/maven-metadata.xml
Downloading: https://repo.maven.apache.org/maven2/net/minidev/json-smart/maven-metadata.xml
Downloading: http://repo2.maven.org/maven2/org/bouncycastle/net/minidev/json-smart/maven-metadata.xml
Downloading: http://ox.gluu.org/maven/net/minidev/json-smart/maven-metadata.xml

Downloading: http://repo1.maven.org/maven2/net/minidev/json-smart/maven-metadata.xml


849/849 B   
            
Downloaded: https://repo.maven.apache.org/maven2/net/minidev/json-smart/maven-metadata.xml (849 B at 1.5 KB/sec)
849/849 B   
            
Downloaded: http://repository.jboss.org/nexus/content/groups/public-jboss/net/minidev/json-smart/maven-metadata.xml (849 B at 0.9 KB/sec)
[WARNING] Could not transfer metadata net.minidev:json-smart/maven-metadata.xml from/to bouncycastle (http://repo2.maven.org/maven2/org/bouncycastle): Failed to transfer file: http://repo2.maven.org/maven2/org/bouncycastle/net/minidev/json-smart/maven-metadata.xml. Return code is: 501 , ReasonPhrase:HTTPS Required.
[WARNING] Could not transfer metadata net.minidev:json-smart/maven-metadata.xml from/to mavencentral (http://repo1.maven.org/maven2): Failed to transfer file: http://repo1.maven.org/maven2/net/minidev/json-smart/maven-metadata.xml. Return code is: 501 , ReasonPhrase:HTTPS Required.
[INFO] 
[INFO] --- maven-clean-plugin:2.5:clean (default-clean) @ scim-client2 ---
[INFO] Deleting /home/jenkins/.jenkins/jobs/oxScimClient_4.1.0_Couchbase/workspace/target
[INFO] 
[INFO] --- maven-resources-plugin:2.6:resources (default-resources) @ scim-client2 ---
[INFO] Using 'UTF-8' encoding to copy filtered resources.
[INFO] Copying 1 resource
[INFO] 
[INFO] --- maven-compiler-plugin:3.1:compile (default-compile) @ scim-client2 ---
[INFO] Changes detected - recompiling the module!
[INFO] Compiling 17 source files to /home/jenkins/.jenkins/jobs/oxScimClient_4.1.0_Couchbase/workspace/target/classes
[INFO] -------------------------------------------------------------
[WARNING] COMPILATION WARNING : 
[INFO] -------------------------------------------------------------
[WARNING] /home/jenkins/.jenkins/jobs/oxScimClient_4.1.0_Couchbase/workspace/src/main/java/gluu/scim2/client/rest/provider/ListResponseProvider.java: /home/jenkins/.jenkins/jobs/oxScimClient_4.1.0_Couchbase/workspace/src/main/java/gluu/scim2/client/rest/provider/ListResponseProvider.java uses unchecked or unsafe operations.
[WARNING] /home/jenkins/.jenkins/jobs/oxScimClient_4.1.0_Couchbase/workspace/src/main/java/gluu/scim2/client/rest/provider/ListResponseProvider.java: Recompile with -Xlint:unchecked for details.
[INFO] 2 warnings 
[INFO] -------------------------------------------------------------
[INFO] -------------------------------------------------------------
[ERROR] COMPILATION ERROR : 
[INFO] -------------------------------------------------------------
[ERROR] /home/jenkins/.jenkins/jobs/oxScimClient_4.1.0_Couchbase/workspace/src/main/java/gluu/scim2/client/UmaScimClient.java:[175,54] cannot find symbol
  symbol:   method getKeyAliases()
  location: variable cryptoProvider of type org.gluu.oxauth.model.crypto.OxAuthCryptoProvider
[INFO] 1 error
[INFO] -------------------------------------------------------------
[INFO] ------------------------------------------------------------------------
[INFO] BUILD FAILURE
[INFO] ------------------------------------------------------------------------
[INFO] Total time: 5.209 s
[INFO] Finished at: 2020-01-21T08:19:18+00:00
[INFO] Final Memory: 29M/312M
[INFO] ------------------------------------------------------------------------
[ERROR] Failed to execute goal org.apache.maven.plugins:maven-compiler-plugin:3.1:compile (default-compile) on project scim-client2: Compilation failure
[ERROR] /home/jenkins/.jenkins/jobs/oxScimClient_4.1.0_Couchbase/workspace/src/main/java/gluu/scim2/client/UmaScimClient.java:[175,54] cannot find symbol
[ERROR] symbol:   method getKeyAliases()
[ERROR] location: variable cryptoProvider of type org.gluu.oxauth.model.crypto.OxAuthCryptoProvider
[ERROR] -> [Help 1]
[ERROR] 
[ERROR] To see the full stack trace of the errors, re-run Maven with the -e switch.
[ERROR] Re-run Maven using the -X switch to enable full debug logging.
[ERROR] 
[ERROR] For more information about the errors and possible solutions, please read the following articles:
[ERROR] [Help 1] http://cwiki.apache.org/confluence/display/MAVEN/MojoFailureException
Build step 'Invoke top-level Maven targets' marked build as failure
[FINDBUGS] Skipping publisher since build result is FAILURE
Publishing Javadoc
TestNG Reports Processing: START
Looking for TestNG results report in workspace using pattern: **/testng-results.xml
Did not find any matching files.
Not sending mail to unregistered user Yuriy.Movchan@gmail.com
Not sending mail to unregistered user bonustrack310@gmail.com
Sending e-mails to: support@gluu.org
Finished: FAILURE