FailedConsole Output

Started by user Yuriy Movchan
Running as SYSTEM
Building on master in workspace /home/jenkins/.jenkins/jobs/oxScimClient_4.0_Couchbase/workspace
No credentials specified
Cloning the remote Git repository
Cloning repository https://github.com/GluuFederation/SCIM-Client
 > git init /home/jenkins/.jenkins/jobs/oxScimClient_4.0_Couchbase/workspace # timeout=10
Fetching upstream changes from https://github.com/GluuFederation/SCIM-Client
 > git --version # timeout=10
 > git fetch --tags --progress https://github.com/GluuFederation/SCIM-Client +refs/heads/*:refs/remotes/origin/*
 > git config remote.origin.url https://github.com/GluuFederation/SCIM-Client # timeout=10
 > git config --add remote.origin.fetch +refs/heads/*:refs/remotes/origin/* # timeout=10
 > git config remote.origin.url https://github.com/GluuFederation/SCIM-Client # timeout=10
Fetching upstream changes from https://github.com/GluuFederation/SCIM-Client
 > git fetch --tags --progress https://github.com/GluuFederation/SCIM-Client +refs/heads/*:refs/remotes/origin/*
 > git rev-parse refs/remotes/origin/master^{commit} # timeout=10
 > git rev-parse refs/remotes/origin/origin/master^{commit} # timeout=10
Checking out Revision 75c1d3b6d564e93fe034d036ec625daea39d109c (refs/remotes/origin/master)
 > git config core.sparsecheckout # timeout=10
 > git checkout -f 75c1d3b6d564e93fe034d036ec625daea39d109c
Commit message: "Misc accomodations (cb friendlier)"
First time build. Skipping changelog.
[workspace] $ /bin/sh -xe /opt/jetty/temp/jenkins1719426255842771858.sh
+ rm -rf ./oxHudsonProfiles
+ rm -rf ./profiles/ce-dev8.gluu.org
+ git clone github.com:GluuFederation/oxHudsonProfiles.git
Cloning into 'oxHudsonProfiles'...
+ mkdir -p ./profiles
+ cp -rf ./oxHudsonProfiles/scim-client/profiles/ce-dev8.gluu.org/ profiles
+ rm -rf ./oxHudsonProfiles
[workspace] $ /home/jenkins/.jenkins/tools/hudson.tasks.Maven_MavenInstallation/maven_3.3.9/bin/mvn -DVERSION_NAME=master -DPROFILE_NAME=ce-dev8.gluu.org -DMAVEN_SKIP_TESTS=false -Dmaven.test.skip=false -Dcfg=ce-dev8.gluu.org clean compile javadoc:javadoc install findbugs:findbugs site
[INFO] Scanning for projects...
[INFO]                                                                         
[INFO] ------------------------------------------------------------------------
[INFO] Building SCIM-Client 4.0.0-SNAPSHOT
[INFO] ------------------------------------------------------------------------
[INFO] 
[INFO] --- maven-clean-plugin:2.5:clean (default-clean) @ scim-client2 ---
[INFO] 
[INFO] --- maven-resources-plugin:2.6:resources (default-resources) @ scim-client2 ---
[INFO] Using 'UTF-8' encoding to copy filtered resources.
[INFO] Copying 1 resource
[INFO] 
[INFO] --- maven-compiler-plugin:3.1:compile (default-compile) @ scim-client2 ---
[INFO] Changes detected - recompiling the module!
[INFO] Compiling 18 source files to /home/jenkins/.jenkins/jobs/oxScimClient_4.0_Couchbase/workspace/target/classes
[WARNING] /home/jenkins/.jenkins/jobs/oxScimClient_4.0_Couchbase/workspace/src/main/java/gluu/scim2/client/rest/provider/ListResponseProvider.java: /home/jenkins/.jenkins/jobs/oxScimClient_4.0_Couchbase/workspace/src/main/java/gluu/scim2/client/rest/provider/ListResponseProvider.java uses unchecked or unsafe operations.
[WARNING] /home/jenkins/.jenkins/jobs/oxScimClient_4.0_Couchbase/workspace/src/main/java/gluu/scim2/client/rest/provider/ListResponseProvider.java: Recompile with -Xlint:unchecked for details.
[INFO] 
[INFO] >>> maven-javadoc-plugin:2.10.4:javadoc (default-cli) > generate-sources @ scim-client2 >>>
[INFO] 
[INFO] <<< maven-javadoc-plugin:2.10.4:javadoc (default-cli) < generate-sources @ scim-client2 <<<
[INFO] 
[INFO] --- maven-javadoc-plugin:2.10.4:javadoc (default-cli) @ scim-client2 ---
[INFO] 
Loading source files for package gluu.scim2.client...
Loading source files for package gluu.scim2.client.exception...
Loading source files for package gluu.scim2.client.factory...
Loading source files for package gluu.scim2.client.rest...
Loading source files for package gluu.scim2.client.rest.provider...
Constructing Javadoc information...
Standard Doclet version 1.8.0_222
Building tree for all the packages and classes...
Generating /home/jenkins/.jenkins/jobs/oxScimClient_4.0_Couchbase/workspace/target/site/apidocs/gluu/scim2/client/AbstractScimClient.html...
Generating /home/jenkins/.jenkins/jobs/oxScimClient_4.0_Couchbase/workspace/target/site/apidocs/gluu/scim2/client/ClientMap.html...
Generating /home/jenkins/.jenkins/jobs/oxScimClient_4.0_Couchbase/workspace/target/site/apidocs/gluu/scim2/client/DummyClient.html...
Generating /home/jenkins/.jenkins/jobs/oxScimClient_4.0_Couchbase/workspace/target/site/apidocs/gluu/scim2/client/TestModeScimClient.html...
Generating /home/jenkins/.jenkins/jobs/oxScimClient_4.0_Couchbase/workspace/target/site/apidocs/gluu/scim2/client/UmaScimClient.html...
Generating /home/jenkins/.jenkins/jobs/oxScimClient_4.0_Couchbase/workspace/target/site/apidocs/gluu/scim2/client/exception/ScimClientException.html...
Generating /home/jenkins/.jenkins/jobs/oxScimClient_4.0_Couchbase/workspace/target/site/apidocs/gluu/scim2/client/exception/ScimInitializationException.html...
Generating /home/jenkins/.jenkins/jobs/oxScimClient_4.0_Couchbase/workspace/target/site/apidocs/gluu/scim2/client/factory/ScimClientFactory.html...
Generating /home/jenkins/.jenkins/jobs/oxScimClient_4.0_Couchbase/workspace/target/site/apidocs/gluu/scim2/client/rest/ClientSideFido2DeviceService.html...
Generating /home/jenkins/.jenkins/jobs/oxScimClient_4.0_Couchbase/workspace/target/site/apidocs/gluu/scim2/client/rest/ClientSideFidoDeviceService.html...
Generating /home/jenkins/.jenkins/jobs/oxScimClient_4.0_Couchbase/workspace/target/site/apidocs/gluu/scim2/client/rest/ClientSideGroupService.html...
Generating /home/jenkins/.jenkins/jobs/oxScimClient_4.0_Couchbase/workspace/target/site/apidocs/gluu/scim2/client/rest/ClientSideService.html...
Generating /home/jenkins/.jenkins/jobs/oxScimClient_4.0_Couchbase/workspace/target/site/apidocs/gluu/scim2/client/rest/ClientSideUserService.html...
Generating /home/jenkins/.jenkins/jobs/oxScimClient_4.0_Couchbase/workspace/target/site/apidocs/gluu/scim2/client/rest/CloseableClient.html...
Generating /home/jenkins/.jenkins/jobs/oxScimClient_4.0_Couchbase/workspace/target/site/apidocs/gluu/scim2/client/rest/FreelyAccessible.html...
Generating /home/jenkins/.jenkins/jobs/oxScimClient_4.0_Couchbase/workspace/target/site/apidocs/gluu/scim2/client/rest/provider/AuthorizationInjectionFilter.html...
Generating /home/jenkins/.jenkins/jobs/oxScimClient_4.0_Couchbase/workspace/target/site/apidocs/gluu/scim2/client/rest/provider/ListResponseProvider.html...
Generating /home/jenkins/.jenkins/jobs/oxScimClient_4.0_Couchbase/workspace/target/site/apidocs/gluu/scim2/client/rest/provider/ScimResourceProvider.html...
Generating /home/jenkins/.jenkins/jobs/oxScimClient_4.0_Couchbase/workspace/target/site/apidocs/overview-frame.html...
Generating /home/jenkins/.jenkins/jobs/oxScimClient_4.0_Couchbase/workspace/target/site/apidocs/gluu/scim2/client/package-frame.html...
Generating /home/jenkins/.jenkins/jobs/oxScimClient_4.0_Couchbase/workspace/target/site/apidocs/gluu/scim2/client/package-summary.html...
Generating /home/jenkins/.jenkins/jobs/oxScimClient_4.0_Couchbase/workspace/target/site/apidocs/gluu/scim2/client/package-tree.html...
Generating /home/jenkins/.jenkins/jobs/oxScimClient_4.0_Couchbase/workspace/target/site/apidocs/gluu/scim2/client/exception/package-frame.html...
Generating /home/jenkins/.jenkins/jobs/oxScimClient_4.0_Couchbase/workspace/target/site/apidocs/gluu/scim2/client/exception/package-summary.html...
Generating /home/jenkins/.jenkins/jobs/oxScimClient_4.0_Couchbase/workspace/target/site/apidocs/gluu/scim2/client/exception/package-tree.html...
Generating /home/jenkins/.jenkins/jobs/oxScimClient_4.0_Couchbase/workspace/target/site/apidocs/gluu/scim2/client/factory/package-frame.html...
Generating /home/jenkins/.jenkins/jobs/oxScimClient_4.0_Couchbase/workspace/target/site/apidocs/gluu/scim2/client/factory/package-summary.html...
Generating /home/jenkins/.jenkins/jobs/oxScimClient_4.0_Couchbase/workspace/target/site/apidocs/gluu/scim2/client/factory/package-tree.html...
Generating /home/jenkins/.jenkins/jobs/oxScimClient_4.0_Couchbase/workspace/target/site/apidocs/gluu/scim2/client/rest/package-frame.html...
Generating /home/jenkins/.jenkins/jobs/oxScimClient_4.0_Couchbase/workspace/target/site/apidocs/gluu/scim2/client/rest/package-summary.html...
Generating /home/jenkins/.jenkins/jobs/oxScimClient_4.0_Couchbase/workspace/target/site/apidocs/gluu/scim2/client/rest/package-tree.html...
Generating /home/jenkins/.jenkins/jobs/oxScimClient_4.0_Couchbase/workspace/target/site/apidocs/gluu/scim2/client/rest/provider/package-frame.html...
Generating /home/jenkins/.jenkins/jobs/oxScimClient_4.0_Couchbase/workspace/target/site/apidocs/gluu/scim2/client/rest/provider/package-summary.html...
Generating /home/jenkins/.jenkins/jobs/oxScimClient_4.0_Couchbase/workspace/target/site/apidocs/gluu/scim2/client/rest/provider/package-tree.html...
Generating /home/jenkins/.jenkins/jobs/oxScimClient_4.0_Couchbase/workspace/target/site/apidocs/constant-values.html...
Generating /home/jenkins/.jenkins/jobs/oxScimClient_4.0_Couchbase/workspace/target/site/apidocs/serialized-form.html...
Generating /home/jenkins/.jenkins/jobs/oxScimClient_4.0_Couchbase/workspace/target/site/apidocs/gluu/scim2/client/class-use/UmaScimClient.html...
Generating /home/jenkins/.jenkins/jobs/oxScimClient_4.0_Couchbase/workspace/target/site/apidocs/gluu/scim2/client/class-use/TestModeScimClient.html...
Generating /home/jenkins/.jenkins/jobs/oxScimClient_4.0_Couchbase/workspace/target/site/apidocs/gluu/scim2/client/class-use/DummyClient.html...
Generating /home/jenkins/.jenkins/jobs/oxScimClient_4.0_Couchbase/workspace/target/site/apidocs/gluu/scim2/client/class-use/ClientMap.html...
Generating /home/jenkins/.jenkins/jobs/oxScimClient_4.0_Couchbase/workspace/target/site/apidocs/gluu/scim2/client/class-use/AbstractScimClient.html...
Generating /home/jenkins/.jenkins/jobs/oxScimClient_4.0_Couchbase/workspace/target/site/apidocs/gluu/scim2/client/exception/class-use/ScimInitializationException.html...
Generating /home/jenkins/.jenkins/jobs/oxScimClient_4.0_Couchbase/workspace/target/site/apidocs/gluu/scim2/client/exception/class-use/ScimClientException.html...
Generating /home/jenkins/.jenkins/jobs/oxScimClient_4.0_Couchbase/workspace/target/site/apidocs/gluu/scim2/client/factory/class-use/ScimClientFactory.html...
Generating /home/jenkins/.jenkins/jobs/oxScimClient_4.0_Couchbase/workspace/target/site/apidocs/gluu/scim2/client/rest/class-use/FreelyAccessible.html...
Generating /home/jenkins/.jenkins/jobs/oxScimClient_4.0_Couchbase/workspace/target/site/apidocs/gluu/scim2/client/rest/class-use/CloseableClient.html...
Generating /home/jenkins/.jenkins/jobs/oxScimClient_4.0_Couchbase/workspace/target/site/apidocs/gluu/scim2/client/rest/class-use/ClientSideUserService.html...
Generating /home/jenkins/.jenkins/jobs/oxScimClient_4.0_Couchbase/workspace/target/site/apidocs/gluu/scim2/client/rest/class-use/ClientSideService.html...
Generating /home/jenkins/.jenkins/jobs/oxScimClient_4.0_Couchbase/workspace/target/site/apidocs/gluu/scim2/client/rest/class-use/ClientSideGroupService.html...
Generating /home/jenkins/.jenkins/jobs/oxScimClient_4.0_Couchbase/workspace/target/site/apidocs/gluu/scim2/client/rest/class-use/ClientSideFidoDeviceService.html...
Generating /home/jenkins/.jenkins/jobs/oxScimClient_4.0_Couchbase/workspace/target/site/apidocs/gluu/scim2/client/rest/class-use/ClientSideFido2DeviceService.html...
Generating /home/jenkins/.jenkins/jobs/oxScimClient_4.0_Couchbase/workspace/target/site/apidocs/gluu/scim2/client/rest/provider/class-use/ScimResourceProvider.html...
Generating /home/jenkins/.jenkins/jobs/oxScimClient_4.0_Couchbase/workspace/target/site/apidocs/gluu/scim2/client/rest/provider/class-use/ListResponseProvider.html...
Generating /home/jenkins/.jenkins/jobs/oxScimClient_4.0_Couchbase/workspace/target/site/apidocs/gluu/scim2/client/rest/provider/class-use/AuthorizationInjectionFilter.html...
Generating /home/jenkins/.jenkins/jobs/oxScimClient_4.0_Couchbase/workspace/target/site/apidocs/gluu/scim2/client/package-use.html...
Generating /home/jenkins/.jenkins/jobs/oxScimClient_4.0_Couchbase/workspace/target/site/apidocs/gluu/scim2/client/exception/package-use.html...
Generating /home/jenkins/.jenkins/jobs/oxScimClient_4.0_Couchbase/workspace/target/site/apidocs/gluu/scim2/client/factory/package-use.html...
Generating /home/jenkins/.jenkins/jobs/oxScimClient_4.0_Couchbase/workspace/target/site/apidocs/gluu/scim2/client/rest/package-use.html...
Generating /home/jenkins/.jenkins/jobs/oxScimClient_4.0_Couchbase/workspace/target/site/apidocs/gluu/scim2/client/rest/provider/package-use.html...
Building index for all the packages and classes...
Generating /home/jenkins/.jenkins/jobs/oxScimClient_4.0_Couchbase/workspace/target/site/apidocs/overview-tree.html...
Generating /home/jenkins/.jenkins/jobs/oxScimClient_4.0_Couchbase/workspace/target/site/apidocs/index-all.html...
Generating /home/jenkins/.jenkins/jobs/oxScimClient_4.0_Couchbase/workspace/target/site/apidocs/deprecated-list.html...
Building index for all classes...
Generating /home/jenkins/.jenkins/jobs/oxScimClient_4.0_Couchbase/workspace/target/site/apidocs/allclasses-frame.html...
Generating /home/jenkins/.jenkins/jobs/oxScimClient_4.0_Couchbase/workspace/target/site/apidocs/allclasses-noframe.html...
Generating /home/jenkins/.jenkins/jobs/oxScimClient_4.0_Couchbase/workspace/target/site/apidocs/index.html...
Generating /home/jenkins/.jenkins/jobs/oxScimClient_4.0_Couchbase/workspace/target/site/apidocs/overview-summary.html...
Generating /home/jenkins/.jenkins/jobs/oxScimClient_4.0_Couchbase/workspace/target/site/apidocs/help-doc.html...
[INFO] 
[INFO] --- maven-resources-plugin:2.6:resources (default-resources) @ scim-client2 ---
[INFO] Using 'UTF-8' encoding to copy filtered resources.
[INFO] Copying 1 resource
[INFO] 
[INFO] --- maven-compiler-plugin:3.1:compile (default-compile) @ scim-client2 ---
[INFO] Nothing to compile - all classes are up to date
[INFO] 
[INFO] --- maven-resources-plugin:2.6:testResources (default-testResources) @ scim-client2 ---
[INFO] Using 'UTF-8' encoding to copy filtered resources.
[INFO] Copying 35 resources
[INFO] 
[INFO] --- maven-compiler-plugin:3.1:testCompile (default-testCompile) @ scim-client2 ---
[INFO] Changes detected - recompiling the module!
[INFO] Compiling 32 source files to /home/jenkins/.jenkins/jobs/oxScimClient_4.0_Couchbase/workspace/target/test-classes
[INFO] 
[INFO] --- maven-surefire-plugin:2.12.4:test (default-test) @ scim-client2 ---
[INFO] Surefire report directory: /home/jenkins/.jenkins/jobs/oxScimClient_4.0_Couchbase/workspace/target/surefire-reports

-------------------------------------------------------
 T E S T S
-------------------------------------------------------
Running TestSuite
14:56:52 INFO  BaseTest.java:43 - Invoked initTestSuite of 'Corner and other weird cases'
14:56:52 INFO  BaseTest.java:71 - Initializing client...
14:56:54 INFO  SchemasTest.java:71 - Found User Schema Extension: GluuUserCustomExtension
14:56:54 INFO  SchemasTest.java:78 - scimCustomFirst found
14:56:54 INFO  SchemasTest.java:84 - scimCustomSecond found
14:56:54 INFO  SchemasTest.java:90 - scimCustomThird found
14:56:54 DEBUG MinimalUserTest.java:29 - Creating mimimal user from json...
14:56:54 DEBUG MinimalGroupTest.java:31 - Creating mimimal group from json...
14:56:54 DEBUG AverageUserTest.java:36 - Creating user from json...
14:56:54 DEBUG FullUserTest.java:36 - Creating user from json...
14:56:54 DEBUG SimpleSearchUserTest.java:33 - Creating user from json...
14:56:54 DEBUG ComplexSearchUserTest.java:68 - Searching at most 3 users using POST verb
14:56:54 DEBUG ComplexSearchUserTest.java:69 - Sorted by family name descending
14:56:54 DEBUG ComplexSearchUserTest.java:70 - Retrieving only the attributes [name.familyName, active]
14:56:54 DEBUG ComplexSearchUserTest.java:154 - Searching at most 3 users using POST verb
14:56:54 DEBUG ComplexSearchUserTest.java:155 - Sorted by displayName ascending
14:56:54 DEBUG ComplexSearchUserTest.java:156 - Excluding the attributes [x509Certificates, entitlements, roles, ims, phoneNumbers, addresses, emails, groups]
14:56:55 DEBUG ComplexSearchUserTest.java:39 - Searching users with attribute nickName existent or ims.value=Skype using POST verb
14:56:55 INFO  GroupAssignUserTest.java:40 - Creating 3 users...
14:56:55 DEBUG QueryParamRetrievalTest.java:34 - Retrieving test users...
14:56:55 DEBUG QueryParamCreateUpdateTest.java:38 - Creating user from json...
14:56:55 DEBUG PatchReplaceUserTest.java:39 - Creating user from json...
14:56:55 DEBUG PatchAddUserTest.java:30 - Creating user from json...
14:56:55 DEBUG PatchDeleteUserTest.java:30 - Creating user from json...
14:56:55 DEBUG PatchUserExtTest.java:40 - Creating user from json...
14:56:55 DEBUG UserBaseTest.java:33 - Deleting user 1569941815431
14:56:55 DEBUG PatchGroupTest.java:47 - Creating group from json...
14:56:55 INFO  UsersBulkTest.java:35 - Sending a bulk with POST, PUT, and PATCH operations...
14:56:55 INFO  GroupsBulkTest.java:40 - Creating one user and one group using bulk json string
14:56:55 INFO  GroupsBulkTest.java:98 - Cleaning...
14:56:56 INFO  AbstractScimClient.java:126 - Closing RestEasy client
Tests run: 110, Failures: 50, Errors: 0, Skipped: 54, Time elapsed: 5.59 sec <<< FAILURE!
createUser(gluu.scim2.client.singleresource.MinimalUserTest)  Time elapsed: 0.043 sec  <<< FAILURE!
gluu.scim2.client.exception.ScimInitializationException
	at gluu.scim2.client.UmaScimClient.authorize(UmaScimClient.java:112)
	at gluu.scim2.client.AbstractScimClient.invoke(AbstractScimClient.java:143)
	at com.sun.proxy.$Proxy45.createUser(Unknown Source)
	at gluu.scim2.client.UserBaseTest.createUserFromJson(UserBaseTest.java:21)
	at gluu.scim2.client.singleresource.MinimalUserTest.createUser(MinimalUserTest.java:30)
Caused by: java.lang.NullPointerException
	at java.util.StringTokenizer.<init>(StringTokenizer.java:199)
	at org.gluu.util.StringHelper.split(StringHelper.java:83)
	at org.gluu.util.StringHelper.split(StringHelper.java:79)
	at gluu.scim2.client.UmaScimClient.authorize(UmaScimClient.java:100)
	... 38 more

delete(gluu.scim2.client.singleresource.MinimalUserTest)  Time elapsed: 0 sec  <<< FAILURE!
java.lang.NullPointerException
	at gluu.scim2.client.UserBaseTest.deleteUser(UserBaseTest.java:33)
	at gluu.scim2.client.singleresource.MinimalUserTest.delete(MinimalUserTest.java:50)

createGroup(gluu.scim2.client.singleresource.MinimalGroupTest)  Time elapsed: 0.032 sec  <<< FAILURE!
gluu.scim2.client.exception.ScimInitializationException
	at gluu.scim2.client.UmaScimClient.authorize(UmaScimClient.java:112)
	at gluu.scim2.client.AbstractScimClient.invoke(AbstractScimClient.java:143)
	at com.sun.proxy.$Proxy45.createGroup(Unknown Source)
	at gluu.scim2.client.singleresource.MinimalGroupTest.createGroup(MinimalGroupTest.java:32)
Caused by: java.lang.NullPointerException
	at java.util.StringTokenizer.<init>(StringTokenizer.java:199)
	at org.gluu.util.StringHelper.split(StringHelper.java:83)
	at org.gluu.util.StringHelper.split(StringHelper.java:79)
	at gluu.scim2.client.UmaScimClient.authorize(UmaScimClient.java:100)
	... 37 more

delete(gluu.scim2.client.singleresource.MinimalGroupTest)  Time elapsed: 0 sec  <<< FAILURE!
java.lang.NullPointerException
	at gluu.scim2.client.singleresource.MinimalGroupTest.delete(MinimalGroupTest.java:59)

create(gluu.scim2.client.singleresource.AverageUserTest)  Time elapsed: 0.017 sec  <<< FAILURE!
gluu.scim2.client.exception.ScimInitializationException
	at gluu.scim2.client.UmaScimClient.authorize(UmaScimClient.java:112)
	at gluu.scim2.client.AbstractScimClient.invoke(AbstractScimClient.java:143)
	at com.sun.proxy.$Proxy45.createUser(Unknown Source)
	at gluu.scim2.client.UserBaseTest.createUserFromJson(UserBaseTest.java:21)
	at gluu.scim2.client.singleresource.AverageUserTest.create(AverageUserTest.java:37)
Caused by: java.lang.NullPointerException
	at java.util.StringTokenizer.<init>(StringTokenizer.java:199)
	at org.gluu.util.StringHelper.split(StringHelper.java:83)
	at org.gluu.util.StringHelper.split(StringHelper.java:79)
	at gluu.scim2.client.UmaScimClient.authorize(UmaScimClient.java:100)
	... 38 more

delete(gluu.scim2.client.singleresource.AverageUserTest)  Time elapsed: 0 sec  <<< FAILURE!
java.lang.NullPointerException
	at gluu.scim2.client.UserBaseTest.deleteUser(UserBaseTest.java:33)
	at gluu.scim2.client.singleresource.AverageUserTest.delete(AverageUserTest.java:126)

createFull(gluu.scim2.client.singleresource.FullUserTest)  Time elapsed: 0.053 sec  <<< FAILURE!
gluu.scim2.client.exception.ScimInitializationException
	at gluu.scim2.client.UmaScimClient.authorize(UmaScimClient.java:112)
	at gluu.scim2.client.AbstractScimClient.invoke(AbstractScimClient.java:143)
	at com.sun.proxy.$Proxy45.createUser(Unknown Source)
	at gluu.scim2.client.UserBaseTest.createUserFromJson(UserBaseTest.java:21)
	at gluu.scim2.client.singleresource.FullUserTest.createFull(FullUserTest.java:37)
Caused by: java.lang.NullPointerException
	at java.util.StringTokenizer.<init>(StringTokenizer.java:199)
	at org.gluu.util.StringHelper.split(StringHelper.java:83)
	at org.gluu.util.StringHelper.split(StringHelper.java:79)
	at gluu.scim2.client.UmaScimClient.authorize(UmaScimClient.java:100)
	... 38 more

delete(gluu.scim2.client.singleresource.FullUserTest)  Time elapsed: 0 sec  <<< FAILURE!
java.lang.NullPointerException
	at gluu.scim2.client.UserBaseTest.deleteUser(UserBaseTest.java:33)
	at gluu.scim2.client.singleresource.FullUserTest.delete(FullUserTest.java:157)

create(gluu.scim2.client.search.SimpleSearchUserTest)  Time elapsed: 0.019 sec  <<< FAILURE!
gluu.scim2.client.exception.ScimInitializationException
	at gluu.scim2.client.UmaScimClient.authorize(UmaScimClient.java:112)
	at gluu.scim2.client.AbstractScimClient.invoke(AbstractScimClient.java:143)
	at com.sun.proxy.$Proxy45.createUser(Unknown Source)
	at gluu.scim2.client.UserBaseTest.createUserFromJson(UserBaseTest.java:21)
	at gluu.scim2.client.search.SimpleSearchUserTest.create(SimpleSearchUserTest.java:34)
Caused by: java.lang.NullPointerException
	at java.util.StringTokenizer.<init>(StringTokenizer.java:199)
	at org.gluu.util.StringHelper.split(StringHelper.java:83)
	at org.gluu.util.StringHelper.split(StringHelper.java:79)
	at gluu.scim2.client.UmaScimClient.authorize(UmaScimClient.java:100)
	... 38 more

searchAttributesParam(gluu.scim2.client.search.ComplexSearchUserTest)  Time elapsed: 0.051 sec  <<< FAILURE!
gluu.scim2.client.exception.ScimInitializationException
	at gluu.scim2.client.UmaScimClient.authorize(UmaScimClient.java:112)
	at gluu.scim2.client.AbstractScimClient.invoke(AbstractScimClient.java:143)
	at com.sun.proxy.$Proxy45.searchUsersPost(Unknown Source)
	at gluu.scim2.client.search.ComplexSearchUserTest.searchAttributesParam(ComplexSearchUserTest.java:80)
Caused by: java.lang.NullPointerException
	at java.util.StringTokenizer.<init>(StringTokenizer.java:199)
	at org.gluu.util.StringHelper.split(StringHelper.java:83)
	at org.gluu.util.StringHelper.split(StringHelper.java:79)
	at gluu.scim2.client.UmaScimClient.authorize(UmaScimClient.java:100)
	... 37 more

searchExcludedAttributesParam(gluu.scim2.client.search.ComplexSearchUserTest)  Time elapsed: 0.055 sec  <<< FAILURE!
gluu.scim2.client.exception.ScimInitializationException
	at gluu.scim2.client.UmaScimClient.authorize(UmaScimClient.java:112)
	at gluu.scim2.client.AbstractScimClient.invoke(AbstractScimClient.java:143)
	at com.sun.proxy.$Proxy45.searchUsersPost(Unknown Source)
	at gluu.scim2.client.search.ComplexSearchUserTest.searchExcludedAttributesParam(ComplexSearchUserTest.java:166)
Caused by: java.lang.NullPointerException
	at java.util.StringTokenizer.<init>(StringTokenizer.java:199)
	at org.gluu.util.StringHelper.split(StringHelper.java:83)
	at org.gluu.util.StringHelper.split(StringHelper.java:79)
	at gluu.scim2.client.UmaScimClient.authorize(UmaScimClient.java:100)
	... 37 more

searchNoAttributesParam(gluu.scim2.client.search.ComplexSearchUserTest)  Time elapsed: 0.032 sec  <<< FAILURE!
gluu.scim2.client.exception.ScimInitializationException
	at gluu.scim2.client.UmaScimClient.authorize(UmaScimClient.java:112)
	at gluu.scim2.client.AbstractScimClient.invoke(AbstractScimClient.java:143)
	at com.sun.proxy.$Proxy45.searchUsersPost(Unknown Source)
	at gluu.scim2.client.search.ComplexSearchUserTest.searchNoAttributesParam(ComplexSearchUserTest.java:43)
Caused by: java.lang.NullPointerException
	at java.util.StringTokenizer.<init>(StringTokenizer.java:199)
	at org.gluu.util.StringHelper.split(StringHelper.java:83)
	at org.gluu.util.StringHelper.split(StringHelper.java:79)
	at gluu.scim2.client.UmaScimClient.authorize(UmaScimClient.java:100)
	... 37 more

searchSortByExternalId(gluu.scim2.client.search.ComplexSearchUserTest)  Time elapsed: 0.038 sec  <<< FAILURE!
gluu.scim2.client.exception.ScimInitializationException
	at gluu.scim2.client.UmaScimClient.authorize(UmaScimClient.java:112)
	at gluu.scim2.client.AbstractScimClient.invoke(AbstractScimClient.java:143)
	at com.sun.proxy.$Proxy45.searchUsers(Unknown Source)
	at gluu.scim2.client.search.ComplexSearchUserTest.searchSortByExternalId(ComplexSearchUserTest.java:249)
Caused by: java.lang.NullPointerException
	at java.util.StringTokenizer.<init>(StringTokenizer.java:199)
	at org.gluu.util.StringHelper.split(StringHelper.java:83)
	at org.gluu.util.StringHelper.split(StringHelper.java:79)
	at gluu.scim2.client.UmaScimClient.authorize(UmaScimClient.java:100)
	... 37 more

search1(gluu.scim2.client.search.PaginationUserSearchTest)  Time elapsed: 0.018 sec  <<< FAILURE!
gluu.scim2.client.exception.ScimInitializationException
	at gluu.scim2.client.UmaScimClient.authorize(UmaScimClient.java:112)
	at gluu.scim2.client.AbstractScimClient.invoke(AbstractScimClient.java:143)
	at com.sun.proxy.$Proxy45.searchUsersPost(Unknown Source)
	at gluu.scim2.client.search.PaginationUserSearchTest.search1(PaginationUserSearchTest.java:41)
Caused by: java.lang.NullPointerException
	at java.util.StringTokenizer.<init>(StringTokenizer.java:199)
	at org.gluu.util.StringHelper.split(StringHelper.java:83)
	at org.gluu.util.StringHelper.split(StringHelper.java:79)
	at gluu.scim2.client.UmaScimClient.authorize(UmaScimClient.java:100)
	... 37 more

delete(gluu.scim2.client.search.SimpleSearchUserTest)  Time elapsed: 0.001 sec  <<< FAILURE!
java.lang.NullPointerException
	at gluu.scim2.client.UserBaseTest.deleteUser(UserBaseTest.java:33)
	at gluu.scim2.client.search.SimpleSearchUserTest.delete(SimpleSearchUserTest.java:141)

createUsers(gluu.scim2.client.multipleresource.GroupAssignUserTest)  Time elapsed: 0.037 sec  <<< FAILURE!
gluu.scim2.client.exception.ScimInitializationException
	at gluu.scim2.client.UmaScimClient.authorize(UmaScimClient.java:112)
	at gluu.scim2.client.AbstractScimClient.invoke(AbstractScimClient.java:143)
	at com.sun.proxy.$Proxy45.createUser(Unknown Source)
	at gluu.scim2.client.multipleresource.GroupAssignUserTest.createUsers(GroupAssignUserTest.java:45)
Caused by: java.lang.NullPointerException
	at java.util.StringTokenizer.<init>(StringTokenizer.java:199)
	at org.gluu.util.StringHelper.split(StringHelper.java:83)
	at org.gluu.util.StringHelper.split(StringHelper.java:79)
	at gluu.scim2.client.UmaScimClient.authorize(UmaScimClient.java:100)
	... 37 more

multipleRetrieval(gluu.scim2.client.singleresource.QueryParamRetrievalTest)  Time elapsed: 0.023 sec  <<< FAILURE!
gluu.scim2.client.exception.ScimInitializationException
	at gluu.scim2.client.UmaScimClient.authorize(UmaScimClient.java:112)
	at gluu.scim2.client.AbstractScimClient.invoke(AbstractScimClient.java:143)
	at com.sun.proxy.$Proxy45.searchUsers(Unknown Source)
	at gluu.scim2.client.singleresource.QueryParamRetrievalTest.multipleRetrieval(QueryParamRetrievalTest.java:37)
Caused by: java.lang.NullPointerException
	at java.util.StringTokenizer.<init>(StringTokenizer.java:199)
	at org.gluu.util.StringHelper.split(StringHelper.java:83)
	at org.gluu.util.StringHelper.split(StringHelper.java:79)
	at gluu.scim2.client.UmaScimClient.authorize(UmaScimClient.java:100)
	... 37 more

create1(gluu.scim2.client.singleresource.QueryParamCreateUpdateTest)  Time elapsed: 0.019 sec  <<< FAILURE!
gluu.scim2.client.exception.ScimInitializationException
	at gluu.scim2.client.UmaScimClient.authorize(UmaScimClient.java:112)
	at gluu.scim2.client.AbstractScimClient.invoke(AbstractScimClient.java:143)
	at com.sun.proxy.$Proxy45.createUser(Unknown Source)
	at gluu.scim2.client.singleresource.QueryParamCreateUpdateTest.create1(QueryParamCreateUpdateTest.java:43)
Caused by: java.lang.NullPointerException
	at java.util.StringTokenizer.<init>(StringTokenizer.java:199)
	at org.gluu.util.StringHelper.split(StringHelper.java:83)
	at org.gluu.util.StringHelper.split(StringHelper.java:79)
	at gluu.scim2.client.UmaScimClient.authorize(UmaScimClient.java:100)
	... 37 more

delete1(gluu.scim2.client.singleresource.QueryParamCreateUpdateTest)  Time elapsed: 0.001 sec  <<< FAILURE!
java.lang.NullPointerException
	at gluu.scim2.client.UserBaseTest.deleteUser(UserBaseTest.java:33)
	at gluu.scim2.client.singleresource.QueryParamCreateUpdateTest.delete1(QueryParamCreateUpdateTest.java:53)

delete(gluu.scim2.client.singleresource.QueryParamCreateUpdateTest)  Time elapsed: 0.001 sec  <<< FAILURE!
java.lang.NullPointerException
	at gluu.scim2.client.UserBaseTest.deleteUser(UserBaseTest.java:33)
	at gluu.scim2.client.singleresource.QueryParamCreateUpdateTest.delete(QueryParamCreateUpdateTest.java:149)

searchJson(gluu.scim2.client.search.MultipleResourcesSearchTest)  Time elapsed: 0.025 sec  <<< FAILURE!
gluu.scim2.client.exception.ScimInitializationException
	at gluu.scim2.client.UmaScimClient.authorize(UmaScimClient.java:112)
	at gluu.scim2.client.AbstractScimClient.invoke(AbstractScimClient.java:143)
	at com.sun.proxy.$Proxy45.searchResourcesPost(Unknown Source)
	at gluu.scim2.client.search.MultipleResourcesSearchTest.searchJson(MultipleResourcesSearchTest.java:31)
Caused by: java.lang.NullPointerException
	at java.util.StringTokenizer.<init>(StringTokenizer.java:199)
	at org.gluu.util.StringHelper.split(StringHelper.java:83)
	at org.gluu.util.StringHelper.split(StringHelper.java:79)
	at gluu.scim2.client.UmaScimClient.authorize(UmaScimClient.java:100)
	... 37 more

createForReplace(gluu.scim2.client.patch.PatchReplaceUserTest)  Time elapsed: 0.029 sec  <<< FAILURE!
gluu.scim2.client.exception.ScimInitializationException
	at gluu.scim2.client.UmaScimClient.authorize(UmaScimClient.java:112)
	at gluu.scim2.client.AbstractScimClient.invoke(AbstractScimClient.java:143)
	at com.sun.proxy.$Proxy45.createUser(Unknown Source)
	at gluu.scim2.client.UserBaseTest.createUserFromJson(UserBaseTest.java:21)
	at gluu.scim2.client.patch.PatchReplaceUserTest.createForReplace(PatchReplaceUserTest.java:40)
Caused by: java.lang.NullPointerException
	at java.util.StringTokenizer.<init>(StringTokenizer.java:199)
	at org.gluu.util.StringHelper.split(StringHelper.java:83)
	at org.gluu.util.StringHelper.split(StringHelper.java:79)
	at gluu.scim2.client.UmaScimClient.authorize(UmaScimClient.java:100)
	... 38 more

delete(gluu.scim2.client.patch.PatchReplaceUserTest)  Time elapsed: 0.002 sec  <<< FAILURE!
java.lang.NullPointerException
	at gluu.scim2.client.UserBaseTest.deleteUser(UserBaseTest.java:33)
	at gluu.scim2.client.patch.PatchReplaceUserTest.delete(PatchReplaceUserTest.java:204)

createForAdd(gluu.scim2.client.patch.PatchAddUserTest)  Time elapsed: 0.023 sec  <<< FAILURE!
gluu.scim2.client.exception.ScimInitializationException
	at gluu.scim2.client.UmaScimClient.authorize(UmaScimClient.java:112)
	at gluu.scim2.client.AbstractScimClient.invoke(AbstractScimClient.java:143)
	at com.sun.proxy.$Proxy45.createUser(Unknown Source)
	at gluu.scim2.client.UserBaseTest.createUserFromJson(UserBaseTest.java:21)
	at gluu.scim2.client.patch.PatchAddUserTest.createForAdd(PatchAddUserTest.java:31)
Caused by: java.lang.NullPointerException
	at java.util.StringTokenizer.<init>(StringTokenizer.java:199)
	at org.gluu.util.StringHelper.split(StringHelper.java:83)
	at org.gluu.util.StringHelper.split(StringHelper.java:79)
	at gluu.scim2.client.UmaScimClient.authorize(UmaScimClient.java:100)
	... 38 more

delete(gluu.scim2.client.patch.PatchAddUserTest)  Time elapsed: 0.001 sec  <<< FAILURE!
java.lang.NullPointerException
	at gluu.scim2.client.UserBaseTest.deleteUser(UserBaseTest.java:33)
	at gluu.scim2.client.patch.PatchAddUserTest.delete(PatchAddUserTest.java:53)

createForDel(gluu.scim2.client.patch.PatchDeleteUserTest)  Time elapsed: 0.032 sec  <<< FAILURE!
gluu.scim2.client.exception.ScimInitializationException
	at gluu.scim2.client.UmaScimClient.authorize(UmaScimClient.java:112)
	at gluu.scim2.client.AbstractScimClient.invoke(AbstractScimClient.java:143)
	at com.sun.proxy.$Proxy45.createUser(Unknown Source)
	at gluu.scim2.client.UserBaseTest.createUserFromJson(UserBaseTest.java:21)
	at gluu.scim2.client.patch.PatchDeleteUserTest.createForDel(PatchDeleteUserTest.java:31)
Caused by: java.lang.NullPointerException
	at java.util.StringTokenizer.<init>(StringTokenizer.java:199)
	at org.gluu.util.StringHelper.split(StringHelper.java:83)
	at org.gluu.util.StringHelper.split(StringHelper.java:79)
	at gluu.scim2.client.UmaScimClient.authorize(UmaScimClient.java:100)
	... 38 more

delete(gluu.scim2.client.patch.PatchDeleteUserTest)  Time elapsed: 0.001 sec  <<< FAILURE!
java.lang.NullPointerException
	at gluu.scim2.client.UserBaseTest.deleteUser(UserBaseTest.java:33)
	at gluu.scim2.client.patch.PatchDeleteUserTest.delete(PatchDeleteUserTest.java:60)

create(gluu.scim2.client.patch.PatchUserExtTest)  Time elapsed: 0.021 sec  <<< FAILURE!
gluu.scim2.client.exception.ScimInitializationException
	at gluu.scim2.client.UmaScimClient.authorize(UmaScimClient.java:112)
	at gluu.scim2.client.AbstractScimClient.invoke(AbstractScimClient.java:143)
	at com.sun.proxy.$Proxy45.createUser(Unknown Source)
	at gluu.scim2.client.UserBaseTest.createUserFromJson(UserBaseTest.java:21)
	at gluu.scim2.client.patch.PatchUserExtTest.create(PatchUserExtTest.java:41)
Caused by: java.lang.NullPointerException
	at java.util.StringTokenizer.<init>(StringTokenizer.java:199)
	at org.gluu.util.StringHelper.split(StringHelper.java:83)
	at org.gluu.util.StringHelper.split(StringHelper.java:79)
	at gluu.scim2.client.UmaScimClient.authorize(UmaScimClient.java:100)
	... 38 more

delete(gluu.scim2.client.patch.PatchUserExtTest)  Time elapsed: 0.001 sec  <<< FAILURE!
java.lang.NullPointerException
	at gluu.scim2.client.UserBaseTest.deleteUser(UserBaseTest.java:33)
	at gluu.scim2.client.patch.PatchUserExtTest.delete(PatchUserExtTest.java:105)

create(gluu.scim2.client.patch.PatchValueFilterUserTest)  Time elapsed: 0.043 sec  <<< FAILURE!
gluu.scim2.client.exception.ScimInitializationException
	at gluu.scim2.client.UmaScimClient.authorize(UmaScimClient.java:112)
	at gluu.scim2.client.AbstractScimClient.invoke(AbstractScimClient.java:143)
	at com.sun.proxy.$Proxy45.createUser(Unknown Source)
	at gluu.scim2.client.patch.PatchValueFilterUserTest.create(PatchValueFilterUserTest.java:37)
Caused by: java.lang.NullPointerException
	at java.util.StringTokenizer.<init>(StringTokenizer.java:199)
	at org.gluu.util.StringHelper.split(StringHelper.java:83)
	at org.gluu.util.StringHelper.split(StringHelper.java:79)
	at gluu.scim2.client.UmaScimClient.authorize(UmaScimClient.java:100)
	... 37 more

delete(gluu.scim2.client.patch.PatchValueFilterUserTest)  Time elapsed: 0.007 sec  <<< FAILURE!
java.lang.reflect.UndeclaredThrowableException
	at com.sun.proxy.$Proxy45.deleteUser(Unknown Source)
	at gluu.scim2.client.UserBaseTest.deleteUser(UserBaseTest.java:34)
	at gluu.scim2.client.patch.PatchValueFilterUserTest.delete(PatchValueFilterUserTest.java:94)
Caused by: java.lang.reflect.InvocationTargetException
	at sun.reflect.NativeMethodAccessorImpl.invoke0(Native Method)
	at sun.reflect.NativeMethodAccessorImpl.invoke(NativeMethodAccessorImpl.java:62)
	at sun.reflect.DelegatingMethodAccessorImpl.invoke(DelegatingMethodAccessorImpl.java:43)
	at java.lang.reflect.Method.invoke(Method.java:498)
	at gluu.scim2.client.AbstractScimClient.invokeServiceMethod(AbstractScimClient.java:99)
	at gluu.scim2.client.AbstractScimClient.invoke(AbstractScimClient.java:140)
	... 37 more
Caused by: java.lang.NullPointerException: RESTEASY004670: value was null
	at org.jboss.resteasy.client.jaxrs.internal.ClientWebTarget.resolveTemplate(ClientWebTarget.java:186)
	at org.jboss.resteasy.client.jaxrs.internal.ClientWebTarget.resolveTemplate(ClientWebTarget.java:25)
	at org.jboss.resteasy.client.jaxrs.internal.proxy.processors.webtarget.PathParamProcessor.build(PathParamProcessor.java:31)
	at org.jboss.resteasy.client.jaxrs.internal.proxy.ClientInvoker.createRequest(ClientInvoker.java:115)
	at org.jboss.resteasy.client.jaxrs.internal.proxy.ClientInvoker.invoke(ClientInvoker.java:101)
	at org.jboss.resteasy.client.jaxrs.internal.proxy.ClientProxy.invoke(ClientProxy.java:76)
	at com.sun.proxy.$Proxy44.deleteUser(Unknown Source)
	... 43 more

createGroup(gluu.scim2.client.patch.PatchGroupTest)  Time elapsed: 0.022 sec  <<< FAILURE!
gluu.scim2.client.exception.ScimInitializationException
	at gluu.scim2.client.UmaScimClient.authorize(UmaScimClient.java:112)
	at gluu.scim2.client.AbstractScimClient.invoke(AbstractScimClient.java:143)
	at com.sun.proxy.$Proxy45.createGroup(Unknown Source)
	at gluu.scim2.client.patch.PatchGroupTest.createGroup(PatchGroupTest.java:48)
Caused by: java.lang.NullPointerException
	at java.util.StringTokenizer.<init>(StringTokenizer.java:199)
	at org.gluu.util.StringHelper.split(StringHelper.java:83)
	at org.gluu.util.StringHelper.split(StringHelper.java:79)
	at gluu.scim2.client.UmaScimClient.authorize(UmaScimClient.java:100)
	... 37 more

delete(gluu.scim2.client.patch.PatchGroupTest)  Time elapsed: 0 sec  <<< FAILURE!
java.lang.NullPointerException
	at gluu.scim2.client.patch.PatchGroupTest.delete(PatchGroupTest.java:151)

bulkJson1(gluu.scim2.client.bulk.UsersBulkTest)  Time elapsed: 0.021 sec  <<< FAILURE!
gluu.scim2.client.exception.ScimInitializationException
	at gluu.scim2.client.UmaScimClient.authorize(UmaScimClient.java:112)
	at gluu.scim2.client.AbstractScimClient.invoke(AbstractScimClient.java:143)
	at com.sun.proxy.$Proxy45.processBulkOperations(Unknown Source)
	at gluu.scim2.client.bulk.UsersBulkTest.bulkJson1(UsersBulkTest.java:36)
Caused by: java.lang.NullPointerException
	at java.util.StringTokenizer.<init>(StringTokenizer.java:199)
	at org.gluu.util.StringHelper.split(StringHelper.java:83)
	at org.gluu.util.StringHelper.split(StringHelper.java:79)
	at gluu.scim2.client.UmaScimClient.authorize(UmaScimClient.java:100)
	... 37 more

bulkJson(gluu.scim2.client.bulk.GroupsBulkTest)  Time elapsed: 0.017 sec  <<< FAILURE!
gluu.scim2.client.exception.ScimInitializationException
	at gluu.scim2.client.UmaScimClient.authorize(UmaScimClient.java:112)
	at gluu.scim2.client.AbstractScimClient.invoke(AbstractScimClient.java:143)
	at com.sun.proxy.$Proxy45.processBulkOperations(Unknown Source)
	at gluu.scim2.client.bulk.GroupsBulkTest.bulkJson(GroupsBulkTest.java:42)
Caused by: java.lang.NullPointerException
	at java.util.StringTokenizer.<init>(StringTokenizer.java:199)
	at org.gluu.util.StringHelper.split(StringHelper.java:83)
	at org.gluu.util.StringHelper.split(StringHelper.java:79)
	at gluu.scim2.client.UmaScimClient.authorize(UmaScimClient.java:100)
	... 37 more

delete(gluu.scim2.client.bulk.GroupsBulkTest)  Time elapsed: 0.033 sec  <<< FAILURE!
gluu.scim2.client.exception.ScimInitializationException
	at gluu.scim2.client.UmaScimClient.authorize(UmaScimClient.java:112)
	at gluu.scim2.client.AbstractScimClient.invoke(AbstractScimClient.java:143)
	at com.sun.proxy.$Proxy45.processBulkOperations(Unknown Source)
	at gluu.scim2.client.bulk.GroupsBulkTest.delete(GroupsBulkTest.java:117)
Caused by: java.lang.NullPointerException
	at java.util.StringTokenizer.<init>(StringTokenizer.java:199)
	at org.gluu.util.StringHelper.split(StringHelper.java:83)
	at org.gluu.util.StringHelper.split(StringHelper.java:79)
	at gluu.scim2.client.UmaScimClient.authorize(UmaScimClient.java:100)
	... 37 more

createWrongCustAttrs1(gluu.scim2.client.corner.WrongPayloadUserExtTest)  Time elapsed: 0.022 sec  <<< FAILURE!
gluu.scim2.client.exception.ScimInitializationException
	at gluu.scim2.client.UmaScimClient.authorize(UmaScimClient.java:112)
	at gluu.scim2.client.AbstractScimClient.invoke(AbstractScimClient.java:143)
	at com.sun.proxy.$Proxy45.createUser(Unknown Source)
	at gluu.scim2.client.corner.WrongPayloadUserExtTest.createWrongCustAttrs1(WrongPayloadUserExtTest.java:26)
Caused by: java.lang.NullPointerException
	at java.util.StringTokenizer.<init>(StringTokenizer.java:199)
	at org.gluu.util.StringHelper.split(StringHelper.java:83)
	at org.gluu.util.StringHelper.split(StringHelper.java:79)
	at gluu.scim2.client.UmaScimClient.authorize(UmaScimClient.java:100)
	... 37 more

createWrongCustAttrs2(gluu.scim2.client.corner.WrongPayloadUserExtTest)  Time elapsed: 0.022 sec  <<< FAILURE!
gluu.scim2.client.exception.ScimInitializationException
	at gluu.scim2.client.UmaScimClient.authorize(UmaScimClient.java:112)
	at gluu.scim2.client.AbstractScimClient.invoke(AbstractScimClient.java:143)
	at com.sun.proxy.$Proxy45.createUser(Unknown Source)
	at gluu.scim2.client.corner.WrongPayloadUserExtTest.createWrongCustAttrs2(WrongPayloadUserExtTest.java:33)
Caused by: java.lang.NullPointerException
	at java.util.StringTokenizer.<init>(StringTokenizer.java:199)
	at org.gluu.util.StringHelper.split(StringHelper.java:83)
	at org.gluu.util.StringHelper.split(StringHelper.java:79)
	at gluu.scim2.client.UmaScimClient.authorize(UmaScimClient.java:100)
	... 37 more

createWrongCustAttrs3(gluu.scim2.client.corner.WrongPayloadUserExtTest)  Time elapsed: 0.03 sec  <<< FAILURE!
gluu.scim2.client.exception.ScimInitializationException
	at gluu.scim2.client.UmaScimClient.authorize(UmaScimClient.java:112)
	at gluu.scim2.client.AbstractScimClient.invoke(AbstractScimClient.java:143)
	at com.sun.proxy.$Proxy45.createUser(Unknown Source)
	at gluu.scim2.client.corner.WrongPayloadUserExtTest.createWrongCustAttrs3(WrongPayloadUserExtTest.java:40)
Caused by: java.lang.NullPointerException
	at java.util.StringTokenizer.<init>(StringTokenizer.java:199)
	at org.gluu.util.StringHelper.split(StringHelper.java:83)
	at org.gluu.util.StringHelper.split(StringHelper.java:79)
	at gluu.scim2.client.UmaScimClient.authorize(UmaScimClient.java:100)
	... 37 more

createWrongCustAttrs4(gluu.scim2.client.corner.WrongPayloadUserExtTest)  Time elapsed: 0.028 sec  <<< FAILURE!
gluu.scim2.client.exception.ScimInitializationException
	at gluu.scim2.client.UmaScimClient.authorize(UmaScimClient.java:112)
	at gluu.scim2.client.AbstractScimClient.invoke(AbstractScimClient.java:143)
	at com.sun.proxy.$Proxy45.createUser(Unknown Source)
	at gluu.scim2.client.corner.WrongPayloadUserExtTest.createWrongCustAttrs4(WrongPayloadUserExtTest.java:47)
Caused by: java.lang.NullPointerException
	at java.util.StringTokenizer.<init>(StringTokenizer.java:199)
	at org.gluu.util.StringHelper.split(StringHelper.java:83)
	at org.gluu.util.StringHelper.split(StringHelper.java:79)
	at gluu.scim2.client.UmaScimClient.authorize(UmaScimClient.java:100)
	... 37 more

createWrongCustAttrs5(gluu.scim2.client.corner.WrongPayloadUserExtTest)  Time elapsed: 0.028 sec  <<< FAILURE!
gluu.scim2.client.exception.ScimInitializationException
	at gluu.scim2.client.UmaScimClient.authorize(UmaScimClient.java:112)
	at gluu.scim2.client.AbstractScimClient.invoke(AbstractScimClient.java:143)
	at com.sun.proxy.$Proxy45.createUser(Unknown Source)
	at gluu.scim2.client.corner.WrongPayloadUserExtTest.createWrongCustAttrs5(WrongPayloadUserExtTest.java:54)
Caused by: java.lang.NullPointerException
	at java.util.StringTokenizer.<init>(StringTokenizer.java:199)
	at org.gluu.util.StringHelper.split(StringHelper.java:83)
	at org.gluu.util.StringHelper.split(StringHelper.java:79)
	at gluu.scim2.client.UmaScimClient.authorize(UmaScimClient.java:100)
	... 37 more

createWrongCustAttrs6(gluu.scim2.client.corner.WrongPayloadUserExtTest)  Time elapsed: 0.027 sec  <<< FAILURE!
gluu.scim2.client.exception.ScimInitializationException
	at gluu.scim2.client.UmaScimClient.authorize(UmaScimClient.java:112)
	at gluu.scim2.client.AbstractScimClient.invoke(AbstractScimClient.java:143)
	at com.sun.proxy.$Proxy45.createUser(Unknown Source)
	at gluu.scim2.client.corner.WrongPayloadUserExtTest.createWrongCustAttrs6(WrongPayloadUserExtTest.java:61)
Caused by: java.lang.NullPointerException
	at java.util.StringTokenizer.<init>(StringTokenizer.java:199)
	at org.gluu.util.StringHelper.split(StringHelper.java:83)
	at org.gluu.util.StringHelper.split(StringHelper.java:79)
	at gluu.scim2.client.UmaScimClient.authorize(UmaScimClient.java:100)
	... 37 more

createWrongAttrs1(gluu.scim2.client.corner.WrongPayloadUserTest)  Time elapsed: 0.025 sec  <<< FAILURE!
gluu.scim2.client.exception.ScimInitializationException
	at gluu.scim2.client.UmaScimClient.authorize(UmaScimClient.java:112)
	at gluu.scim2.client.AbstractScimClient.invoke(AbstractScimClient.java:143)
	at com.sun.proxy.$Proxy45.createUser(Unknown Source)
	at gluu.scim2.client.corner.WrongPayloadUserTest.createWrongAttrs1(WrongPayloadUserTest.java:28)
Caused by: java.lang.NullPointerException
	at java.util.StringTokenizer.<init>(StringTokenizer.java:199)
	at org.gluu.util.StringHelper.split(StringHelper.java:83)
	at org.gluu.util.StringHelper.split(StringHelper.java:79)
	at gluu.scim2.client.UmaScimClient.authorize(UmaScimClient.java:100)
	... 37 more

createWrongAttrs2(gluu.scim2.client.corner.WrongPayloadUserTest)  Time elapsed: 0.031 sec  <<< FAILURE!
gluu.scim2.client.exception.ScimInitializationException
	at gluu.scim2.client.UmaScimClient.authorize(UmaScimClient.java:112)
	at gluu.scim2.client.AbstractScimClient.invoke(AbstractScimClient.java:143)
	at com.sun.proxy.$Proxy45.createUser(Unknown Source)
	at gluu.scim2.client.corner.WrongPayloadUserTest.createWrongAttrs2(WrongPayloadUserTest.java:35)
Caused by: java.lang.NullPointerException
	at java.util.StringTokenizer.<init>(StringTokenizer.java:199)
	at org.gluu.util.StringHelper.split(StringHelper.java:83)
	at org.gluu.util.StringHelper.split(StringHelper.java:79)
	at gluu.scim2.client.UmaScimClient.authorize(UmaScimClient.java:100)
	... 37 more

createWrongAttrs3(gluu.scim2.client.corner.WrongPayloadUserTest)  Time elapsed: 0.03 sec  <<< FAILURE!
gluu.scim2.client.exception.ScimInitializationException
	at gluu.scim2.client.UmaScimClient.authorize(UmaScimClient.java:112)
	at gluu.scim2.client.AbstractScimClient.invoke(AbstractScimClient.java:143)
	at com.sun.proxy.$Proxy45.createUser(Unknown Source)
	at gluu.scim2.client.corner.WrongPayloadUserTest.createWrongAttrs3(WrongPayloadUserTest.java:42)
Caused by: java.lang.NullPointerException
	at java.util.StringTokenizer.<init>(StringTokenizer.java:199)
	at org.gluu.util.StringHelper.split(StringHelper.java:83)
	at org.gluu.util.StringHelper.split(StringHelper.java:79)
	at gluu.scim2.client.UmaScimClient.authorize(UmaScimClient.java:100)
	... 37 more

queryAndRemoval(gluu.scim2.client.corner.PairwiseIdentifiersTest)  Time elapsed: 0.019 sec  <<< FAILURE!
gluu.scim2.client.exception.ScimInitializationException
	at gluu.scim2.client.UmaScimClient.authorize(UmaScimClient.java:112)
	at gluu.scim2.client.AbstractScimClient.invoke(AbstractScimClient.java:143)
	at com.sun.proxy.$Proxy45.searchUsers(Unknown Source)
	at gluu.scim2.client.corner.PairwiseIdentifiersTest.queryAndRemoval(PairwiseIdentifiersTest.java:32)
Caused by: java.lang.NullPointerException
	at java.util.StringTokenizer.<init>(StringTokenizer.java:199)
	at org.gluu.util.StringHelper.split(StringHelper.java:83)
	at org.gluu.util.StringHelper.split(StringHelper.java:79)
	at gluu.scim2.client.UmaScimClient.authorize(UmaScimClient.java:100)
	... 37 more

containabilityAll(gluu.scim2.client.corner.SpecialCharsTest)  Time elapsed: 0.019 sec  <<< FAILURE!
gluu.scim2.client.exception.ScimInitializationException
	at gluu.scim2.client.UmaScimClient.authorize(UmaScimClient.java:112)
	at gluu.scim2.client.AbstractScimClient.invoke(AbstractScimClient.java:143)
	at com.sun.proxy.$Proxy45.searchUsersPost(Unknown Source)
	at gluu.scim2.client.corner.SpecialCharsTest.containabilityAll(SpecialCharsTest.java:72)
Caused by: java.lang.NullPointerException
	at java.util.StringTokenizer.<init>(StringTokenizer.java:199)
	at org.gluu.util.StringHelper.split(StringHelper.java:83)
	at org.gluu.util.StringHelper.split(StringHelper.java:79)
	at gluu.scim2.client.UmaScimClient.authorize(UmaScimClient.java:100)
	... 37 more

containabilityAllInGivenName(gluu.scim2.client.corner.SpecialCharsTest)  Time elapsed: 0.02 sec  <<< FAILURE!
gluu.scim2.client.exception.ScimInitializationException
	at gluu.scim2.client.UmaScimClient.authorize(UmaScimClient.java:112)
	at gluu.scim2.client.AbstractScimClient.invoke(AbstractScimClient.java:143)
	at com.sun.proxy.$Proxy45.searchUsersPost(Unknown Source)
	at gluu.scim2.client.corner.SpecialCharsTest.containabilityAllInGivenName(SpecialCharsTest.java:93)
Caused by: java.lang.NullPointerException
	at java.util.StringTokenizer.<init>(StringTokenizer.java:199)
	at org.gluu.util.StringHelper.split(StringHelper.java:83)
	at org.gluu.util.StringHelper.split(StringHelper.java:79)
	at gluu.scim2.client.UmaScimClient.authorize(UmaScimClient.java:100)
	... 37 more

containabilityAny(gluu.scim2.client.corner.SpecialCharsTest)  Time elapsed: 0.03 sec  <<< FAILURE!
gluu.scim2.client.exception.ScimInitializationException
	at gluu.scim2.client.UmaScimClient.authorize(UmaScimClient.java:112)
	at gluu.scim2.client.AbstractScimClient.invoke(AbstractScimClient.java:143)
	at com.sun.proxy.$Proxy45.searchUsersPost(Unknown Source)
	at gluu.scim2.client.corner.SpecialCharsTest.containabilityAny(SpecialCharsTest.java:49)
Caused by: java.lang.NullPointerException
	at java.util.StringTokenizer.<init>(StringTokenizer.java:199)
	at org.gluu.util.StringHelper.split(StringHelper.java:83)
	at org.gluu.util.StringHelper.split(StringHelper.java:79)
	at gluu.scim2.client.UmaScimClient.authorize(UmaScimClient.java:100)
	... 37 more

delete(gluu.scim2.client.corner.WrongPayloadUserTest)  Time elapsed: 0.001 sec  <<< FAILURE!
java.lang.NullPointerException
	at gluu.scim2.client.UserBaseTest.deleteUser(UserBaseTest.java:33)
	at gluu.scim2.client.corner.WrongPayloadUserTest.delete(WrongPayloadUserTest.java:62)


Results :

Failed tests:   createUser(gluu.scim2.client.singleresource.MinimalUserTest)
  delete(gluu.scim2.client.singleresource.MinimalUserTest)
  createGroup(gluu.scim2.client.singleresource.MinimalGroupTest)
  delete(gluu.scim2.client.singleresource.MinimalGroupTest)
  create(gluu.scim2.client.singleresource.AverageUserTest)
  delete(gluu.scim2.client.singleresource.AverageUserTest)
  createFull(gluu.scim2.client.singleresource.FullUserTest)
  delete(gluu.scim2.client.singleresource.FullUserTest)
  create(gluu.scim2.client.search.SimpleSearchUserTest)
  searchAttributesParam(gluu.scim2.client.search.ComplexSearchUserTest)
  searchExcludedAttributesParam(gluu.scim2.client.search.ComplexSearchUserTest)
  searchNoAttributesParam(gluu.scim2.client.search.ComplexSearchUserTest)
  searchSortByExternalId(gluu.scim2.client.search.ComplexSearchUserTest)
  search1(gluu.scim2.client.search.PaginationUserSearchTest)
  delete(gluu.scim2.client.search.SimpleSearchUserTest)
  createUsers(gluu.scim2.client.multipleresource.GroupAssignUserTest)
  multipleRetrieval(gluu.scim2.client.singleresource.QueryParamRetrievalTest)
  create1(gluu.scim2.client.singleresource.QueryParamCreateUpdateTest)
  delete1(gluu.scim2.client.singleresource.QueryParamCreateUpdateTest)
  delete(gluu.scim2.client.singleresource.QueryParamCreateUpdateTest)
  searchJson(gluu.scim2.client.search.MultipleResourcesSearchTest)
  createForReplace(gluu.scim2.client.patch.PatchReplaceUserTest)
  delete(gluu.scim2.client.patch.PatchReplaceUserTest)
  createForAdd(gluu.scim2.client.patch.PatchAddUserTest)
  delete(gluu.scim2.client.patch.PatchAddUserTest)
  createForDel(gluu.scim2.client.patch.PatchDeleteUserTest)
  delete(gluu.scim2.client.patch.PatchDeleteUserTest)
  create(gluu.scim2.client.patch.PatchUserExtTest)
  delete(gluu.scim2.client.patch.PatchUserExtTest)
  create(gluu.scim2.client.patch.PatchValueFilterUserTest)
  delete(gluu.scim2.client.patch.PatchValueFilterUserTest)
  createGroup(gluu.scim2.client.patch.PatchGroupTest)
  delete(gluu.scim2.client.patch.PatchGroupTest)
  bulkJson1(gluu.scim2.client.bulk.UsersBulkTest)
  bulkJson(gluu.scim2.client.bulk.GroupsBulkTest)
  delete(gluu.scim2.client.bulk.GroupsBulkTest)
  createWrongCustAttrs1(gluu.scim2.client.corner.WrongPayloadUserExtTest)
  createWrongCustAttrs2(gluu.scim2.client.corner.WrongPayloadUserExtTest)
  createWrongCustAttrs3(gluu.scim2.client.corner.WrongPayloadUserExtTest)
  createWrongCustAttrs4(gluu.scim2.client.corner.WrongPayloadUserExtTest)
  createWrongCustAttrs5(gluu.scim2.client.corner.WrongPayloadUserExtTest)
  createWrongCustAttrs6(gluu.scim2.client.corner.WrongPayloadUserExtTest)
  createWrongAttrs1(gluu.scim2.client.corner.WrongPayloadUserTest)
  createWrongAttrs2(gluu.scim2.client.corner.WrongPayloadUserTest)
  createWrongAttrs3(gluu.scim2.client.corner.WrongPayloadUserTest)
  queryAndRemoval(gluu.scim2.client.corner.PairwiseIdentifiersTest)
  containabilityAll(gluu.scim2.client.corner.SpecialCharsTest)
  containabilityAllInGivenName(gluu.scim2.client.corner.SpecialCharsTest)
  containabilityAny(gluu.scim2.client.corner.SpecialCharsTest)
  delete(gluu.scim2.client.corner.WrongPayloadUserTest)

Tests run: 110, Failures: 50, Errors: 0, Skipped: 54

[INFO] ------------------------------------------------------------------------
[INFO] BUILD FAILURE
[INFO] ------------------------------------------------------------------------
[INFO] Total time: 16.200 s
[INFO] Finished at: 2019-10-01T14:56:56+00:00
[INFO] Final Memory: 35M/515M
[INFO] ------------------------------------------------------------------------
[ERROR] Failed to execute goal org.apache.maven.plugins:maven-surefire-plugin:2.12.4:test (default-test) on project scim-client2: There are test failures.
[ERROR] 
[ERROR] Please refer to /home/jenkins/.jenkins/jobs/oxScimClient_4.0_Couchbase/workspace/target/surefire-reports for the individual test results.
[ERROR] -> [Help 1]
[ERROR] 
[ERROR] To see the full stack trace of the errors, re-run Maven with the -e switch.
[ERROR] Re-run Maven using the -X switch to enable full debug logging.
[ERROR] 
[ERROR] For more information about the errors and possible solutions, please read the following articles:
[ERROR] [Help 1] http://cwiki.apache.org/confluence/display/MAVEN/MojoFailureException
Build step 'Invoke top-level Maven targets' marked build as failure
[FINDBUGS] Skipping publisher since build result is FAILURE
Publishing Javadoc
TestNG Reports Processing: START
Looking for TestNG results report in workspace using pattern: **/testng-results.xml
Saving reports...
Processing '/home/jenkins/.jenkins/jobs/oxScimClient_4.0_Couchbase/builds/1/testng/testng-results.xml'
45.454544% of tests failed, which exceeded threshold of 0%. Marking build as UNSTABLE
TestNG Reports Processing: FINISH
Sending e-mails to: support@gluu.org
Finished: FAILURE