FailedConsole Output

Started by an SCM change
Running as SYSTEM
Building on master in workspace /home/jenkins/.jenkins/jobs/oxEleven/workspace
The recommended git tool is: NONE
No credentials specified
 > git rev-parse --is-inside-work-tree # timeout=10
Fetching changes from the remote Git repository
 > git config remote.origin.url https://github.com/GluuFederation/oxEleven # timeout=10
Fetching upstream changes from https://github.com/GluuFederation/oxEleven
 > git --version # timeout=10
 > git --version # 'git version 1.8.3.1'
 > git fetch --tags --progress https://github.com/GluuFederation/oxEleven +refs/heads/*:refs/remotes/origin/* # timeout=10
 > git rev-parse refs/remotes/origin/master^{commit} # timeout=10
 > git rev-parse refs/remotes/origin/origin/master^{commit} # timeout=10
Checking out Revision e6b45be3b3140288ea17113a368439b440ba79c9 (refs/remotes/origin/master)
 > git config core.sparsecheckout # timeout=10
 > git checkout -f e6b45be3b3140288ea17113a368439b440ba79c9 # timeout=10
Commit message: "chore: add missing dependecy"
 > git rev-list --no-walk fc1cb624aa7050b41e4d5a424b416a0d6e1725c8 # timeout=10
[workspace] $ /home/jenkins/.jenkins/tools/hudson.tasks.Maven_MavenInstallation/maven_3.3.9/bin/mvn -DVERSION_NAME=master -DMAVEN_SKIP_TESTS=false -Dcfg=$PROFILE_NAME -Dmaven.test.skip=false clean compile install site
[INFO] Scanning for projects...
Downloading: https://repo2.maven.org/maven2/org/bouncycastle/org/gluu/gluu-core-bom/4.3.1-SNAPSHOT/maven-metadata.xml

[WARNING] Could not transfer metadata org.gluu:gluu-core-bom:4.3.1-SNAPSHOT/maven-metadata.xml from/to bouncycastle (https://repo2.maven.org/maven2/org/bouncycastle): repo2.maven.org: Name or service not known
[INFO] ------------------------------------------------------------------------
[INFO] Reactor Build Order:
[INFO] 
[INFO] oxEleven
[INFO] oxEleven Model
[INFO] oxEleven Server
[INFO] oxEleven Client
[INFO]                                                                         
[INFO] ------------------------------------------------------------------------
[INFO] Building oxEleven 4.3.1-SNAPSHOT
[INFO] ------------------------------------------------------------------------
[INFO] 
[INFO] --- maven-clean-plugin:2.5:clean (default-clean) @ oxeleven ---
[INFO] Deleting /home/jenkins/.jenkins/jobs/oxEleven/workspace/target
[INFO] 
[INFO] --- maven-install-plugin:2.3.1:install (default-install) @ oxeleven ---
[INFO] Installing /home/jenkins/.jenkins/jobs/oxEleven/workspace/pom.xml to /var/www/html/maven/org/gluu/oxeleven/4.3.1-SNAPSHOT/oxeleven-4.3.1-SNAPSHOT.pom
[INFO] 
[INFO] --- maven-site-plugin:2.1.1:site (default-site) @ oxeleven ---
Downloading: https://repo2.maven.org/maven2/org/bouncycastle/org/apache/maven/skins/maven-default-skin/maven-metadata.xml

[WARNING] Could not transfer metadata org.apache.maven.skins:maven-default-skin/maven-metadata.xml from/to bouncycastle (https://repo2.maven.org/maven2/org/bouncycastle): repo2.maven.org
[INFO]                                                                         
[INFO] ------------------------------------------------------------------------
[INFO] Building oxEleven Model 4.3.1-SNAPSHOT
[INFO] ------------------------------------------------------------------------
[INFO] 
[INFO] --- maven-clean-plugin:2.5:clean (default-clean) @ oxeleven-model ---
[INFO] Deleting /home/jenkins/.jenkins/jobs/oxEleven/workspace/Model/target
[INFO] 
[INFO] --- maven-resources-plugin:2.6:resources (default-resources) @ oxeleven-model ---
[INFO] Using 'UTF-8' encoding to copy filtered resources.
[INFO] skip non existing resourceDirectory /home/jenkins/.jenkins/jobs/oxEleven/workspace/Model/src/main/resources
[INFO] 
[INFO] --- maven-compiler-plugin:2.3.2:compile (default-compile) @ oxeleven-model ---
[INFO] Compiling 12 source files to /home/jenkins/.jenkins/jobs/oxEleven/workspace/Model/target/classes
[INFO] 
[INFO] --- maven-resources-plugin:2.6:resources (default-resources) @ oxeleven-model ---
[INFO] Using 'UTF-8' encoding to copy filtered resources.
[INFO] skip non existing resourceDirectory /home/jenkins/.jenkins/jobs/oxEleven/workspace/Model/src/main/resources
[INFO] 
[INFO] --- maven-compiler-plugin:2.3.2:compile (default-compile) @ oxeleven-model ---
[INFO] Nothing to compile - all classes are up to date
[INFO] 
[INFO] --- maven-resources-plugin:2.6:testResources (default-testResources) @ oxeleven-model ---
[INFO] Using 'UTF-8' encoding to copy filtered resources.
[INFO] skip non existing resourceDirectory /home/jenkins/.jenkins/jobs/oxEleven/workspace/Model/src/test/resources
[INFO] 
[INFO] --- maven-compiler-plugin:2.3.2:testCompile (default-testCompile) @ oxeleven-model ---
[INFO] No sources to compile
[INFO] 
[INFO] --- maven-surefire-plugin:2.12.4:test (default-test) @ oxeleven-model ---
[INFO] No tests to run.
[INFO] 
[INFO] --- maven-jar-plugin:2.4:jar (default-jar) @ oxeleven-model ---
[INFO] Building jar: /home/jenkins/.jenkins/jobs/oxEleven/workspace/Model/target/oxeleven-model-4.3.1-SNAPSHOT.jar
[INFO] 
[INFO] --- maven-jar-plugin:2.4:test-jar (default) @ oxeleven-model ---
[WARNING] JAR will be empty - no content was marked for inclusion!
[INFO] Building jar: /home/jenkins/.jenkins/jobs/oxEleven/workspace/Model/target/oxeleven-model-4.3.1-SNAPSHOT-tests.jar
[INFO] 
[INFO] --- maven-install-plugin:2.3.1:install (default-install) @ oxeleven-model ---
[INFO] Installing /home/jenkins/.jenkins/jobs/oxEleven/workspace/Model/target/oxeleven-model-4.3.1-SNAPSHOT.jar to /var/www/html/maven/org/gluu/oxeleven-model/4.3.1-SNAPSHOT/oxeleven-model-4.3.1-SNAPSHOT.jar
[INFO] Installing /home/jenkins/.jenkins/jobs/oxEleven/workspace/Model/pom.xml to /var/www/html/maven/org/gluu/oxeleven-model/4.3.1-SNAPSHOT/oxeleven-model-4.3.1-SNAPSHOT.pom
[INFO] Installing /home/jenkins/.jenkins/jobs/oxEleven/workspace/Model/target/oxeleven-model-4.3.1-SNAPSHOT-tests.jar to /var/www/html/maven/org/gluu/oxeleven-model/4.3.1-SNAPSHOT/oxeleven-model-4.3.1-SNAPSHOT-tests.jar
[INFO] 
[INFO] --- maven-site-plugin:2.1.1:site (default-site) @ oxeleven-model ---
[INFO]                                                                         
[INFO] ------------------------------------------------------------------------
[INFO] Building oxEleven Server 4.3.1-SNAPSHOT
[INFO] ------------------------------------------------------------------------
[INFO] 
[INFO] --- maven-clean-plugin:2.5:clean (default-clean) @ oxeleven-server ---
[INFO] Deleting /home/jenkins/.jenkins/jobs/oxEleven/workspace/Server/target
[INFO] 
[INFO] --- maven-resources-plugin:2.6:resources (default-resources) @ oxeleven-server ---
[INFO] Using 'UTF-8' encoding to copy filtered resources.
[INFO] Copying 2 resources
[INFO] 
[INFO] --- maven-compiler-plugin:2.3.2:compile (default-compile) @ oxeleven-server ---
[INFO] Compiling 20 source files to /home/jenkins/.jenkins/jobs/oxEleven/workspace/Server/target/classes
[WARNING] /home/jenkins/.jenkins/jobs/oxEleven/workspace/Server/src/main/java/org/gluu/oxeleven/service/PKCS11Service.java:[68,23] RSAPublicKeyImpl is internal proprietary API and may be removed in a future release
[WARNING] /home/jenkins/.jenkins/jobs/oxEleven/workspace/Server/src/main/java/org/gluu/oxeleven/rest/GenerateKeyRestServiceImpl.java:[50,23] RSAPublicKeyImpl is internal proprietary API and may be removed in a future release
[WARNING] /home/jenkins/.jenkins/jobs/oxEleven/workspace/Server/src/main/java/org/gluu/oxeleven/service/PKCS11Service.java:[68,23] RSAPublicKeyImpl is internal proprietary API and may be removed in a future release
[WARNING] /home/jenkins/.jenkins/jobs/oxEleven/workspace/Server/src/main/java/org/gluu/oxeleven/rest/GenerateKeyRestServiceImpl.java:[50,23] RSAPublicKeyImpl is internal proprietary API and may be removed in a future release
[WARNING] /home/jenkins/.jenkins/jobs/oxEleven/workspace/Server/src/main/java/org/gluu/oxeleven/service/PKCS11Service.java:[68,23] RSAPublicKeyImpl is internal proprietary API and may be removed in a future release
[WARNING] /home/jenkins/.jenkins/jobs/oxEleven/workspace/Server/src/main/java/org/gluu/oxeleven/rest/GenerateKeyRestServiceImpl.java:[50,23] RSAPublicKeyImpl is internal proprietary API and may be removed in a future release
[WARNING] /home/jenkins/.jenkins/jobs/oxEleven/workspace/Server/src/main/java/org/gluu/oxeleven/service/PKCS11Service.java:[237,40] RSAPublicKeyImpl is internal proprietary API and may be removed in a future release
[WARNING] /home/jenkins/.jenkins/jobs/oxEleven/workspace/Server/src/main/java/org/gluu/oxeleven/rest/GenerateKeyRestServiceImpl.java:[105,20] RSAPublicKeyImpl is internal proprietary API and may be removed in a future release
[WARNING] /home/jenkins/.jenkins/jobs/oxEleven/workspace/Server/src/main/java/org/gluu/oxeleven/rest/GenerateKeyRestServiceImpl.java:[105,53] RSAPublicKeyImpl is internal proprietary API and may be removed in a future release
[INFO] 
[INFO] --- maven-resources-plugin:2.6:resources (default-resources) @ oxeleven-server ---
[INFO] Using 'UTF-8' encoding to copy filtered resources.
[INFO] Copying 2 resources
[INFO] 
[INFO] --- maven-compiler-plugin:2.3.2:compile (default-compile) @ oxeleven-server ---
[INFO] Nothing to compile - all classes are up to date
[INFO] 
[INFO] --- maven-resources-plugin:2.6:testResources (default-testResources) @ oxeleven-server ---
[INFO] Using 'UTF-8' encoding to copy filtered resources.
[INFO] skip non existing resourceDirectory /home/jenkins/.jenkins/jobs/oxEleven/workspace/Server/src/test/resources
[INFO] 
[INFO] --- maven-compiler-plugin:2.3.2:testCompile (default-testCompile) @ oxeleven-server ---
[INFO] No sources to compile
[INFO] 
[INFO] --- maven-surefire-plugin:2.12.4:test (default-test) @ oxeleven-server ---
[INFO] No tests to run.
[INFO] 
[INFO] --- maven-war-plugin:2.3:war (default-war) @ oxeleven-server ---
[INFO] Packaging webapp
[INFO] Assembling webapp [oxeleven-server] in [/home/jenkins/.jenkins/jobs/oxEleven/workspace/Server/target/oxeleven]
[INFO] Processing war project
[INFO] Copying webapp webResources [/home/jenkins/.jenkins/jobs/oxEleven/workspace/Server/src/main/webapp] to [/home/jenkins/.jenkins/jobs/oxEleven/workspace/Server/target/oxeleven]
[INFO] Copying webapp webResources [/home/jenkins/.jenkins/jobs/oxEleven/workspace/Server/src/main/webapp] to [/home/jenkins/.jenkins/jobs/oxEleven/workspace/Server/target/oxeleven]
[INFO] Copying webapp webResources [/home/jenkins/.jenkins/jobs/oxEleven/workspace/Server/src/main/webapp-jetty] to [/home/jenkins/.jenkins/jobs/oxEleven/workspace/Server/target/oxeleven]
[INFO] Copying webapp resources [/home/jenkins/.jenkins/jobs/oxEleven/workspace/Server/src/main/webapp]
[INFO] Webapp assembled in [124 msecs]
[INFO] Building war: /home/jenkins/.jenkins/jobs/oxEleven/workspace/Server/target/oxeleven.war
[INFO] 
[INFO] --- maven-install-plugin:2.3.1:install (default-install) @ oxeleven-server ---
[INFO] Installing /home/jenkins/.jenkins/jobs/oxEleven/workspace/Server/target/oxeleven.war to /var/www/html/maven/org/gluu/oxeleven-server/4.3.1-SNAPSHOT/oxeleven-server-4.3.1-SNAPSHOT.war
[INFO] Installing /home/jenkins/.jenkins/jobs/oxEleven/workspace/Server/pom.xml to /var/www/html/maven/org/gluu/oxeleven-server/4.3.1-SNAPSHOT/oxeleven-server-4.3.1-SNAPSHOT.pom
[INFO] 
[INFO] --- maven-site-plugin:2.1.1:site (default-site) @ oxeleven-server ---
[INFO]                                                                         
[INFO] ------------------------------------------------------------------------
[INFO] Building oxEleven Client 4.3.1-SNAPSHOT
[INFO] ------------------------------------------------------------------------
[INFO] 
[INFO] --- maven-clean-plugin:2.5:clean (default-clean) @ oxeleven-client ---
[INFO] Deleting /home/jenkins/.jenkins/jobs/oxEleven/workspace/Client/target
[INFO] 
[INFO] --- maven-resources-plugin:2.6:resources (default-resources) @ oxeleven-client ---
[INFO] Using 'UTF-8' encoding to copy filtered resources.
[INFO] skip non existing resourceDirectory /home/jenkins/.jenkins/jobs/oxEleven/workspace/Client/src/main/resources
[INFO] 
[INFO] --- maven-compiler-plugin:2.3.2:compile (default-compile) @ oxeleven-client ---
[INFO] Compiling 16 source files to /home/jenkins/.jenkins/jobs/oxEleven/workspace/Client/target/classes
[INFO] -------------------------------------------------------------
[ERROR] COMPILATION ERROR : 
[INFO] -------------------------------------------------------------
[ERROR] /home/jenkins/.jenkins/jobs/oxEleven/workspace/Client/src/main/java/org/gluu/oxeleven/client/DeleteKeyClient.java:[13,32] error: package org.jboss.resteasy.client does not exist
[ERROR] /home/jenkins/.jenkins/jobs/oxEleven/workspace/Client/src/main/java/org/gluu/oxeleven/client/BaseClient.java:[14,32] error: package org.jboss.resteasy.client does not exist
[ERROR] /home/jenkins/.jenkins/jobs/oxEleven/workspace/Client/src/main/java/org/gluu/oxeleven/client/BaseClient.java:[15,32] error: package org.jboss.resteasy.client does not exist
[ERROR] /home/jenkins/.jenkins/jobs/oxEleven/workspace/Client/src/main/java/org/gluu/oxeleven/client/BaseClient.java:[16,33] error: package org.jboss.resteasy.logging does not exist
[ERROR] /home/jenkins/.jenkins/jobs/oxEleven/workspace/Client/src/main/java/org/gluu/oxeleven/client/BaseResponse.java:[11,32] error: package org.jboss.resteasy.client does not exist
[ERROR] /home/jenkins/.jenkins/jobs/oxEleven/workspace/Client/src/main/java/org/gluu/oxeleven/client/DeleteKeyResponse.java:[11,32] error: package org.jboss.resteasy.client does not exist
[ERROR] /home/jenkins/.jenkins/jobs/oxEleven/workspace/Client/src/main/java/org/gluu/oxeleven/client/BaseClient.java:[28,25] error: cannot find symbol
[ERROR] 
    T extends BaseRequest declared in class BaseClient
    V extends BaseResponse declared in class BaseClient
/home/jenkins/.jenkins/jobs/oxEleven/workspace/Client/src/main/java/org/gluu/oxeleven/client/BaseClient.java:[33,14] error: cannot find symbol
[ERROR] 
    T extends BaseRequest declared in class BaseClient
    V extends BaseResponse declared in class BaseClient
/home/jenkins/.jenkins/jobs/oxEleven/workspace/Client/src/main/java/org/gluu/oxeleven/client/BaseClient.java:[34,14] error: cannot find symbol
[ERROR] 
    T extends BaseRequest declared in class BaseClient
    V extends BaseResponse declared in class BaseClient
/home/jenkins/.jenkins/jobs/oxEleven/workspace/Client/src/main/java/org/gluu/oxeleven/client/BaseResponse.java:[26,24] error: cannot find symbol
[ERROR]  class BaseResponse
/home/jenkins/.jenkins/jobs/oxEleven/workspace/Client/src/main/java/org/gluu/oxeleven/client/DeleteKeyResponse.java:[22,29] error: cannot find symbol
[ERROR]  class DeleteKeyResponse
/home/jenkins/.jenkins/jobs/oxEleven/workspace/Client/src/main/java/org/gluu/oxeleven/client/SignClient.java:[11,32] error: package org.jboss.resteasy.client does not exist
[ERROR] /home/jenkins/.jenkins/jobs/oxEleven/workspace/Client/src/main/java/org/gluu/oxeleven/client/SignResponse.java:[11,32] error: package org.jboss.resteasy.client does not exist
[ERROR] /home/jenkins/.jenkins/jobs/oxEleven/workspace/Client/src/main/java/org/gluu/oxeleven/client/SignResponse.java:[22,24] error: cannot find symbol
[ERROR]  class SignResponse
/home/jenkins/.jenkins/jobs/oxEleven/workspace/Client/src/main/java/org/gluu/oxeleven/client/VerifySignatureResponse.java:[11,32] error: package org.jboss.resteasy.client does not exist
[ERROR] /home/jenkins/.jenkins/jobs/oxEleven/workspace/Client/src/main/java/org/gluu/oxeleven/client/VerifySignatureResponse.java:[22,35] error: cannot find symbol
[ERROR]  class VerifySignatureResponse
/home/jenkins/.jenkins/jobs/oxEleven/workspace/Client/src/main/java/org/gluu/oxeleven/client/GenerateKeyClient.java:[14,32] error: package org.jboss.resteasy.client does not exist
[ERROR] /home/jenkins/.jenkins/jobs/oxEleven/workspace/Client/src/main/java/org/gluu/oxeleven/client/GenerateKeyResponse.java:[24,32] error: package org.jboss.resteasy.client does not exist
[ERROR] /home/jenkins/.jenkins/jobs/oxEleven/workspace/Client/src/main/java/org/gluu/oxeleven/client/GenerateKeyResponse.java:[45,31] error: cannot find symbol
[ERROR]  class GenerateKeyResponse
/home/jenkins/.jenkins/jobs/oxEleven/workspace/Client/src/main/java/org/gluu/oxeleven/client/VerifySignatureClient.java:[11,32] error: package org.jboss.resteasy.client does not exist
[ERROR] /home/jenkins/.jenkins/jobs/oxEleven/workspace/Client/src/main/java/org/gluu/oxeleven/client/BaseClient.java:[28,38] error: cannot find symbol
[ERROR] 
    T extends BaseRequest declared in class BaseClient
    V extends BaseResponse declared in class BaseClient
/home/jenkins/.jenkins/jobs/oxEleven/workspace/Client/src/main/java/org/gluu/oxeleven/client/DeleteKeyClient.java:[62,28] error: cannot find symbol
[ERROR]  class DeleteKeyClient
/home/jenkins/.jenkins/jobs/oxEleven/workspace/Client/src/main/java/org/gluu/oxeleven/client/SignClient.java:[60,28] error: cannot find symbol
[ERROR]  class SignClient
/home/jenkins/.jenkins/jobs/oxEleven/workspace/Client/src/main/java/org/gluu/oxeleven/client/GenerateKeyClient.java:[63,28] error: cannot find symbol
[ERROR]  class GenerateKeyClient
/home/jenkins/.jenkins/jobs/oxEleven/workspace/Client/src/main/java/org/gluu/oxeleven/client/VerifySignatureClient.java:[60,28] error: cannot find symbol
[INFO] 25 errors 
[INFO] -------------------------------------------------------------
[INFO] ------------------------------------------------------------------------
[INFO] Reactor Summary:
[INFO] 
[INFO] oxEleven ........................................... SUCCESS [  0.903 s]
[INFO] oxEleven Model ..................................... SUCCESS [  1.459 s]
[INFO] oxEleven Server .................................... SUCCESS [  2.370 s]
[INFO] oxEleven Client .................................... FAILURE [  0.714 s]
[INFO] ------------------------------------------------------------------------
[INFO] BUILD FAILURE
[INFO] ------------------------------------------------------------------------
[INFO] Total time: 6.619 s
[INFO] Finished at: 2021-10-28T08:25:21+00:00
[INFO] Final Memory: 48M/537M
[INFO] ------------------------------------------------------------------------
[ERROR] Failed to execute goal org.apache.maven.plugins:maven-compiler-plugin:2.3.2:compile (default-compile) on project oxeleven-client: Compilation failure: Compilation failure:
[ERROR] /home/jenkins/.jenkins/jobs/oxEleven/workspace/Client/src/main/java/org/gluu/oxeleven/client/DeleteKeyClient.java:[13,32] error: package org.jboss.resteasy.client does not exist
[ERROR] /home/jenkins/.jenkins/jobs/oxEleven/workspace/Client/src/main/java/org/gluu/oxeleven/client/BaseClient.java:[14,32] error: package org.jboss.resteasy.client does not exist
[ERROR] /home/jenkins/.jenkins/jobs/oxEleven/workspace/Client/src/main/java/org/gluu/oxeleven/client/BaseClient.java:[15,32] error: package org.jboss.resteasy.client does not exist
[ERROR] /home/jenkins/.jenkins/jobs/oxEleven/workspace/Client/src/main/java/org/gluu/oxeleven/client/BaseClient.java:[16,33] error: package org.jboss.resteasy.logging does not exist
[ERROR] /home/jenkins/.jenkins/jobs/oxEleven/workspace/Client/src/main/java/org/gluu/oxeleven/client/BaseResponse.java:[11,32] error: package org.jboss.resteasy.client does not exist
[ERROR] /home/jenkins/.jenkins/jobs/oxEleven/workspace/Client/src/main/java/org/gluu/oxeleven/client/DeleteKeyResponse.java:[11,32] error: package org.jboss.resteasy.client does not exist
[ERROR] /home/jenkins/.jenkins/jobs/oxEleven/workspace/Client/src/main/java/org/gluu/oxeleven/client/BaseClient.java:[28,25] error: cannot find symbol
[ERROR] 
[ERROR] T extends BaseRequest declared in class BaseClient
[ERROR] V extends BaseResponse declared in class BaseClient
[ERROR] /home/jenkins/.jenkins/jobs/oxEleven/workspace/Client/src/main/java/org/gluu/oxeleven/client/BaseClient.java:[33,14] error: cannot find symbol
[ERROR] 
[ERROR] T extends BaseRequest declared in class BaseClient
[ERROR] V extends BaseResponse declared in class BaseClient
[ERROR] /home/jenkins/.jenkins/jobs/oxEleven/workspace/Client/src/main/java/org/gluu/oxeleven/client/BaseClient.java:[34,14] error: cannot find symbol
[ERROR] 
[ERROR] T extends BaseRequest declared in class BaseClient
[ERROR] V extends BaseResponse declared in class BaseClient
[ERROR] /home/jenkins/.jenkins/jobs/oxEleven/workspace/Client/src/main/java/org/gluu/oxeleven/client/BaseResponse.java:[26,24] error: cannot find symbol
[ERROR] class BaseResponse
[ERROR] /home/jenkins/.jenkins/jobs/oxEleven/workspace/Client/src/main/java/org/gluu/oxeleven/client/DeleteKeyResponse.java:[22,29] error: cannot find symbol
[ERROR] class DeleteKeyResponse
[ERROR] /home/jenkins/.jenkins/jobs/oxEleven/workspace/Client/src/main/java/org/gluu/oxeleven/client/SignClient.java:[11,32] error: package org.jboss.resteasy.client does not exist
[ERROR] /home/jenkins/.jenkins/jobs/oxEleven/workspace/Client/src/main/java/org/gluu/oxeleven/client/SignResponse.java:[11,32] error: package org.jboss.resteasy.client does not exist
[ERROR] /home/jenkins/.jenkins/jobs/oxEleven/workspace/Client/src/main/java/org/gluu/oxeleven/client/SignResponse.java:[22,24] error: cannot find symbol
[ERROR] class SignResponse
[ERROR] /home/jenkins/.jenkins/jobs/oxEleven/workspace/Client/src/main/java/org/gluu/oxeleven/client/VerifySignatureResponse.java:[11,32] error: package org.jboss.resteasy.client does not exist
[ERROR] /home/jenkins/.jenkins/jobs/oxEleven/workspace/Client/src/main/java/org/gluu/oxeleven/client/VerifySignatureResponse.java:[22,35] error: cannot find symbol
[ERROR] class VerifySignatureResponse
[ERROR] /home/jenkins/.jenkins/jobs/oxEleven/workspace/Client/src/main/java/org/gluu/oxeleven/client/GenerateKeyClient.java:[14,32] error: package org.jboss.resteasy.client does not exist
[ERROR] /home/jenkins/.jenkins/jobs/oxEleven/workspace/Client/src/main/java/org/gluu/oxeleven/client/GenerateKeyResponse.java:[24,32] error: package org.jboss.resteasy.client does not exist
[ERROR] /home/jenkins/.jenkins/jobs/oxEleven/workspace/Client/src/main/java/org/gluu/oxeleven/client/GenerateKeyResponse.java:[45,31] error: cannot find symbol
[ERROR] class GenerateKeyResponse
[ERROR] /home/jenkins/.jenkins/jobs/oxEleven/workspace/Client/src/main/java/org/gluu/oxeleven/client/VerifySignatureClient.java:[11,32] error: package org.jboss.resteasy.client does not exist
[ERROR] /home/jenkins/.jenkins/jobs/oxEleven/workspace/Client/src/main/java/org/gluu/oxeleven/client/BaseClient.java:[28,38] error: cannot find symbol
[ERROR] 
[ERROR] T extends BaseRequest declared in class BaseClient
[ERROR] V extends BaseResponse declared in class BaseClient
[ERROR] /home/jenkins/.jenkins/jobs/oxEleven/workspace/Client/src/main/java/org/gluu/oxeleven/client/DeleteKeyClient.java:[62,28] error: cannot find symbol
[ERROR] class DeleteKeyClient
[ERROR] /home/jenkins/.jenkins/jobs/oxEleven/workspace/Client/src/main/java/org/gluu/oxeleven/client/SignClient.java:[60,28] error: cannot find symbol
[ERROR] class SignClient
[ERROR] /home/jenkins/.jenkins/jobs/oxEleven/workspace/Client/src/main/java/org/gluu/oxeleven/client/GenerateKeyClient.java:[63,28] error: cannot find symbol
[ERROR] class GenerateKeyClient
[ERROR] /home/jenkins/.jenkins/jobs/oxEleven/workspace/Client/src/main/java/org/gluu/oxeleven/client/VerifySignatureClient.java:[60,28] error: cannot find symbol
[ERROR] -> [Help 1]
[ERROR] 
[ERROR] To see the full stack trace of the errors, re-run Maven with the -e switch.
[ERROR] Re-run Maven using the -X switch to enable full debug logging.
[ERROR] 
[ERROR] For more information about the errors and possible solutions, please read the following articles:
[ERROR] [Help 1] http://cwiki.apache.org/confluence/display/MAVEN/MojoFailureException
[ERROR] 
[ERROR] After correcting the problems, you can resume the build with the command
[ERROR]   mvn <goals> -rf :oxeleven-client
Build step 'Invoke top-level Maven targets' marked build as failure
[FINDBUGS] Skipping publisher since build result is FAILURE
TestNG Reports Processing: START
Looking for TestNG results report in workspace using pattern: **/testng-results.xml
Did not find any matching files.
Not sending mail to unregistered user Yuriy.Movchan@gmail.com
Sending e-mails to: support@gluu.org
ERROR: Could not connect to SMTP host: webmail.gluu.org, port: 465
javax.mail.MessagingException: Could not connect to SMTP host: webmail.gluu.org, port: 465;
  nested exception is:
	javax.net.ssl.SSLHandshakeException: sun.security.validator.ValidatorException: PKIX path building failed: sun.security.provider.certpath.SunCertPathBuilderException: unable to find valid certification path to requested target
	at com.sun.mail.smtp.SMTPTransport.openServer(SMTPTransport.java:2212)
	at com.sun.mail.smtp.SMTPTransport.protocolConnect(SMTPTransport.java:722)
	at javax.mail.Service.connect(Service.java:310)
	at javax.mail.Service.connect(Service.java:169)
	at javax.mail.Service.connect(Service.java:118)
	at javax.mail.Transport.send0(Transport.java:188)
	at javax.mail.Transport.send(Transport.java:118)
	at hudson.tasks.MailSender.run(MailSender.java:130)
	at hudson.tasks.Mailer.perform(Mailer.java:176)
	at hudson.tasks.Mailer.perform(Mailer.java:139)
	at hudson.tasks.BuildStepMonitor$1.perform(BuildStepMonitor.java:20)
	at hudson.model.AbstractBuild$AbstractBuildExecution.perform(AbstractBuild.java:741)
	at hudson.model.AbstractBuild$AbstractBuildExecution.performAllBuildSteps(AbstractBuild.java:690)
	at hudson.model.Build$BuildExecution.post2(Build.java:186)
	at hudson.model.AbstractBuild$AbstractBuildExecution.post(AbstractBuild.java:635)
	at hudson.model.Run.execute(Run.java:1905)
	at hudson.model.FreeStyleBuild.run(FreeStyleBuild.java:43)
	at hudson.model.ResourceController.execute(ResourceController.java:97)
	at hudson.model.Executor.run(Executor.java:428)
Caused by: javax.net.ssl.SSLHandshakeException: sun.security.validator.ValidatorException: PKIX path building failed: sun.security.provider.certpath.SunCertPathBuilderException: unable to find valid certification path to requested target
	at sun.security.ssl.Alerts.getSSLException(Alerts.java:192)
	at sun.security.ssl.SSLSocketImpl.fatal(SSLSocketImpl.java:1949)
	at sun.security.ssl.Handshaker.fatalSE(Handshaker.java:302)
	at sun.security.ssl.Handshaker.fatalSE(Handshaker.java:296)
	at sun.security.ssl.ClientHandshaker.serverCertificate(ClientHandshaker.java:1514)
	at sun.security.ssl.ClientHandshaker.processMessage(ClientHandshaker.java:216)
	at sun.security.ssl.Handshaker.processLoop(Handshaker.java:1026)
	at sun.security.ssl.Handshaker.process_record(Handshaker.java:961)
	at sun.security.ssl.SSLSocketImpl.readRecord(SSLSocketImpl.java:1062)
	at sun.security.ssl.SSLSocketImpl.performInitialHandshake(SSLSocketImpl.java:1375)
	at sun.security.ssl.SSLSocketImpl.startHandshake(SSLSocketImpl.java:1403)
	at sun.security.ssl.SSLSocketImpl.startHandshake(SSLSocketImpl.java:1387)
	at com.sun.mail.util.SocketFetcher.configureSSLSocket(SocketFetcher.java:602)
	at com.sun.mail.util.SocketFetcher.createSocket(SocketFetcher.java:376)
	at com.sun.mail.util.SocketFetcher.getSocket(SocketFetcher.java:193)
	at com.sun.mail.smtp.SMTPTransport.openServer(SMTPTransport.java:2160)
	... 18 more
Caused by: sun.security.validator.ValidatorException: PKIX path building failed: sun.security.provider.certpath.SunCertPathBuilderException: unable to find valid certification path to requested target
	at sun.security.validator.PKIXValidator.doBuild(PKIXValidator.java:387)
	at sun.security.validator.PKIXValidator.engineValidate(PKIXValidator.java:230)
	at sun.security.validator.Validator.validate(Validator.java:260)
	at sun.security.ssl.X509TrustManagerImpl.validate(X509TrustManagerImpl.java:324)
	at sun.security.ssl.X509TrustManagerImpl.checkTrusted(X509TrustManagerImpl.java:229)
	at sun.security.ssl.X509TrustManagerImpl.checkServerTrusted(X509TrustManagerImpl.java:124)
	at sun.security.ssl.ClientHandshaker.serverCertificate(ClientHandshaker.java:1496)
	... 29 more
Caused by: sun.security.provider.certpath.SunCertPathBuilderException: unable to find valid certification path to requested target
	at sun.security.provider.certpath.SunCertPathBuilder.build(SunCertPathBuilder.java:141)
	at sun.security.provider.certpath.SunCertPathBuilder.engineBuild(SunCertPathBuilder.java:126)
	at java.security.cert.CertPathBuilder.build(CertPathBuilder.java:280)
	at sun.security.validator.PKIXValidator.doBuild(PKIXValidator.java:382)
	... 35 more
Finished: FAILURE