FailedConsole Output

Started by user Yuriy Movchan
Running as SYSTEM
Building on master in workspace /home/jenkins/.jenkins/jobs/oxCore_3.1.7/workspace
The recommended git tool is: NONE
No credentials specified
 > git rev-parse --is-inside-work-tree # timeout=10
Fetching changes from the remote Git repository
 > git config remote.origin.url https://github.com/GluuFederation/oxCore # timeout=10
Fetching upstream changes from https://github.com/GluuFederation/oxCore
 > git --version # timeout=10
 > git --version # 'git version 1.8.3.1'
 > git fetch --tags --progress https://github.com/GluuFederation/oxCore +refs/heads/*:refs/remotes/origin/* # timeout=10
 > git rev-parse refs/remotes/origin/version_4.0.1^{commit} # timeout=10
 > git rev-parse refs/remotes/origin/origin/version_4.0.1^{commit} # timeout=10
Checking out Revision c5c648b24c6a74475f5f5120620e031983a40134 (refs/remotes/origin/version_4.0.1)
 > git config core.sparsecheckout # timeout=10
 > git checkout -f c5c648b24c6a74475f5f5120620e031983a40134 # timeout=10
Commit message: "chore: fix build"
 > git rev-list --no-walk 9c83ee5d1822a400369c90666e6f5083c58005c6 # timeout=10
[workspace] $ /home/jenkins/.jenkins/tools/hudson.tasks.Maven_MavenInstallation/maven_3.3.9/bin/mvn -DVERSION_NAME=version_4.0.1 -DMAVEN_SKIP_TESTS=true -Dmaven.test.skip=true clean compile install findbugs:findbugs checkstyle:checkstyle javadoc:javadoc site
[INFO] Scanning for projects...
[WARNING] 
[WARNING] Some problems were encountered while building the effective model for org.gluu:oxcore-util:jar:4.0.1.Final
[WARNING] 'dependencyManagement.dependencies.dependency.(groupId:artifactId:type:classifier)' must be unique: org.testng:testng:jar -> duplicate declaration of version 6.9.4 @ org.gluu:oxcore:4.0.1.Final, /home/jenkins/.jenkins/jobs/oxCore_3.1.7/workspace/pom.xml, line 344, column 25
[WARNING] 
[WARNING] Some problems were encountered while building the effective model for org.gluu:oxcore-persistence-filter:jar:4.0.1.Final
[WARNING] 'dependencyManagement.dependencies.dependency.(groupId:artifactId:type:classifier)' must be unique: org.testng:testng:jar -> duplicate declaration of version 6.9.4 @ org.gluu:oxcore:4.0.1.Final, /home/jenkins/.jenkins/jobs/oxCore_3.1.7/workspace/pom.xml, line 344, column 25
[WARNING] 
[WARNING] Some problems were encountered while building the effective model for org.gluu:oxcore-persistence-model:jar:4.0.1.Final
[WARNING] 'dependencyManagement.dependencies.dependency.(groupId:artifactId:type:classifier)' must be unique: org.testng:testng:jar -> duplicate declaration of version 6.9.4 @ org.gluu:oxcore:4.0.1.Final, /home/jenkins/.jenkins/jobs/oxCore_3.1.7/workspace/pom.xml, line 344, column 25
[WARNING] 
[WARNING] Some problems were encountered while building the effective model for org.gluu:oxcore-persistence-core:jar:4.0.1.Final
[WARNING] 'dependencyManagement.dependencies.dependency.(groupId:artifactId:type:classifier)' must be unique: org.testng:testng:jar -> duplicate declaration of version 6.9.4 @ org.gluu:oxcore:4.0.1.Final, /home/jenkins/.jenkins/jobs/oxCore_3.1.7/workspace/pom.xml, line 344, column 25
[WARNING] 
[WARNING] Some problems were encountered while building the effective model for org.gluu:oxcore-persistence-ldap:jar:4.0.1.Final
[WARNING] 'dependencyManagement.dependencies.dependency.(groupId:artifactId:type:classifier)' must be unique: org.testng:testng:jar -> duplicate declaration of version 6.9.4 @ org.gluu:oxcore:4.0.1.Final, /home/jenkins/.jenkins/jobs/oxCore_3.1.7/workspace/pom.xml, line 344, column 25
[WARNING] 
[WARNING] Some problems were encountered while building the effective model for org.gluu:oxcore-persistence-annotation:jar:4.0.1.Final
[WARNING] 'dependencyManagement.dependencies.dependency.(groupId:artifactId:type:classifier)' must be unique: org.testng:testng:jar -> duplicate declaration of version 6.9.4 @ org.gluu:oxcore:4.0.1.Final, /home/jenkins/.jenkins/jobs/oxCore_3.1.7/workspace/pom.xml, line 344, column 25
[WARNING] 
[WARNING] Some problems were encountered while building the effective model for org.gluu:oxcore-persistence-couchbase:jar:4.0.1.Final
[WARNING] 'dependencyManagement.dependencies.dependency.(groupId:artifactId:type:classifier)' must be unique: org.testng:testng:jar -> duplicate declaration of version 6.9.4 @ org.gluu:oxcore:4.0.1.Final, /home/jenkins/.jenkins/jobs/oxCore_3.1.7/workspace/pom.xml, line 344, column 25
[WARNING] 
[WARNING] Some problems were encountered while building the effective model for org.gluu:oxcore-persistence-hybrid:jar:4.0.1.Final
[WARNING] 'dependencyManagement.dependencies.dependency.(groupId:artifactId:type:classifier)' must be unique: org.testng:testng:jar -> duplicate declaration of version 6.9.4 @ org.gluu:oxcore:4.0.1.Final, /home/jenkins/.jenkins/jobs/oxCore_3.1.7/workspace/pom.xml, line 344, column 25
[WARNING] 
[WARNING] Some problems were encountered while building the effective model for org.gluu:oxcore-persistence-cdi:jar:4.0.1.Final
[WARNING] 'dependencyManagement.dependencies.dependency.(groupId:artifactId:type:classifier)' must be unique: org.testng:testng:jar -> duplicate declaration of version 6.9.4 @ org.gluu:oxcore:4.0.1.Final, /home/jenkins/.jenkins/jobs/oxCore_3.1.7/workspace/pom.xml, line 344, column 25
[WARNING] 
[WARNING] Some problems were encountered while building the effective model for org.gluu:oxcore-persistence-standalone:jar:4.0.1.Final
[WARNING] 'dependencyManagement.dependencies.dependency.(groupId:artifactId:type:classifier)' must be unique: org.testng:testng:jar -> duplicate declaration of version 6.9.4 @ org.gluu:oxcore:4.0.1.Final, /home/jenkins/.jenkins/jobs/oxCore_3.1.7/workspace/pom.xml, line 344, column 25
[WARNING] 
[WARNING] Some problems were encountered while building the effective model for org.gluu:oxcore-persistence-ldap-sample:jar:4.0.1.Final
[WARNING] 'dependencyManagement.dependencies.dependency.(groupId:artifactId:type:classifier)' must be unique: org.testng:testng:jar -> duplicate declaration of version 6.9.4 @ org.gluu:oxcore:4.0.1.Final, /home/jenkins/.jenkins/jobs/oxCore_3.1.7/workspace/pom.xml, line 344, column 25
[WARNING] 
[WARNING] Some problems were encountered while building the effective model for org.gluu:oxcore-persistence-couchbase-sample:jar:4.0.1.Final
[WARNING] 'dependencyManagement.dependencies.dependency.(groupId:artifactId:type:classifier)' must be unique: org.testng:testng:jar -> duplicate declaration of version 6.9.4 @ org.gluu:oxcore:4.0.1.Final, /home/jenkins/.jenkins/jobs/oxCore_3.1.7/workspace/pom.xml, line 344, column 25
[WARNING] 
[WARNING] Some problems were encountered while building the effective model for org.gluu:oxcore-model:jar:4.0.1.Final
[WARNING] 'dependencyManagement.dependencies.dependency.(groupId:artifactId:type:classifier)' must be unique: org.testng:testng:jar -> duplicate declaration of version 6.9.4 @ org.gluu:oxcore:4.0.1.Final, /home/jenkins/.jenkins/jobs/oxCore_3.1.7/workspace/pom.xml, line 344, column 25
[WARNING] 
[WARNING] Some problems were encountered while building the effective model for org.gluu:oxcore-saml:jar:4.0.1.Final
[WARNING] 'dependencies.dependency.(groupId:artifactId:type:classifier)' must be unique: commons-beanutils:commons-beanutils:jar -> duplicate declaration of version (?) @ org.gluu:oxcore-saml:[unknown-version], /home/jenkins/.jenkins/jobs/oxCore_3.1.7/workspace/oxSaml/pom.xml, line 25, column 15
[WARNING] 'dependencies.dependency.(groupId:artifactId:type:classifier)' must be unique: org.apache.ws.security:wss4j:jar -> duplicate declaration of version (?) @ org.gluu:oxcore-saml:[unknown-version], /home/jenkins/.jenkins/jobs/oxCore_3.1.7/workspace/oxSaml/pom.xml, line 33, column 15
[WARNING] 'dependencyManagement.dependencies.dependency.(groupId:artifactId:type:classifier)' must be unique: org.testng:testng:jar -> duplicate declaration of version 6.9.4 @ org.gluu:oxcore:4.0.1.Final, /home/jenkins/.jenkins/jobs/oxCore_3.1.7/workspace/pom.xml, line 344, column 25
[WARNING] 
[WARNING] Some problems were encountered while building the effective model for org.gluu:oxcore-service:jar:4.0.1.Final
[WARNING] 'dependencyManagement.dependencies.dependency.(groupId:artifactId:type:classifier)' must be unique: org.testng:testng:jar -> duplicate declaration of version 6.9.4 @ org.gluu:oxcore:4.0.1.Final, /home/jenkins/.jenkins/jobs/oxCore_3.1.7/workspace/pom.xml, line 344, column 25
[WARNING] 
[WARNING] Some problems were encountered while building the effective model for org.gluu:oxcore-server:jar:4.0.1.Final
[WARNING] 'dependencyManagement.dependencies.dependency.(groupId:artifactId:type:classifier)' must be unique: org.testng:testng:jar -> duplicate declaration of version 6.9.4 @ org.gluu:oxcore:4.0.1.Final, /home/jenkins/.jenkins/jobs/oxCore_3.1.7/workspace/pom.xml, line 344, column 25
[WARNING] 
[WARNING] Some problems were encountered while building the effective model for org.gluu:oxcore-jsf-util:jar:4.0.1.Final
[WARNING] 'dependencyManagement.dependencies.dependency.(groupId:artifactId:type:classifier)' must be unique: org.testng:testng:jar -> duplicate declaration of version 6.9.4 @ org.gluu:oxcore:4.0.1.Final, /home/jenkins/.jenkins/jobs/oxCore_3.1.7/workspace/pom.xml, line 344, column 25
[WARNING] 
[WARNING] Some problems were encountered while building the effective model for org.gluu:oxcore-radius:jar:4.0.1.Final
[WARNING] 'dependencyManagement.dependencies.dependency.(groupId:artifactId:type:classifier)' must be unique: org.testng:testng:jar -> duplicate declaration of version 6.9.4 @ org.gluu:oxcore:4.0.1.Final, /home/jenkins/.jenkins/jobs/oxCore_3.1.7/workspace/pom.xml, line 344, column 25
[WARNING] 
[WARNING] Some problems were encountered while building the effective model for org.gluu:oxcore-demo-cdi:jar:4.0.1.Final
[WARNING] 'dependencyManagement.dependencies.dependency.(groupId:artifactId:type:classifier)' must be unique: org.testng:testng:jar -> duplicate declaration of version 6.9.4 @ org.gluu:oxcore:4.0.1.Final, /home/jenkins/.jenkins/jobs/oxCore_3.1.7/workspace/pom.xml, line 344, column 25
[WARNING] 
[WARNING] Some problems were encountered while building the effective model for org.gluu:oxcore:pom:4.0.1.Final
[WARNING] 'dependencyManagement.dependencies.dependency.(groupId:artifactId:type:classifier)' must be unique: org.testng:testng:jar -> duplicate declaration of version 6.9.4 @ line 344, column 25
[WARNING] 
[WARNING] It is highly recommended to fix these problems because they threaten the stability of your build.
[WARNING] 
[WARNING] For this reason, future Maven versions might no longer support building such malformed projects.
[WARNING] 
[INFO] ------------------------------------------------------------------------
[INFO] Reactor Build Order:
[INFO] 
[INFO] oxCore
[INFO] persistence-annotation
[INFO] oxUtil
[INFO] persistence-filter
[INFO] persistence-model
[INFO] persistence-core
[INFO] persistence-ldap
[INFO] persistence-couchbase
[INFO] Persistence CDI services
[INFO] persistence-hybrid
[INFO] Persistence standalone services
[INFO] persistence-ldapSample
[INFO] Persistence Couchbase sample
[INFO] oxModel
[INFO] oxSaml
[INFO] oxService
[INFO] Web application specific classes
[INFO] oxJsfUtil
[INFO] oxRadius
[INFO] Demo CDI services
[INFO]                                                                         
[INFO] ------------------------------------------------------------------------
[INFO] Building oxCore 4.0.1.Final
[INFO] ------------------------------------------------------------------------
[INFO] 
[INFO] --- maven-clean-plugin:2.4.1:clean (default-clean) @ oxcore ---
[INFO] Deleting /home/jenkins/.jenkins/jobs/oxCore_3.1.7/workspace/target
[INFO] 
[INFO] --- maven-install-plugin:2.3.1:install (default-install) @ oxcore ---
[INFO] Installing /home/jenkins/.jenkins/jobs/oxCore_3.1.7/workspace/pom.xml to /var/www/html/maven/org/gluu/oxcore/4.0.1.Final/oxcore-4.0.1.Final.pom
[INFO] 
[INFO] --- findbugs-maven-plugin:3.0.4:findbugs (default-cli) @ oxcore ---
[INFO] 
[INFO] --- maven-checkstyle-plugin:3.0.0:checkstyle (default-cli) @ oxcore ---
[INFO] 
[INFO] >>> maven-javadoc-plugin:3.0.1:javadoc (default-cli) > generate-sources @ oxcore >>>
[INFO] 
[INFO] <<< maven-javadoc-plugin:3.0.1:javadoc (default-cli) < generate-sources @ oxcore <<<
[INFO] 
[INFO] --- maven-javadoc-plugin:3.0.1:javadoc (default-cli) @ oxcore ---
[INFO] 
[INFO] --- maven-site-plugin:2.1.1:site (default-site) @ oxcore ---
[INFO]                                                                         
[INFO] ------------------------------------------------------------------------
[INFO] Building persistence-annotation 4.0.1.Final
[INFO] ------------------------------------------------------------------------
[INFO] 
[INFO] --- maven-clean-plugin:2.4.1:clean (default-clean) @ oxcore-persistence-annotation ---
[INFO] Deleting /home/jenkins/.jenkins/jobs/oxCore_3.1.7/workspace/persistence-annotation/target
[INFO] 
[INFO] --- maven-resources-plugin:2.4:resources (default-resources) @ oxcore-persistence-annotation ---
[INFO] Using 'UTF-8' encoding to copy filtered resources.
[INFO] skip non existing resourceDirectory /home/jenkins/.jenkins/jobs/oxCore_3.1.7/workspace/persistence-annotation/src/main/resources
[INFO] 
[INFO] --- maven-compiler-plugin:2.3.2:compile (default-compile) @ oxcore-persistence-annotation ---
[INFO] Compiling 10 source files to /home/jenkins/.jenkins/jobs/oxCore_3.1.7/workspace/persistence-annotation/target/classes
[INFO] 
[INFO] --- maven-resources-plugin:2.4:resources (default-resources) @ oxcore-persistence-annotation ---
[INFO] Using 'UTF-8' encoding to copy filtered resources.
[INFO] skip non existing resourceDirectory /home/jenkins/.jenkins/jobs/oxCore_3.1.7/workspace/persistence-annotation/src/main/resources
[INFO] 
[INFO] --- maven-compiler-plugin:2.3.2:compile (default-compile) @ oxcore-persistence-annotation ---
[INFO] Nothing to compile - all classes are up to date
[INFO] 
[INFO] --- maven-resources-plugin:2.4:testResources (default-testResources) @ oxcore-persistence-annotation ---
[INFO] Using 'UTF-8' encoding to copy filtered resources.
[INFO] skip non existing resourceDirectory /home/jenkins/.jenkins/jobs/oxCore_3.1.7/workspace/persistence-annotation/src/test/resources
[INFO] 
[INFO] --- maven-compiler-plugin:2.3.2:testCompile (default-testCompile) @ oxcore-persistence-annotation ---
[INFO] Not compiling test sources
[INFO] 
[INFO] --- maven-surefire-plugin:2.7.2:test (default-test) @ oxcore-persistence-annotation ---
[INFO] Tests are skipped.
[INFO] 
[INFO] --- maven-jar-plugin:2.4:jar (default-jar) @ oxcore-persistence-annotation ---
[INFO] Building jar: /home/jenkins/.jenkins/jobs/oxCore_3.1.7/workspace/persistence-annotation/target/oxcore-persistence-annotation-4.0.1.Final.jar
[INFO] 
[INFO] --- maven-install-plugin:2.3.1:install (default-install) @ oxcore-persistence-annotation ---
[INFO] Installing /home/jenkins/.jenkins/jobs/oxCore_3.1.7/workspace/persistence-annotation/target/oxcore-persistence-annotation-4.0.1.Final.jar to /var/www/html/maven/org/gluu/oxcore-persistence-annotation/4.0.1.Final/oxcore-persistence-annotation-4.0.1.Final.jar
[INFO] Installing /home/jenkins/.jenkins/jobs/oxCore_3.1.7/workspace/persistence-annotation/pom.xml to /var/www/html/maven/org/gluu/oxcore-persistence-annotation/4.0.1.Final/oxcore-persistence-annotation-4.0.1.Final.pom
[INFO] 
[INFO] --- findbugs-maven-plugin:3.0.4:findbugs (default-cli) @ oxcore-persistence-annotation ---
[INFO] Fork Value is true
[INFO] Done FindBugs Analysis....
[INFO] 
[INFO] --- maven-checkstyle-plugin:3.0.0:checkstyle (default-cli) @ oxcore-persistence-annotation ---
[INFO] Starting audit...
[ERROR] /home/jenkins/.jenkins/jobs/oxCore_3.1.7/workspace/persistence-annotation/src/main/java/org/gluu/persist/annotation/ObjectClass.java:23:1: File contains tab characters (this is the first instance). [FileTabCharacter]
Audit done.
[INFO] ------------------------------------------------------------------------
[INFO] Reactor Summary:
[INFO] 
[INFO] oxCore ............................................. SUCCESS [  1.950 s]
[INFO] persistence-annotation ............................. FAILURE [  3.770 s]
[INFO] oxUtil ............................................. SKIPPED
[INFO] persistence-filter ................................. SKIPPED
[INFO] persistence-model .................................. SKIPPED
[INFO] persistence-core ................................... SKIPPED
[INFO] persistence-ldap ................................... SKIPPED
[INFO] persistence-couchbase .............................. SKIPPED
[INFO] Persistence CDI services ........................... SKIPPED
[INFO] persistence-hybrid ................................. SKIPPED
[INFO] Persistence standalone services .................... SKIPPED
[INFO] persistence-ldapSample ............................. SKIPPED
[INFO] Persistence Couchbase sample ....................... SKIPPED
[INFO] oxModel ............................................ SKIPPED
[INFO] oxSaml ............................................. SKIPPED
[INFO] oxService .......................................... SKIPPED
[INFO] Web application specific classes ................... SKIPPED
[INFO] oxJsfUtil .......................................... SKIPPED
[INFO] oxRadius ........................................... SKIPPED
[INFO] Demo CDI services .................................. SKIPPED
[INFO] ------------------------------------------------------------------------
[INFO] BUILD FAILURE
[INFO] ------------------------------------------------------------------------
[INFO] Total time: 6.514 s
[INFO] Finished at: 2021-12-16T17:33:53+00:00
[INFO] Final Memory: 58M/611M
[INFO] ------------------------------------------------------------------------
[ERROR] Failed to execute goal org.apache.maven.plugins:maven-checkstyle-plugin:3.0.0:checkstyle (default-cli) on project oxcore-persistence-annotation: An error has occurred in Checkstyle report generation. Failed during checkstyle execution: There is 1 error reported by Checkstyle 6.18 with checkstyle.xml ruleset. -> [Help 1]
[ERROR] 
[ERROR] To see the full stack trace of the errors, re-run Maven with the -e switch.
[ERROR] Re-run Maven using the -X switch to enable full debug logging.
[ERROR] 
[ERROR] For more information about the errors and possible solutions, please read the following articles:
[ERROR] [Help 1] http://cwiki.apache.org/confluence/display/MAVEN/MojoExecutionException
[ERROR] 
[ERROR] After correcting the problems, you can resume the build with the command
[ERROR]   mvn <goals> -rf :oxcore-persistence-annotation
Build step 'Invoke top-level Maven targets' marked build as failure
[FINDBUGS] Skipping publisher since build result is FAILURE
TestNG Reports Processing: START
Looking for TestNG results report in workspace using pattern: **/testng-results.xml
testng-results.xml was last modified before this build started. Ignoring it.
Saving reports...
Found matching files but did not find any TestNG results.
Not sending mail to unregistered user Yuriy.Movchan@gmail.com
Sending e-mails to: support@gluu.org
ERROR: Couldn't connect to host, port: webmail.gluu.org, 465; timeout 60000
com.sun.mail.util.MailConnectException: Couldn't connect to host, port: webmail.gluu.org, 465; timeout 60000;
  nested exception is:
	java.net.SocketTimeoutException: connect timed out
	at com.sun.mail.smtp.SMTPTransport.openServer(SMTPTransport.java:2210)
	at com.sun.mail.smtp.SMTPTransport.protocolConnect(SMTPTransport.java:722)
	at javax.mail.Service.connect(Service.java:310)
	at javax.mail.Service.connect(Service.java:169)
	at javax.mail.Service.connect(Service.java:118)
	at javax.mail.Transport.send0(Transport.java:188)
	at javax.mail.Transport.send(Transport.java:118)
	at hudson.tasks.MailSender.run(MailSender.java:130)
	at hudson.tasks.Mailer.perform(Mailer.java:176)
	at hudson.tasks.Mailer.perform(Mailer.java:139)
	at hudson.tasks.BuildStepMonitor$1.perform(BuildStepMonitor.java:20)
	at hudson.model.AbstractBuild$AbstractBuildExecution.perform(AbstractBuild.java:741)
	at hudson.model.AbstractBuild$AbstractBuildExecution.performAllBuildSteps(AbstractBuild.java:690)
	at hudson.model.Build$BuildExecution.post2(Build.java:186)
	at hudson.model.AbstractBuild$AbstractBuildExecution.post(AbstractBuild.java:635)
	at hudson.model.Run.execute(Run.java:1905)
	at hudson.model.FreeStyleBuild.run(FreeStyleBuild.java:43)
	at hudson.model.ResourceController.execute(ResourceController.java:97)
	at hudson.model.Executor.run(Executor.java:428)
Caused by: java.net.SocketTimeoutException: connect timed out
	at java.net.PlainSocketImpl.socketConnect(Native Method)
	at java.net.AbstractPlainSocketImpl.doConnect(AbstractPlainSocketImpl.java:350)
	at java.net.AbstractPlainSocketImpl.connectToAddress(AbstractPlainSocketImpl.java:206)
	at java.net.AbstractPlainSocketImpl.connect(AbstractPlainSocketImpl.java:188)
	at java.net.SocksSocketImpl.connect(SocksSocketImpl.java:392)
	at java.net.Socket.connect(Socket.java:589)
	at com.sun.mail.util.SocketFetcher.createSocket(SocketFetcher.java:333)
	at com.sun.mail.util.SocketFetcher.getSocket(SocketFetcher.java:193)
	at com.sun.mail.smtp.SMTPTransport.openServer(SMTPTransport.java:2160)
	... 18 more
Finished: FAILURE