FailedConsole Output

Started by user Yuriy Movchan
Running as SYSTEM
Building on master in workspace /home/jenkins/.jenkins/jobs/oxCore_3.1.7/workspace
The recommended git tool is: NONE
No credentials specified
 > git rev-parse --is-inside-work-tree # timeout=10
Fetching changes from the remote Git repository
 > git config remote.origin.url https://github.com/GluuFederation/oxCore # timeout=10
Fetching upstream changes from https://github.com/GluuFederation/oxCore
 > git --version # timeout=10
 > git --version # 'git version 1.8.3.1'
 > git fetch --tags --progress https://github.com/GluuFederation/oxCore +refs/heads/*:refs/remotes/origin/* # timeout=10
 > git rev-parse refs/remotes/origin/version_3.1.6.sp2^{commit} # timeout=10
 > git rev-parse refs/remotes/origin/origin/version_3.1.6.sp2^{commit} # timeout=10
Checking out Revision fdbd9a9e3b96f71e14bfd038cf65c76ff10a7bbf (refs/remotes/origin/version_3.1.6.sp2)
 > git config core.sparsecheckout # timeout=10
 > git checkout -f fdbd9a9e3b96f71e14bfd038cf65c76ff10a7bbf # timeout=10
Commit message: "chore: update log4j"
First time build. Skipping changelog.
[workspace] $ /home/jenkins/.jenkins/tools/hudson.tasks.Maven_MavenInstallation/maven_3.3.9/bin/mvn -DVERSION_NAME=version_3.1.6.sp2 -DMAVEN_SKIP_TESTS=false -Dmaven.test.skip=false clean compile install findbugs:findbugs checkstyle:checkstyle javadoc:javadoc site
[INFO] Scanning for projects...
[INFO] ------------------------------------------------------------------------
[INFO] Reactor Build Order:
[INFO] 
[INFO] oxCore
[INFO] oxLdap-annotations
[INFO] oxUtil
[INFO] oxLdap
[INFO] oxLdapSample
[INFO] oxModel
[INFO] oxSaml
[INFO] oxService
[INFO] oxTomcat
[INFO] oxServer
[INFO] oxGwt
[INFO] oxJsfUtil
[INFO]                                                                         
[INFO] ------------------------------------------------------------------------
[INFO] Building oxCore 3.1.6.sp1
[INFO] ------------------------------------------------------------------------
[INFO] 
[INFO] --- maven-clean-plugin:2.4.1:clean (default-clean) @ oxcore ---
[INFO] Deleting /home/jenkins/.jenkins/jobs/oxCore_3.1.7/workspace/target
[INFO] 
[INFO] --- maven-install-plugin:2.3.1:install (default-install) @ oxcore ---
[INFO] Installing /home/jenkins/.jenkins/jobs/oxCore_3.1.7/workspace/pom.xml to /var/www/html/maven/org/xdi/oxcore/3.1.6.sp1/oxcore-3.1.6.sp1.pom
[INFO] 
[INFO] --- findbugs-maven-plugin:3.0.4:findbugs (default-cli) @ oxcore ---
Downloading: https://repo.maven.apache.org/maven2/commons-lang/commons-lang/2.6/commons-lang-2.6.pom

Downloaded: https://repo.maven.apache.org/maven2/commons-lang/commons-lang/2.6/commons-lang-2.6.pom (0 B at 0.0 KB/sec)
Downloading: https://repo.maven.apache.org/maven2/commons-httpclient/commons-httpclient/3.1/commons-httpclient-3.1.pom

Downloaded: https://repo.maven.apache.org/maven2/commons-httpclient/commons-httpclient/3.1/commons-httpclient-3.1.pom (0 B at 0.0 KB/sec)
Downloading: https://repo.maven.apache.org/maven2/commons-codec/commons-codec/1.2/commons-codec-1.2.pom

Downloaded: https://repo.maven.apache.org/maven2/commons-codec/commons-codec/1.2/commons-codec-1.2.pom (0 B at 0.0 KB/sec)
Downloading: https://repo.maven.apache.org/maven2/commons-validator/commons-validator/1.2.0/commons-validator-1.2.0.pom
2/9 KB   
3/9 KB   
5/9 KB   
6/9 KB   
7/9 KB   
9/9 KB   
9/9 KB   
         
Downloaded: https://repo.maven.apache.org/maven2/commons-validator/commons-validator/1.2.0/commons-validator-1.2.0.pom (9 KB at 354.8 KB/sec)
Downloading: https://repo.maven.apache.org/maven2/org/hamcrest/hamcrest-core/1.3/hamcrest-core-1.3.pom
766/766 B   
            
Downloaded: https://repo.maven.apache.org/maven2/org/hamcrest/hamcrest-core/1.3/hamcrest-core-1.3.pom (766 B at 74.8 KB/sec)
Downloading: https://repo.maven.apache.org/maven2/org/hamcrest/hamcrest-parent/1.3/hamcrest-parent-1.3.pom
2/2 KB      
2/2 KB   
         
Downloaded: https://repo.maven.apache.org/maven2/org/hamcrest/hamcrest-parent/1.3/hamcrest-parent-1.3.pom (2 KB at 175.1 KB/sec)
Downloading: https://repo.maven.apache.org/maven2/commons-io/commons-io/1.4/commons-io-1.4.pom
2/13 KB   
3/13 KB   
5/13 KB   
6/13 KB   
7/13 KB   
9/13 KB   
10/13 KB   
11/13 KB   
13/13 KB   
13/13 KB   
           
Downloaded: https://repo.maven.apache.org/maven2/commons-io/commons-io/1.4/commons-io-1.4.pom (13 KB at 857.2 KB/sec)
Downloading: https://repo.maven.apache.org/maven2/commons-validator/commons-validator/1.2.0/commons-validator-1.2.0.jar
Downloading: https://repo.maven.apache.org/maven2/commons-digester/commons-digester/1.6/commons-digester-1.6.jar
Downloading: https://repo.maven.apache.org/maven2/commons-beanutils/commons-beanutils/1.7.0/commons-beanutils-1.7.0.jar
Downloading: https://repo.maven.apache.org/maven2/commons-codec/commons-codec/1.3/commons-codec-1.3.jar
Downloading: https://repo.maven.apache.org/maven2/commons-logging/commons-logging/1.0.4/commons-logging-1.0.4.jar
2/89 KB    
3/89 KB   
5/89 KB   
6/89 KB   
7/89 KB   
9/89 KB   
10/89 KB   
11/89 KB   
13/89 KB   
14/89 KB   
15/89 KB   
17/89 KB   
18/89 KB   
19/89 KB   
21/89 KB   
22/89 KB   
23/89 KB   
25/89 KB   
26/89 KB   
27/89 KB   
29/89 KB   
30/89 KB   
31/89 KB   
33/89 KB   
34/89 KB   
38/89 KB   
42/89 KB   
46/89 KB   
50/89 KB   
50/89 KB   2/46 KB   
50/89 KB   2/46 KB   2/38 KB   
50/89 KB   2/46 KB   3/38 KB   
50/89 KB   3/46 KB   3/38 KB   
50/89 KB   3/46 KB   5/38 KB   
50/89 KB   3/46 KB   2/165 KB   5/38 KB   
50/89 KB   5/46 KB   2/165 KB   5/38 KB   
50/89 KB   5/46 KB   2/165 KB   6/38 KB   
50/89 KB   5/46 KB   3/165 KB   6/38 KB   
50/89 KB   6/46 KB   3/165 KB   6/38 KB   
50/89 KB   6/46 KB   3/165 KB   7/38 KB   
50/89 KB   6/46 KB   5/165 KB   7/38 KB   
54/89 KB   6/46 KB   5/165 KB   7/38 KB   
54/89 KB   7/46 KB   5/165 KB   7/38 KB   
58/89 KB   7/46 KB   5/165 KB   7/38 KB   
62/89 KB   7/46 KB   5/165 KB   7/38 KB   
66/89 KB   7/46 KB   5/165 KB   7/38 KB   
66/89 KB   7/46 KB   5/165 KB   9/38 KB   
66/89 KB   7/46 KB   6/165 KB   9/38 KB   
66/89 KB   9/46 KB   6/165 KB   9/38 KB   
66/89 KB   9/46 KB   6/165 KB   10/38 KB   
66/89 KB   9/46 KB   7/165 KB   10/38 KB   
66/89 KB   10/46 KB   7/165 KB   10/38 KB   
66/89 KB   10/46 KB   9/165 KB   10/38 KB   
66/89 KB   10/46 KB   9/165 KB   11/38 KB   
66/89 KB   11/46 KB   9/165 KB   11/38 KB   
66/89 KB   11/46 KB   10/165 KB   11/38 KB   
70/89 KB   11/46 KB   10/165 KB   11/38 KB   
70/89 KB   11/46 KB   10/165 KB   13/38 KB   
70/89 KB   13/46 KB   10/165 KB   13/38 KB   
74/89 KB   13/46 KB   11/165 KB   13/38 KB   
78/89 KB   13/46 KB   11/165 KB   14/38 KB   
78/89 KB   13/46 KB   11/165 KB   14/38 KB   
82/89 KB   14/46 KB   11/165 KB   14/38 KB   
82/89 KB   14/46 KB   11/165 KB   15/38 KB   
82/89 KB   14/46 KB   11/165 KB   17/38 KB   
86/89 KB   14/46 KB   11/165 KB   18/38 KB   
86/89 KB   14/46 KB   11/165 KB   2/185 KB   18/38 KB   
74/89 KB   13/46 KB   11/165 KB   13/38 KB   
86/89 KB   14/46 KB   11/165 KB   2/185 KB   19/38 KB   
86/89 KB   14/46 KB   13/165 KB   2/185 KB   19/38 KB   
86/89 KB   14/46 KB   13/165 KB   3/185 KB   21/38 KB   
86/89 KB   14/46 KB   11/165 KB   17/38 KB   
82/89 KB   14/46 KB   11/165 KB   14/38 KB   
86/89 KB   14/46 KB   13/165 KB   3/185 KB   22/38 KB   
89/89 KB   14/46 KB   13/165 KB   3/185 KB   22/38 KB   
89/89 KB   14/46 KB   14/165 KB   3/185 KB   22/38 KB   
89/89 KB   15/46 KB   14/165 KB   3/185 KB   22/38 KB   
89/89 KB   15/46 KB   14/165 KB   3/185 KB   23/38 KB   
89/89 KB   15/46 KB   15/165 KB   3/185 KB   23/38 KB   
89/89 KB   17/46 KB   15/165 KB   3/185 KB   23/38 KB   
89/89 KB   17/46 KB   17/165 KB   3/185 KB   23/38 KB   
89/89 KB   18/46 KB   17/165 KB   3/185 KB   25/38 KB   
89/89 KB   18/46 KB   18/165 KB   3/185 KB   25/38 KB   
89/89 KB   19/46 KB   18/165 KB   3/185 KB   25/38 KB   
89/89 KB   19/46 KB   19/165 KB   3/185 KB   25/38 KB   
89/89 KB   21/46 KB   19/165 KB   3/185 KB   25/38 KB   
89/89 KB   21/46 KB   21/165 KB   3/185 KB   25/38 KB   
89/89 KB   22/46 KB   21/165 KB   3/185 KB   25/38 KB   
89/89 KB   22/46 KB   22/165 KB   3/185 KB   25/38 KB   
86/89 KB   14/46 KB   13/165 KB   3/185 KB   21/38 KB   
89/89 KB   23/46 KB   22/165 KB   3/185 KB   25/38 KB   
89/89 KB   23/46 KB   23/165 KB   3/185 KB   25/38 KB   
89/89 KB   25/46 KB   23/165 KB   3/185 KB   25/38 KB   
89/89 KB   25/46 KB   25/165 KB   5/185 KB   25/38 KB   
89/89 KB   18/46 KB   17/165 KB   3/185 KB   25/38 KB   
89/89 KB   26/46 KB   25/165 KB   5/185 KB   25/38 KB   
89/89 KB   26/46 KB   26/165 KB   5/185 KB   25/38 KB   
89/89 KB   27/46 KB   26/165 KB   5/185 KB   25/38 KB   
89/89 KB   27/46 KB   27/165 KB   5/185 KB   25/38 KB   
89/89 KB   27/46 KB   27/165 KB   5/185 KB   26/38 KB   
89/89 KB   29/46 KB   27/165 KB   5/185 KB   26/38 KB   
89/89 KB   29/46 KB   29/165 KB   5/185 KB   26/38 KB   
89/89 KB   29/46 KB   29/165 KB   5/185 KB   27/38 KB   
89/89 KB   30/46 KB   30/165 KB   5/185 KB   27/38 KB   
89/89 KB   31/46 KB   30/165 KB   5/185 KB   27/38 KB   
89/89 KB   31/46 KB   30/165 KB   5/185 KB   29/38 KB   
89/89 KB   33/46 KB   30/165 KB   5/185 KB   29/38 KB   
89/89 KB   33/46 KB   30/165 KB   5/185 KB   30/38 KB   
89/89 KB   34/46 KB   30/165 KB   5/185 KB   30/38 KB   
89/89 KB   35/46 KB   30/165 KB   5/185 KB   30/38 KB   
89/89 KB   35/46 KB   30/165 KB   5/185 KB   31/38 KB   
89/89 KB   37/46 KB   30/165 KB   5/185 KB   31/38 KB   
89/89 KB   37/46 KB   30/165 KB   5/185 KB   33/38 KB   
89/89 KB   38/46 KB   30/165 KB   5/185 KB   33/38 KB   
89/89 KB   39/46 KB   30/165 KB   5/185 KB   34/38 KB   
89/89 KB   25/46 KB   25/165 KB   5/185 KB   25/38 KB   
89/89 KB   41/46 KB   30/165 KB   5/185 KB   34/38 KB   
89/89 KB   42/46 KB   30/165 KB   5/185 KB   34/38 KB   
89/89 KB   42/46 KB   30/165 KB   6/185 KB   34/38 KB   
89/89 KB   43/46 KB   30/165 KB   6/185 KB   34/38 KB   
89/89 KB   45/46 KB   30/165 KB   6/185 KB   34/38 KB   
89/89 KB   45/46 KB   30/165 KB   7/185 KB   34/38 KB   
89/89 KB   46/46 KB   30/165 KB   7/185 KB   34/38 KB   
89/89 KB   46/46 KB   30/165 KB   9/185 KB   34/38 KB   
89/89 KB   46/46 KB   30/165 KB   9/185 KB   34/38 KB   
89/89 KB   46/46 KB   30/165 KB   10/185 KB   34/38 KB   
89/89 KB   46/46 KB   30/165 KB   11/185 KB   34/38 KB   
89/89 KB   46/46 KB   30/165 KB   13/185 KB   34/38 KB   
89/89 KB   46/46 KB   30/165 KB   14/185 KB   34/38 KB   
89/89 KB   46/46 KB   30/165 KB   15/185 KB   34/38 KB   
89/89 KB   46/46 KB   30/165 KB   17/185 KB   34/38 KB   
89/89 KB   46/46 KB   30/165 KB   18/185 KB   34/38 KB   
89/89 KB   39/46 KB   30/165 KB   5/185 KB   34/38 KB   
89/89 KB   46/46 KB   30/165 KB   19/185 KB   34/38 KB   
89/89 KB   46/46 KB   30/165 KB   19/185 KB   35/38 KB   
89/89 KB   46/46 KB   30/165 KB   21/185 KB   35/38 KB   
89/89 KB   46/46 KB   30/165 KB   21/185 KB   37/38 KB   
                                                         
Downloaded: https://repo.maven.apache.org/maven2/commons-validator/commons-validator/1.2.0/commons-validator-1.2.0.jar (89 KB at 3559.1 KB/sec)
46/46 KB   30/165 KB   21/185 KB   38/38 KB              
Downloading: https://repo.maven.apache.org/maven2/commons-chain/commons-chain/1.1/commons-chain-1.1.jar
89/89 KB   30/46 KB   30/165 KB   5/185 KB   27/38 KB   
46/46 KB   30/165 KB   22/185 KB   38/38 KB   
46/46 KB   31/165 KB   23/185 KB   38/38 KB   
46/46 KB   31/165 KB   23/185 KB   38/38 KB   
46/46 KB   31/165 KB   25/185 KB   38/38 KB   
46/46 KB   33/165 KB   25/185 KB   38/38 KB   
46/46 KB   33/165 KB   26/185 KB   38/38 KB   
46/46 KB   34/165 KB   26/185 KB   38/38 KB   
46/46 KB   34/165 KB   27/185 KB   38/38 KB   
46/46 KB   35/165 KB   27/185 KB   38/38 KB   
46/46 KB   35/165 KB   29/185 KB   38/38 KB   
46/46 KB   35/165 KB   30/185 KB   38/38 KB   
46/46 KB   37/165 KB   30/185 KB   38/38 KB   
                                              
37/165 KB   31/185 KB   38/38 KB              
38/165 KB   31/185 KB   38/38 KB   
Downloaded: https://repo.maven.apache.org/maven2/commons-codec/commons-codec/1.3/commons-codec-1.3.jar (46 KB at 1629.6 KB/sec)
Downloading: https://repo.maven.apache.org/maven2/commons-collections/commons-collections/3.2.1/commons-collections-3.2.1.jar
39/165 KB   31/185 KB   38/38 KB   
39/165 KB   33/185 KB   38/38 KB   
41/165 KB   33/185 KB   38/38 KB   
41/165 KB   34/185 KB   38/38 KB   
42/165 KB   34/185 KB   38/38 KB   
43/165 KB   34/185 KB   38/38 KB   
43/165 KB   35/185 KB   38/38 KB   
45/165 KB   35/185 KB   38/38 KB   
45/165 KB   37/185 KB   38/38 KB   
46/165 KB   37/185 KB   38/38 KB   
47/165 KB   37/185 KB   38/38 KB   
47/165 KB   38/185 KB   38/38 KB   
49/165 KB   38/185 KB   38/38 KB   
49/165 KB   39/185 KB   38/38 KB   
50/165 KB   39/185 KB   38/38 KB   
51/165 KB   39/185 KB   38/38 KB   
51/165 KB   41/185 KB   38/38 KB   
                                   
53/165 KB   41/185 KB              
53/165 KB   42/185 KB   
54/165 KB   42/185 KB   
Downloaded: https://repo.maven.apache.org/maven2/commons-logging/commons-logging/1.0.4/commons-logging-1.0.4.jar (38 KB at 1237.5 KB/sec)
Downloading: https://repo.maven.apache.org/maven2/commons-io/commons-io/1.4/commons-io-1.4.jar
54/165 KB   43/185 KB   
55/165 KB   43/185 KB   
55/165 KB   45/185 KB   
57/165 KB   45/185 KB   
57/165 KB   46/185 KB   
58/165 KB   46/185 KB   
59/165 KB   46/185 KB   
59/165 KB   47/185 KB   
61/165 KB   47/185 KB   
61/165 KB   49/185 KB   
62/165 KB   49/185 KB   
62/165 KB   49/185 KB   4/88 KB   
62/165 KB   49/185 KB   8/88 KB   
63/165 KB   49/185 KB   12/88 KB   
63/165 KB   49/185 KB   12/88 KB   
63/165 KB   49/185 KB   16/88 KB   
63/165 KB   50/185 KB   16/88 KB   
65/165 KB   50/185 KB   16/88 KB   
65/165 KB   51/185 KB   16/88 KB   
65/165 KB   53/185 KB   16/88 KB   
65/165 KB   54/185 KB   16/88 KB   
65/165 KB   54/185 KB   2/562 KB   16/88 KB   
65/165 KB   55/185 KB   2/562 KB   16/88 KB   
65/165 KB   55/185 KB   3/562 KB   16/88 KB   
65/165 KB   57/185 KB   3/562 KB   16/88 KB   
65/165 KB   57/185 KB   5/562 KB   16/88 KB   
65/165 KB   58/185 KB   5/562 KB   16/88 KB   
65/165 KB   58/185 KB   6/562 KB   16/88 KB   
65/165 KB   59/185 KB   6/562 KB   16/88 KB   
65/165 KB   59/185 KB   7/562 KB   16/88 KB   
69/165 KB   59/185 KB   7/562 KB   16/88 KB   
69/165 KB   61/185 KB   7/562 KB   16/88 KB   
69/165 KB   61/185 KB   9/562 KB   16/88 KB   
73/165 KB   61/185 KB   9/562 KB   16/88 KB   
77/165 KB   61/185 KB   9/562 KB   16/88 KB   
81/165 KB   61/185 KB   9/562 KB   16/88 KB   
81/165 KB   61/185 KB   10/562 KB   16/88 KB   
81/165 KB   62/185 KB   10/562 KB   16/88 KB   
81/165 KB   62/185 KB   10/562 KB   20/88 KB   
81/165 KB   62/185 KB   11/562 KB   20/88 KB   
81/165 KB   62/185 KB   11/562 KB   24/88 KB   
81/165 KB   63/185 KB   11/562 KB   28/88 KB   
81/165 KB   63/185 KB   11/562 KB   32/88 KB   
81/165 KB   63/185 KB   13/562 KB   32/88 KB   
81/165 KB   63/185 KB   14/562 KB   32/88 KB   
81/165 KB   63/185 KB   15/562 KB   32/88 KB   
81/165 KB   63/185 KB   17/562 KB   32/88 KB   
81/165 KB   63/185 KB   18/562 KB   32/88 KB   
81/165 KB   63/185 KB   18/562 KB   32/88 KB   2/107 KB   
85/165 KB   63/185 KB   18/562 KB   36/88 KB   2/107 KB   
85/165 KB   63/185 KB   18/562 KB   36/88 KB   3/107 KB   
85/165 KB   63/185 KB   18/562 KB   40/88 KB   3/107 KB   
85/165 KB   63/185 KB   18/562 KB   44/88 KB   3/107 KB   
85/165 KB   63/185 KB   18/562 KB   48/88 KB   3/107 KB   
85/165 KB   63/185 KB   18/562 KB   48/88 KB   5/107 KB   
85/165 KB   63/185 KB   22/562 KB   48/88 KB   5/107 KB   
85/165 KB   63/185 KB   26/562 KB   48/88 KB   5/107 KB   
85/165 KB   63/185 KB   26/562 KB   48/88 KB   6/107 KB   
85/165 KB   63/185 KB   30/562 KB   48/88 KB   6/107 KB   
85/165 KB   63/185 KB   34/562 KB   48/88 KB   6/107 KB   
85/165 KB   63/185 KB   34/562 KB   48/88 KB   7/107 KB   
85/165 KB   63/185 KB   34/562 KB   48/88 KB   9/107 KB   
85/165 KB   63/185 KB   34/562 KB   48/88 KB   10/107 KB   
85/165 KB   63/185 KB   38/562 KB   48/88 KB   10/107 KB   
85/165 KB   63/185 KB   42/562 KB   48/88 KB   10/107 KB   
85/165 KB   63/185 KB   42/562 KB   48/88 KB   11/107 KB   
85/165 KB   63/185 KB   46/562 KB   48/88 KB   11/107 KB   
85/165 KB   63/185 KB   50/562 KB   48/88 KB   11/107 KB   
85/165 KB   63/185 KB   50/562 KB   48/88 KB   13/107 KB   
85/165 KB   63/185 KB   50/562 KB   48/88 KB   14/107 KB   
85/165 KB   63/185 KB   50/562 KB   52/88 KB   14/107 KB   
85/165 KB   63/185 KB   50/562 KB   56/88 KB   14/107 KB   
85/165 KB   63/185 KB   50/562 KB   56/88 KB   15/107 KB   
85/165 KB   63/185 KB   50/562 KB   60/88 KB   15/107 KB   
85/165 KB   63/185 KB   54/562 KB   64/88 KB   15/107 KB   
85/165 KB   63/185 KB   54/562 KB   64/88 KB   17/107 KB   
85/165 KB   63/185 KB   58/562 KB   64/88 KB   17/107 KB   
85/165 KB   63/185 KB   62/562 KB   64/88 KB   17/107 KB   
85/165 KB   63/185 KB   66/562 KB   64/88 KB   17/107 KB   
85/165 KB   63/185 KB   66/562 KB   64/88 KB   18/107 KB   
85/165 KB   63/185 KB   66/562 KB   64/88 KB   19/107 KB   
85/165 KB   63/185 KB   66/562 KB   64/88 KB   21/107 KB   
85/165 KB   63/185 KB   70/562 KB   64/88 KB   21/107 KB   
85/165 KB   63/185 KB   74/562 KB   64/88 KB   21/107 KB   
85/165 KB   63/185 KB   74/562 KB   64/88 KB   22/107 KB   
85/165 KB   63/185 KB   78/562 KB   64/88 KB   22/107 KB   
85/165 KB   63/185 KB   82/562 KB   64/88 KB   22/107 KB   
85/165 KB   63/185 KB   82/562 KB   64/88 KB   23/107 KB   
85/165 KB   63/185 KB   82/562 KB   64/88 KB   25/107 KB   
85/165 KB   63/185 KB   82/562 KB   64/88 KB   26/107 KB   
85/165 KB   63/185 KB   86/562 KB   64/88 KB   26/107 KB   
85/165 KB   63/185 KB   90/562 KB   64/88 KB   26/107 KB   
85/165 KB   63/185 KB   94/562 KB   64/88 KB   26/107 KB   
85/165 KB   63/185 KB   98/562 KB   64/88 KB   26/107 KB   
85/165 KB   63/185 KB   102/562 KB   64/88 KB   26/107 KB   
81/165 KB   63/185 KB   11/562 KB   28/88 KB   
85/165 KB   63/185 KB   106/562 KB   64/88 KB   30/107 KB   
85/165 KB   63/185 KB   110/562 KB   64/88 KB   30/107 KB   
85/165 KB   63/185 KB   114/562 KB   64/88 KB   30/107 KB   
85/165 KB   65/185 KB   114/562 KB   64/88 KB   30/107 KB   
85/165 KB   65/185 KB   118/562 KB   64/88 KB   30/107 KB   
85/165 KB   65/185 KB   122/562 KB   64/88 KB   30/107 KB   
85/165 KB   65/185 KB   126/562 KB   64/88 KB   30/107 KB   
85/165 KB   65/185 KB   130/562 KB   64/88 KB   30/107 KB   
85/165 KB   69/185 KB   130/562 KB   64/88 KB   30/107 KB   
85/165 KB   73/185 KB   130/562 KB   64/88 KB   30/107 KB   
85/165 KB   77/185 KB   130/562 KB   64/88 KB   30/107 KB   
85/165 KB   81/185 KB   130/562 KB   64/88 KB   30/107 KB   
85/165 KB   81/185 KB   134/562 KB   64/88 KB   30/107 KB   
85/165 KB   81/185 KB   138/562 KB   64/88 KB   30/107 KB   
85/165 KB   63/185 KB   102/562 KB   64/88 KB   30/107 KB   
85/165 KB   81/185 KB   142/562 KB   64/88 KB   30/107 KB   
85/165 KB   81/185 KB   146/562 KB   64/88 KB   30/107 KB   
85/165 KB   81/185 KB   146/562 KB   64/88 KB   34/107 KB   
85/165 KB   81/185 KB   146/562 KB   64/88 KB   38/107 KB   
85/165 KB   81/185 KB   146/562 KB   64/88 KB   42/107 KB   
85/165 KB   85/185 KB   146/562 KB   64/88 KB   42/107 KB   
85/165 KB   89/185 KB   146/562 KB   64/88 KB   42/107 KB   
85/165 KB   93/185 KB   146/562 KB   64/88 KB   42/107 KB   
85/165 KB   97/185 KB   146/562 KB   64/88 KB   42/107 KB   
85/165 KB   97/185 KB   150/562 KB   64/88 KB   42/107 KB   
85/165 KB   97/185 KB   150/562 KB   64/88 KB   46/107 KB   
85/165 KB   97/185 KB   154/562 KB   64/88 KB   46/107 KB   
85/165 KB   97/185 KB   154/562 KB   64/88 KB   50/107 KB   
85/165 KB   97/185 KB   158/562 KB   64/88 KB   50/107 KB   
85/165 KB   97/185 KB   158/562 KB   64/88 KB   54/107 KB   
85/165 KB   97/185 KB   162/562 KB   64/88 KB   54/107 KB   
85/165 KB   97/185 KB   162/562 KB   64/88 KB   58/107 KB   
85/165 KB   101/185 KB   162/562 KB   64/88 KB   58/107 KB   
85/165 KB   105/185 KB   162/562 KB   64/88 KB   58/107 KB   
85/165 KB   109/185 KB   162/562 KB   64/88 KB   58/107 KB   
85/165 KB   113/185 KB   162/562 KB   64/88 KB   58/107 KB   
85/165 KB   63/185 KB   54/562 KB   64/88 KB   15/107 KB   
85/165 KB   113/185 KB   162/562 KB   64/88 KB   62/107 KB   
85/165 KB   113/185 KB   166/562 KB   64/88 KB   62/107 KB   
85/165 KB   113/185 KB   166/562 KB   64/88 KB   66/107 KB   
85/165 KB   113/185 KB   170/562 KB   64/88 KB   66/107 KB   
85/165 KB   113/185 KB   170/562 KB   64/88 KB   70/107 KB   
85/165 KB   113/185 KB   174/562 KB   64/88 KB   70/107 KB   
85/165 KB   113/185 KB   174/562 KB   64/88 KB   74/107 KB   
85/165 KB   113/185 KB   178/562 KB   64/88 KB   74/107 KB   
85/165 KB   113/185 KB   178/562 KB   68/88 KB   74/107 KB   
85/165 KB   113/185 KB   178/562 KB   72/88 KB   74/107 KB   
85/165 KB   117/185 KB   178/562 KB   72/88 KB   74/107 KB   
85/165 KB   117/185 KB   178/562 KB   76/88 KB   74/107 KB   
85/165 KB   121/185 KB   178/562 KB   80/88 KB   74/107 KB   
85/165 KB   63/185 KB   18/562 KB   32/88 KB   2/107 KB   
85/165 KB   121/185 KB   178/562 KB   80/88 KB   78/107 KB   
89/165 KB   121/185 KB   178/562 KB   80/88 KB   78/107 KB   
89/165 KB   121/185 KB   182/562 KB   80/88 KB   78/107 KB   
89/165 KB   121/185 KB   182/562 KB   80/88 KB   82/107 KB   
93/165 KB   121/185 KB   182/562 KB   80/88 KB   82/107 KB   
93/165 KB   121/185 KB   186/562 KB   80/88 KB   82/107 KB   
93/165 KB   121/185 KB   186/562 KB   80/88 KB   86/107 KB   
93/165 KB   121/185 KB   186/562 KB   84/88 KB   86/107 KB   
97/165 KB   121/185 KB   186/562 KB   84/88 KB   86/107 KB   
97/165 KB   121/185 KB   186/562 KB   84/88 KB   90/107 KB   
97/165 KB   121/185 KB   190/562 KB   84/88 KB   90/107 KB   
97/165 KB   121/185 KB   190/562 KB   88/88 KB   90/107 KB   
97/165 KB   121/185 KB   194/562 KB   88/88 KB   90/107 KB   
97/165 KB   121/185 KB   194/562 KB   88/88 KB   94/107 KB   
97/165 KB   121/185 KB   194/562 KB   88/88 KB   98/107 KB   
97/165 KB   121/185 KB   194/562 KB   88/88 KB   102/107 KB   
97/165 KB   121/185 KB   198/562 KB   88/88 KB   102/107 KB   
97/165 KB   121/185 KB   198/562 KB   88/88 KB   106/107 KB   
97/165 KB   121/185 KB   202/562 KB   88/88 KB   106/107 KB   
97/165 KB   121/185 KB   206/562 KB   88/88 KB   106/107 KB   
97/165 KB   121/185 KB   206/562 KB   88/88 KB   107/107 KB   
101/165 KB   121/185 KB   206/562 KB   88/88 KB   107/107 KB   
101/165 KB   121/185 KB   210/562 KB   88/88 KB   107/107 KB   
105/165 KB   121/185 KB   210/562 KB   88/88 KB   107/107 KB   
109/165 KB   121/185 KB   210/562 KB   88/88 KB   107/107 KB   
113/165 KB   121/185 KB   210/562 KB   88/88 KB   107/107 KB   
113/165 KB   121/185 KB   214/562 KB   88/88 KB   107/107 KB   
113/165 KB   121/185 KB   218/562 KB   88/88 KB   107/107 KB   
113/165 KB   121/185 KB   222/562 KB   88/88 KB   107/107 KB   
113/165 KB   121/185 KB   226/562 KB   88/88 KB   107/107 KB   
117/165 KB   121/185 KB   226/562 KB   88/88 KB   107/107 KB   
121/165 KB   121/185 KB   226/562 KB   88/88 KB   107/107 KB   
121/165 KB   121/185 KB   230/562 KB   88/88 KB   107/107 KB   
125/165 KB   121/185 KB   230/562 KB   88/88 KB   107/107 KB   
125/165 KB   121/185 KB   234/562 KB   88/88 KB   107/107 KB   
129/165 KB   121/185 KB   234/562 KB   88/88 KB   107/107 KB   
129/165 KB   121/185 KB   238/562 KB   88/88 KB   107/107 KB   
129/165 KB   121/185 KB   242/562 KB   88/88 KB   107/107 KB   
129/165 KB   121/185 KB   246/562 KB   88/88 KB   107/107 KB   
129/165 KB   121/185 KB   250/562 KB   88/88 KB   107/107 KB   
129/165 KB   121/185 KB   254/562 KB   88/88 KB   107/107 KB   
129/165 KB   121/185 KB   258/562 KB   88/88 KB   107/107 KB   
133/165 KB   121/185 KB   258/562 KB   88/88 KB   107/107 KB   
137/165 KB   121/185 KB   258/562 KB   88/88 KB   107/107 KB   
141/165 KB   121/185 KB   258/562 KB   88/88 KB   107/107 KB   
145/165 KB   121/185 KB   258/562 KB   88/88 KB   107/107 KB   
145/165 KB   121/185 KB   262/562 KB   88/88 KB   107/107 KB   
145/165 KB   121/185 KB   266/562 KB   88/88 KB   107/107 KB   
145/165 KB   121/185 KB   270/562 KB   88/88 KB   107/107 KB   
145/165 KB   121/185 KB   274/562 KB   88/88 KB   107/107 KB   
149/165 KB   121/185 KB   274/562 KB   88/88 KB   107/107 KB   
149/165 KB   121/185 KB   278/562 KB   88/88 KB   107/107 KB   
153/165 KB   121/185 KB   282/562 KB   88/88 KB   107/107 KB   
85/165 KB   121/185 KB   178/562 KB   80/88 KB   74/107 KB   
153/165 KB   121/185 KB   286/562 KB   88/88 KB   107/107 KB   
153/165 KB   121/185 KB   290/562 KB   88/88 KB   107/107 KB   
                                                               
Downloaded: https://repo.maven.apache.org/maven2/commons-io/commons-io/1.4/commons-io-1.4.jar (107 KB at 2047.8 KB/sec)
153/165 KB   125/185 KB   294/562 KB   88/88 KB                
153/165 KB   125/185 KB   298/562 KB   88/88 KB   
153/165 KB   125/185 KB   302/562 KB   88/88 KB   
153/165 KB   125/185 KB   306/562 KB   88/88 KB   
153/165 KB   121/185 KB   278/562 KB   88/88 KB   107/107 KB   
157/165 KB   125/185 KB   306/562 KB   88/88 KB   
161/165 KB   125/185 KB   306/562 KB   88/88 KB   
153/165 KB   125/185 KB   290/562 KB   88/88 KB   107/107 KB   
165/165 KB   125/185 KB   306/562 KB   88/88 KB   
165/165 KB   125/185 KB   306/562 KB   88/88 KB   
165/165 KB   129/185 KB   306/562 KB   88/88 KB   
165/165 KB   129/185 KB   310/562 KB   88/88 KB   
165/165 KB   129/185 KB   314/562 KB   88/88 KB   
165/165 KB   129/185 KB   318/562 KB   88/88 KB   
165/165 KB   129/185 KB   321/562 KB   88/88 KB   
165/165 KB   133/185 KB   321/562 KB   88/88 KB   
165/165 KB   137/185 KB   321/562 KB   88/88 KB   
165/165 KB   141/185 KB   321/562 KB   88/88 KB   
165/165 KB   145/185 KB   321/562 KB   88/88 KB   
165/165 KB   145/185 KB   325/562 KB   88/88 KB   
165/165 KB   149/185 KB   325/562 KB   88/88 KB   
165/165 KB   153/185 KB   325/562 KB   88/88 KB   
165/165 KB   153/185 KB   329/562 KB   88/88 KB   
165/165 KB   157/185 KB   329/562 KB   88/88 KB   
165/165 KB   157/185 KB   333/562 KB   88/88 KB   
165/165 KB   161/185 KB   333/562 KB   88/88 KB   
165/165 KB   161/185 KB   337/562 KB   88/88 KB   
165/165 KB   165/185 KB   337/562 KB   88/88 KB   
165/165 KB   169/185 KB   337/562 KB   88/88 KB   
165/165 KB   173/185 KB   337/562 KB   88/88 KB   
165/165 KB   177/185 KB   337/562 KB   88/88 KB   
165/165 KB   177/185 KB   341/562 KB   88/88 KB   
165/165 KB   181/185 KB   341/562 KB   88/88 KB   
165/165 KB   181/185 KB   345/562 KB   88/88 KB   
165/165 KB   185/185 KB   345/562 KB   88/88 KB   
165/165 KB   185/185 KB   349/562 KB   88/88 KB   
165/165 KB   185/185 KB   353/562 KB   88/88 KB   
165/165 KB   185/185 KB   357/562 KB   88/88 KB   
165/165 KB   185/185 KB   361/562 KB   88/88 KB   
165/165 KB   185/185 KB   365/562 KB   88/88 KB   
165/165 KB   185/185 KB   369/562 KB   88/88 KB   
                                                  
165/165 KB   185/185 KB   373/562 KB              
165/165 KB   185/185 KB   377/562 KB   
Downloaded: https://repo.maven.apache.org/maven2/commons-chain/commons-chain/1.1/commons-chain-1.1.jar (88 KB at 1542.0 KB/sec)
165/165 KB   185/185 KB   381/562 KB   
165/165 KB   185/185 KB   385/562 KB   
                                       
Downloaded: https://repo.maven.apache.org/maven2/commons-digester/commons-digester/1.6/commons-digester-1.6.jar (165 KB at 2788.1 KB/sec)
185/185 KB   389/562 KB                
185/185 KB   393/562 KB   
185/185 KB   397/562 KB   
185/185 KB   401/562 KB   
185/185 KB   405/562 KB   
185/185 KB   409/562 KB   
185/185 KB   413/562 KB   
185/185 KB   417/562 KB   
                          
421/562 KB                
425/562 KB   
Downloaded: https://repo.maven.apache.org/maven2/commons-beanutils/commons-beanutils/1.7.0/commons-beanutils-1.7.0.jar (185 KB at 3020.5 KB/sec)
429/562 KB   
433/562 KB   
437/562 KB   
441/562 KB   
445/562 KB   
449/562 KB   
453/562 KB   
457/562 KB   
461/562 KB   
465/562 KB   
469/562 KB   
473/562 KB   
477/562 KB   
481/562 KB   
485/562 KB   
489/562 KB   
493/562 KB   
497/562 KB   
501/562 KB   
505/562 KB   
509/562 KB   
513/562 KB   
517/562 KB   
521/562 KB   
525/562 KB   
529/562 KB   
533/562 KB   
535/562 KB   
539/562 KB   
543/562 KB   
547/562 KB   
551/562 KB   
555/562 KB   
559/562 KB   
562/562 KB   
             
Downloaded: https://repo.maven.apache.org/maven2/commons-collections/commons-collections/3.2.1/commons-collections-3.2.1.jar (562 KB at 7804.2 KB/sec)
[INFO] 
[INFO] --- maven-checkstyle-plugin:3.0.0:checkstyle (default-cli) @ oxcore ---
Downloading: https://repo.maven.apache.org/maven2/commons-beanutils/commons-beanutils/1.9.2/commons-beanutils-1.9.2.pom
4/14 KB      
8/14 KB   
12/14 KB   
14/14 KB   
           
Downloaded: https://repo.maven.apache.org/maven2/commons-beanutils/commons-beanutils/1.9.2/commons-beanutils-1.9.2.pom (14 KB at 1270.0 KB/sec)
Downloading: https://repo.maven.apache.org/maven2/commons-cli/commons-cli/1.3.1/commons-cli-1.3.1.pom
           
Downloaded: https://repo.maven.apache.org/maven2/commons-cli/commons-cli/1.3.1/commons-cli-1.3.1.pom (0 B at 0.0 KB/sec)
Downloading: https://repo.maven.apache.org/maven2/commons-validator/commons-validator/1.3.1/commons-validator-1.3.1.jar
Downloading: https://repo.maven.apache.org/maven2/commons-beanutils/commons-beanutils/1.9.2/commons-beanutils-1.9.2.jar
Downloading: https://repo.maven.apache.org/maven2/commons-cli/commons-cli/1.3.1/commons-cli-1.3.1.jar
           
Downloaded: https://repo.maven.apache.org/maven2/commons-cli/commons-cli/1.3.1/commons-cli-1.3.1.jar (0 B at 0.0 KB/sec)
4/229 KB   
8/229 KB   
12/229 KB   
16/229 KB   
20/229 KB   
24/229 KB   
28/229 KB   
32/229 KB   
36/229 KB   
40/229 KB   
44/229 KB   
48/229 KB   
52/229 KB   
56/229 KB   
60/229 KB   
64/229 KB   
68/229 KB   
72/229 KB   
76/229 KB   
80/229 KB   
84/229 KB   
88/229 KB   
92/229 KB   
96/229 KB   
100/229 KB   
104/229 KB   
108/229 KB   
112/229 KB   
116/229 KB   
120/229 KB   
124/229 KB   
128/229 KB   
132/229 KB   
136/229 KB   
140/229 KB   
144/229 KB   
148/229 KB   
152/229 KB   
156/229 KB   
160/229 KB   
164/229 KB   
168/229 KB   
172/229 KB   
176/229 KB   
180/229 KB   
184/229 KB   
188/229 KB   
192/229 KB   
196/229 KB   
200/229 KB   
204/229 KB   
208/229 KB   
212/229 KB   
216/229 KB   
220/229 KB   
224/229 KB   
228/229 KB   
229/229 KB   
             
Downloaded: https://repo.maven.apache.org/maven2/commons-beanutils/commons-beanutils/1.9.2/commons-beanutils-1.9.2.jar (229 KB at 10875.1 KB/sec)
4/136 KB     
8/136 KB   
12/136 KB   
16/136 KB   
20/136 KB   
24/136 KB   
28/136 KB   
32/136 KB   
36/136 KB   
40/136 KB   
44/136 KB   
48/136 KB   
52/136 KB   
56/136 KB   
60/136 KB   
64/136 KB   
68/136 KB   
72/136 KB   
76/136 KB   
80/136 KB   
84/136 KB   
88/136 KB   
92/136 KB   
96/136 KB   
100/136 KB   
104/136 KB   
108/136 KB   
112/136 KB   
116/136 KB   
120/136 KB   
124/136 KB   
128/136 KB   
132/136 KB   
136/136 KB   
             
Downloaded: https://repo.maven.apache.org/maven2/commons-validator/commons-validator/1.3.1/commons-validator-1.3.1.jar (136 KB at 2423.2 KB/sec)
[INFO] 
[INFO] >>> maven-javadoc-plugin:3.0.1:javadoc (default-cli) > generate-sources @ oxcore >>>
[INFO] 
[INFO] <<< maven-javadoc-plugin:3.0.1:javadoc (default-cli) < generate-sources @ oxcore <<<
[INFO] 
[INFO] --- maven-javadoc-plugin:3.0.1:javadoc (default-cli) @ oxcore ---
Downloading: https://repo.maven.apache.org/maven2/commons-logging/commons-logging/1.2/commons-logging-1.2.pom
             
Downloaded: https://repo.maven.apache.org/maven2/commons-logging/commons-logging/1.2/commons-logging-1.2.pom (0 B at 0.0 KB/sec)
Downloading: https://repo.maven.apache.org/maven2/commons-codec/commons-codec/1.9/commons-codec-1.9.pom
             
Downloaded: https://repo.maven.apache.org/maven2/commons-codec/commons-codec/1.9/commons-codec-1.9.pom (0 B at 0.0 KB/sec)
Downloading: https://repo.maven.apache.org/maven2/commons-digester/commons-digester/1.8/commons-digester-1.8.jar
Downloading: https://repo.maven.apache.org/maven2/commons-logging/commons-logging/1.2/commons-logging-1.2.jar
4/141 KB     
8/141 KB   
12/141 KB   
16/141 KB   
20/141 KB   
24/141 KB   
28/141 KB   
32/141 KB   
36/141 KB   
40/141 KB   
44/141 KB   
48/141 KB   
52/141 KB   
56/141 KB   
60/141 KB   
64/141 KB   
68/141 KB   
72/141 KB   
76/141 KB   
80/141 KB   
84/141 KB   
88/141 KB   
92/141 KB   
96/141 KB   
100/141 KB   
104/141 KB   
108/141 KB   
112/141 KB   
116/141 KB   
120/141 KB   
124/141 KB   
128/141 KB   
             
132/141 KB   
136/141 KB   
Downloaded: https://repo.maven.apache.org/maven2/commons-logging/commons-logging/1.2/commons-logging-1.2.jar (0 B at 0.0 KB/sec)
140/141 KB   
141/141 KB   
             
Downloaded: https://repo.maven.apache.org/maven2/commons-digester/commons-digester/1.8/commons-digester-1.8.jar (141 KB at 10016.9 KB/sec)
[INFO] 
[INFO] --- maven-site-plugin:2.1.1:site (default-site) @ oxcore ---
Downloading: https://repo.maven.apache.org/maven2/commons-httpclient/commons-httpclient/3.1/commons-httpclient-3.1.jar
Downloading: https://repo.maven.apache.org/maven2/commons-codec/commons-codec/1.2/commons-codec-1.2.jar
Downloading: https://repo.maven.apache.org/maven2/commons-collections/commons-collections/3.2/commons-collections-3.2.jar
             
Downloaded: https://repo.maven.apache.org/maven2/commons-httpclient/commons-httpclient/3.1/commons-httpclient-3.1.jar (0 B at 0.0 KB/sec)
4/558 KB     
8/558 KB   
12/558 KB   
16/558 KB   
20/558 KB   
20/558 KB   4/30 KB   
24/558 KB   4/30 KB   
28/558 KB   4/30 KB   
28/558 KB   8/30 KB   
32/558 KB   8/30 KB   
32/558 KB   12/30 KB   
32/558 KB   16/30 KB   
36/558 KB   16/30 KB   
40/558 KB   16/30 KB   
40/558 KB   20/30 KB   
44/558 KB   20/30 KB   
44/558 KB   24/30 KB   
48/558 KB   24/30 KB   
48/558 KB   28/30 KB   
48/558 KB   30/30 KB   
52/558 KB   30/30 KB   
56/558 KB   30/30 KB   
60/558 KB   30/30 KB   
64/558 KB   30/30 KB   
68/558 KB   30/30 KB   
72/558 KB   30/30 KB   
76/558 KB   30/30 KB   
80/558 KB   30/30 KB   
84/558 KB   30/30 KB   
88/558 KB   30/30 KB   
92/558 KB   30/30 KB   
96/558 KB   30/30 KB   
100/558 KB   30/30 KB   
104/558 KB   30/30 KB   
108/558 KB   30/30 KB   
112/558 KB   30/30 KB   
116/558 KB   30/30 KB   
120/558 KB   30/30 KB   
124/558 KB   30/30 KB   
128/558 KB   30/30 KB   
132/558 KB   30/30 KB   
136/558 KB   30/30 KB   
140/558 KB   30/30 KB   
144/558 KB   30/30 KB   
148/558 KB   30/30 KB   
152/558 KB   30/30 KB   
156/558 KB   30/30 KB   
160/558 KB   30/30 KB   
164/558 KB   30/30 KB   
168/558 KB   30/30 KB   
172/558 KB   30/30 KB   
176/558 KB   30/30 KB   
180/558 KB   30/30 KB   
184/558 KB   30/30 KB   
188/558 KB   30/30 KB   
192/558 KB   30/30 KB   
196/558 KB   30/30 KB   
200/558 KB   30/30 KB   
204/558 KB   30/30 KB   
208/558 KB   30/30 KB   
212/558 KB   30/30 KB   
216/558 KB   30/30 KB   
220/558 KB   30/30 KB   
224/558 KB   30/30 KB   
228/558 KB   30/30 KB   
232/558 KB   30/30 KB   
236/558 KB   30/30 KB   
240/558 KB   30/30 KB   
244/558 KB   30/30 KB   
248/558 KB   30/30 KB   
252/558 KB   30/30 KB   
256/558 KB   30/30 KB   
260/558 KB   30/30 KB   
264/558 KB   30/30 KB   
268/558 KB   30/30 KB   
272/558 KB   30/30 KB   
276/558 KB   30/30 KB   
280/558 KB   30/30 KB   
284/558 KB   30/30 KB   
288/558 KB   30/30 KB   
292/558 KB   30/30 KB   
296/558 KB   30/30 KB   
300/558 KB   30/30 KB   
304/558 KB   30/30 KB   
308/558 KB   30/30 KB   
312/558 KB   30/30 KB   
316/558 KB   30/30 KB   
320/558 KB   30/30 KB   
321/558 KB   30/30 KB   
325/558 KB   30/30 KB   
329/558 KB   30/30 KB   
333/558 KB   30/30 KB   
337/558 KB   30/30 KB   
341/558 KB   30/30 KB   
345/558 KB   30/30 KB   
349/558 KB   30/30 KB   
353/558 KB   30/30 KB   
357/558 KB   30/30 KB   
361/558 KB   30/30 KB   
365/558 KB   30/30 KB   
369/558 KB   30/30 KB   
373/558 KB   30/30 KB   
377/558 KB   30/30 KB   
381/558 KB   30/30 KB   
385/558 KB   30/30 KB   
389/558 KB   30/30 KB   
393/558 KB   30/30 KB   
397/558 KB   30/30 KB   
401/558 KB   30/30 KB   
405/558 KB   30/30 KB   
409/558 KB   30/30 KB   
413/558 KB   30/30 KB   
417/558 KB   30/30 KB   
421/558 KB   30/30 KB   
425/558 KB   30/30 KB   
429/558 KB   30/30 KB   
433/558 KB   30/30 KB   
437/558 KB   30/30 KB   
441/558 KB   30/30 KB   
445/558 KB   30/30 KB   
449/558 KB   30/30 KB   
453/558 KB   30/30 KB   
457/558 KB   30/30 KB   
461/558 KB   30/30 KB   
465/558 KB   30/30 KB   
469/558 KB   30/30 KB   
473/558 KB   30/30 KB   
477/558 KB   30/30 KB   
481/558 KB   30/30 KB   
485/558 KB   30/30 KB   
489/558 KB   30/30 KB   
493/558 KB   30/30 KB   
497/558 KB   30/30 KB   
501/558 KB   30/30 KB   
505/558 KB   30/30 KB   
509/558 KB   30/30 KB   
513/558 KB   30/30 KB   
517/558 KB   30/30 KB   
521/558 KB   30/30 KB   
525/558 KB   30/30 KB   
529/558 KB   30/30 KB   
533/558 KB   30/30 KB   
535/558 KB   30/30 KB   
539/558 KB   30/30 KB   
543/558 KB   30/30 KB   
547/558 KB   30/30 KB   
551/558 KB   30/30 KB   
555/558 KB   30/30 KB   
558/558 KB   30/30 KB   
                        
Downloaded: https://repo.maven.apache.org/maven2/commons-codec/commons-codec/1.2/commons-codec-1.2.jar (30 KB at 918.1 KB/sec)
                        
Downloaded: https://repo.maven.apache.org/maven2/commons-collections/commons-collections/3.2/commons-collections-3.2.jar (558 KB at 15077.6 KB/sec)
Downloading: http://repo1.maven.org/maven2/org/apache/maven/skins/maven-default-skin/maven-metadata.xml
Downloading: http://ox.gluu.org/maven/org/apache/maven/skins/maven-default-skin/maven-metadata.xml
Downloading: http://repository.jboss.org/nexus/content/groups/public-jboss/org/apache/maven/skins/maven-default-skin/maven-metadata.xml
                        
                        
                        
[WARNING] Could not transfer metadata org.apache.maven.skins:maven-default-skin/maven-metadata.xml from/to central (http://repo1.maven.org/maven2): Failed to transfer file: http://repo1.maven.org/maven2/org/apache/maven/skins/maven-default-skin/maven-metadata.xml. Return code is: 501 , ReasonPhrase:HTTPS Required.
[INFO]                                                                         
[INFO] ------------------------------------------------------------------------
[INFO] Building oxLdap-annotations 3.1.6.sp1
[INFO] ------------------------------------------------------------------------
[INFO] 
[INFO] --- maven-clean-plugin:2.4.1:clean (default-clean) @ oxcore-ldap-annotations ---
[INFO] Deleting /home/jenkins/.jenkins/jobs/oxCore_3.1.7/workspace/oxLdap-annotations/target
[INFO] 
[INFO] --- maven-resources-plugin:2.4:resources (default-resources) @ oxcore-ldap-annotations ---
[INFO] Using 'UTF-8' encoding to copy filtered resources.
[INFO] skip non existing resourceDirectory /home/jenkins/.jenkins/jobs/oxCore_3.1.7/workspace/oxLdap-annotations/src/main/resources
[INFO] 
[INFO] --- maven-compiler-plugin:2.3.2:compile (default-compile) @ oxcore-ldap-annotations ---
[INFO] Compiling 9 source files to /home/jenkins/.jenkins/jobs/oxCore_3.1.7/workspace/oxLdap-annotations/target/classes
[INFO] 
[INFO] --- maven-resources-plugin:2.4:resources (default-resources) @ oxcore-ldap-annotations ---
[INFO] Using 'UTF-8' encoding to copy filtered resources.
[INFO] skip non existing resourceDirectory /home/jenkins/.jenkins/jobs/oxCore_3.1.7/workspace/oxLdap-annotations/src/main/resources
[INFO] 
[INFO] --- maven-compiler-plugin:2.3.2:compile (default-compile) @ oxcore-ldap-annotations ---
[INFO] Nothing to compile - all classes are up to date
[INFO] 
[INFO] --- maven-resources-plugin:2.4:testResources (default-testResources) @ oxcore-ldap-annotations ---
[INFO] Using 'UTF-8' encoding to copy filtered resources.
[INFO] skip non existing resourceDirectory /home/jenkins/.jenkins/jobs/oxCore_3.1.7/workspace/oxLdap-annotations/src/test/resources
[INFO] 
[INFO] --- maven-compiler-plugin:2.3.2:testCompile (default-testCompile) @ oxcore-ldap-annotations ---
[INFO] No sources to compile
[INFO] 
[INFO] --- maven-surefire-plugin:2.7.2:test (default-test) @ oxcore-ldap-annotations ---
[INFO] No tests to run.
[INFO] Surefire report directory: /home/jenkins/.jenkins/jobs/oxCore_3.1.7/workspace/oxLdap-annotations/target/surefire-reports

-------------------------------------------------------
 T E S T S
-------------------------------------------------------
There are no tests to run.

Results :

Tests run: 0, Failures: 0, Errors: 0, Skipped: 0

[INFO] 
[INFO] --- maven-jar-plugin:2.4:jar (default-jar) @ oxcore-ldap-annotations ---
[INFO] Building jar: /home/jenkins/.jenkins/jobs/oxCore_3.1.7/workspace/oxLdap-annotations/target/oxcore-ldap-annotations-3.1.6.sp1.jar
[INFO] 
[INFO] --- maven-install-plugin:2.3.1:install (default-install) @ oxcore-ldap-annotations ---
[INFO] Installing /home/jenkins/.jenkins/jobs/oxCore_3.1.7/workspace/oxLdap-annotations/target/oxcore-ldap-annotations-3.1.6.sp1.jar to /var/www/html/maven/org/xdi/oxcore-ldap-annotations/3.1.6.sp1/oxcore-ldap-annotations-3.1.6.sp1.jar
[INFO] Installing /home/jenkins/.jenkins/jobs/oxCore_3.1.7/workspace/oxLdap-annotations/pom.xml to /var/www/html/maven/org/xdi/oxcore-ldap-annotations/3.1.6.sp1/oxcore-ldap-annotations-3.1.6.sp1.pom
[INFO] 
[INFO] --- findbugs-maven-plugin:3.0.4:findbugs (default-cli) @ oxcore-ldap-annotations ---
[INFO] Fork Value is true
[INFO] Done FindBugs Analysis....
[INFO] 
[INFO] --- maven-checkstyle-plugin:3.0.0:checkstyle (default-cli) @ oxcore-ldap-annotations ---
[INFO] There are 57 errors reported by Checkstyle 6.18 with sun_checks.xml ruleset.
[WARNING] Unable to locate Source XRef to link to - DISABLED
[INFO] 
[INFO] >>> maven-javadoc-plugin:3.0.1:javadoc (default-cli) > generate-sources @ oxcore-ldap-annotations >>>
[INFO] 
[INFO] <<< maven-javadoc-plugin:3.0.1:javadoc (default-cli) < generate-sources @ oxcore-ldap-annotations <<<
[INFO] 
[INFO] --- maven-javadoc-plugin:3.0.1:javadoc (default-cli) @ oxcore-ldap-annotations ---
[INFO] 
Loading source files for package org.gluu.site.ldap.persistence.annotation...
Constructing Javadoc information...
Standard Doclet version 1.8.0_221
Building tree for all the packages and classes...
Generating /home/jenkins/.jenkins/jobs/oxCore_3.1.7/workspace/oxLdap-annotations/target/site/apidocs/org/gluu/site/ldap/persistence/annotation/LdapAttribute.html...
Generating /home/jenkins/.jenkins/jobs/oxCore_3.1.7/workspace/oxLdap-annotations/target/site/apidocs/org/gluu/site/ldap/persistence/annotation/LdapAttributesList.html...
Generating /home/jenkins/.jenkins/jobs/oxCore_3.1.7/workspace/oxLdap-annotations/target/site/apidocs/org/gluu/site/ldap/persistence/annotation/LdapCustomObjectClass.html...
Generating /home/jenkins/.jenkins/jobs/oxCore_3.1.7/workspace/oxLdap-annotations/target/site/apidocs/org/gluu/site/ldap/persistence/annotation/LdapDN.html...
Generating /home/jenkins/.jenkins/jobs/oxCore_3.1.7/workspace/oxLdap-annotations/target/site/apidocs/org/gluu/site/ldap/persistence/annotation/LdapEntry.html...
Generating /home/jenkins/.jenkins/jobs/oxCore_3.1.7/workspace/oxLdap-annotations/target/site/apidocs/org/gluu/site/ldap/persistence/annotation/LdapEnum.html...
Generating /home/jenkins/.jenkins/jobs/oxCore_3.1.7/workspace/oxLdap-annotations/target/site/apidocs/org/gluu/site/ldap/persistence/annotation/LdapJsonObject.html...
Generating /home/jenkins/.jenkins/jobs/oxCore_3.1.7/workspace/oxLdap-annotations/target/site/apidocs/org/gluu/site/ldap/persistence/annotation/LdapObjectClass.html...
Generating /home/jenkins/.jenkins/jobs/oxCore_3.1.7/workspace/oxLdap-annotations/target/site/apidocs/org/gluu/site/ldap/persistence/annotation/LdapSchemaEntry.html...
Generating /home/jenkins/.jenkins/jobs/oxCore_3.1.7/workspace/oxLdap-annotations/target/site/apidocs/org/gluu/site/ldap/persistence/annotation/package-frame.html...
Generating /home/jenkins/.jenkins/jobs/oxCore_3.1.7/workspace/oxLdap-annotations/target/site/apidocs/org/gluu/site/ldap/persistence/annotation/package-summary.html...
Generating /home/jenkins/.jenkins/jobs/oxCore_3.1.7/workspace/oxLdap-annotations/target/site/apidocs/org/gluu/site/ldap/persistence/annotation/package-tree.html...
Generating /home/jenkins/.jenkins/jobs/oxCore_3.1.7/workspace/oxLdap-annotations/target/site/apidocs/constant-values.html...
Generating /home/jenkins/.jenkins/jobs/oxCore_3.1.7/workspace/oxLdap-annotations/target/site/apidocs/org/gluu/site/ldap/persistence/annotation/class-use/LdapSchemaEntry.html...
Generating /home/jenkins/.jenkins/jobs/oxCore_3.1.7/workspace/oxLdap-annotations/target/site/apidocs/org/gluu/site/ldap/persistence/annotation/class-use/LdapObjectClass.html...
Generating /home/jenkins/.jenkins/jobs/oxCore_3.1.7/workspace/oxLdap-annotations/target/site/apidocs/org/gluu/site/ldap/persistence/annotation/class-use/LdapJsonObject.html...
Generating /home/jenkins/.jenkins/jobs/oxCore_3.1.7/workspace/oxLdap-annotations/target/site/apidocs/org/gluu/site/ldap/persistence/annotation/class-use/LdapEnum.html...
Generating /home/jenkins/.jenkins/jobs/oxCore_3.1.7/workspace/oxLdap-annotations/target/site/apidocs/org/gluu/site/ldap/persistence/annotation/class-use/LdapEntry.html...
Generating /home/jenkins/.jenkins/jobs/oxCore_3.1.7/workspace/oxLdap-annotations/target/site/apidocs/org/gluu/site/ldap/persistence/annotation/class-use/LdapDN.html...
Generating /home/jenkins/.jenkins/jobs/oxCore_3.1.7/workspace/oxLdap-annotations/target/site/apidocs/org/gluu/site/ldap/persistence/annotation/class-use/LdapCustomObjectClass.html...
Generating /home/jenkins/.jenkins/jobs/oxCore_3.1.7/workspace/oxLdap-annotations/target/site/apidocs/org/gluu/site/ldap/persistence/annotation/class-use/LdapAttributesList.html...
Generating /home/jenkins/.jenkins/jobs/oxCore_3.1.7/workspace/oxLdap-annotations/target/site/apidocs/org/gluu/site/ldap/persistence/annotation/class-use/LdapAttribute.html...
Generating /home/jenkins/.jenkins/jobs/oxCore_3.1.7/workspace/oxLdap-annotations/target/site/apidocs/org/gluu/site/ldap/persistence/annotation/package-use.html...
Building index for all the packages and classes...
Generating /home/jenkins/.jenkins/jobs/oxCore_3.1.7/workspace/oxLdap-annotations/target/site/apidocs/overview-tree.html...
Generating /home/jenkins/.jenkins/jobs/oxCore_3.1.7/workspace/oxLdap-annotations/target/site/apidocs/index-all.html...
Generating /home/jenkins/.jenkins/jobs/oxCore_3.1.7/workspace/oxLdap-annotations/target/site/apidocs/deprecated-list.html...
Building index for all classes...
Generating /home/jenkins/.jenkins/jobs/oxCore_3.1.7/workspace/oxLdap-annotations/target/site/apidocs/allclasses-frame.html...
Generating /home/jenkins/.jenkins/jobs/oxCore_3.1.7/workspace/oxLdap-annotations/target/site/apidocs/allclasses-noframe.html...
Generating /home/jenkins/.jenkins/jobs/oxCore_3.1.7/workspace/oxLdap-annotations/target/site/apidocs/index.html...
Generating /home/jenkins/.jenkins/jobs/oxCore_3.1.7/workspace/oxLdap-annotations/target/site/apidocs/help-doc.html...
10 warnings
[WARNING] Javadoc Warnings
[WARNING] /home/jenkins/.jenkins/jobs/oxCore_3.1.7/workspace/oxLdap-annotations/src/main/java/org/gluu/site/ldap/persistence/annotation/LdapAttribute.java:32: warning: no @return
[WARNING] boolean ignoreDuringRead() default false;
[WARNING] ^
[WARNING] /home/jenkins/.jenkins/jobs/oxCore_3.1.7/workspace/oxLdap-annotations/src/main/java/org/gluu/site/ldap/persistence/annotation/LdapAttribute.java:38: warning: no @return
[WARNING] boolean ignoreDuringUpdate() default false;
[WARNING] ^
[WARNING] /home/jenkins/.jenkins/jobs/oxCore_3.1.7/workspace/oxLdap-annotations/src/main/java/org/gluu/site/ldap/persistence/annotation/LdapAttribute.java:26: warning: no @return
[WARNING] String name() default "";
[WARNING] ^
[WARNING] /home/jenkins/.jenkins/jobs/oxCore_3.1.7/workspace/oxLdap-annotations/src/main/java/org/gluu/site/ldap/persistence/annotation/LdapAttribute.java:44: warning: no @return
[WARNING] boolean updateOnly() default false;
[WARNING] ^
[WARNING] /home/jenkins/.jenkins/jobs/oxCore_3.1.7/workspace/oxLdap-annotations/src/main/java/org/gluu/site/ldap/persistence/annotation/LdapAttributesList.java:26: warning: no @return
[WARNING] String name();
[WARNING] ^
[WARNING] /home/jenkins/.jenkins/jobs/oxCore_3.1.7/workspace/oxLdap-annotations/src/main/java/org/gluu/site/ldap/persistence/annotation/LdapAttributesList.java:31: warning: no @return
[WARNING] String value();
[WARNING] ^
[WARNING] /home/jenkins/.jenkins/jobs/oxCore_3.1.7/workspace/oxLdap-annotations/src/main/java/org/gluu/site/ldap/persistence/annotation/LdapAttributesList.java:37: warning: no @return
[WARNING] LdapAttribute[] attributesConfiguration() default {};
[WARNING] ^
[WARNING] /home/jenkins/.jenkins/jobs/oxCore_3.1.7/workspace/oxLdap-annotations/src/main/java/org/gluu/site/ldap/persistence/annotation/LdapAttributesList.java:42: warning: no @return
[WARNING] boolean sortByName() default false;
[WARNING] ^
[WARNING] /home/jenkins/.jenkins/jobs/oxCore_3.1.7/workspace/oxLdap-annotations/src/main/java/org/gluu/site/ldap/persistence/annotation/LdapEntry.java:26: warning: no @return
[WARNING] boolean schemaDefinition() default false;
[WARNING] ^
[WARNING] /home/jenkins/.jenkins/jobs/oxCore_3.1.7/workspace/oxLdap-annotations/src/main/java/org/gluu/site/ldap/persistence/annotation/LdapEntry.java:31: warning: no @return
[WARNING] String[] sortBy() default {};
[WARNING] ^
[INFO] 
[INFO] --- maven-site-plugin:2.1.1:site (default-site) @ oxcore-ldap-annotations ---
[INFO]                                                                         
[INFO] ------------------------------------------------------------------------
[INFO] Building oxUtil 3.1.6.sp1
[INFO] ------------------------------------------------------------------------
Downloading: http://repo1.maven.org/maven2/commons-logging/commons-logging/1.1.1/commons-logging-1.1.1.jar
Downloading: http://repo1.maven.org/maven2/commons-io/commons-io/2.6/commons-io-2.6.jar
                        
                        
Downloading: http://repository.jboss.org/nexus/content/groups/public-jboss/commons-logging/commons-logging/1.1.1/commons-logging-1.1.1.jar
Downloading: http://repository.jboss.org/nexus/content/groups/public-jboss/commons-io/commons-io/2.6/commons-io-2.6.jar
4/60 KB                 
8/60 KB   
4/210 KB   8/60 KB   
4/210 KB   12/60 KB   
4/210 KB   13/60 KB   
4/210 KB   17/60 KB   
4/210 KB   19/60 KB   
4/210 KB   21/60 KB   
4/210 KB   23/60 KB   
4/210 KB   24/60 KB   
4/210 KB   28/60 KB   
4/210 KB   29/60 KB   
4/210 KB   33/60 KB   
4/210 KB   36/60 KB   
4/210 KB   38/60 KB   
4/210 KB   40/60 KB   
4/210 KB   44/60 KB   
4/210 KB   48/60 KB   
8/210 KB   48/60 KB   
12/210 KB   48/60 KB   
13/210 KB   48/60 KB   
17/210 KB   48/60 KB   
19/210 KB   48/60 KB   
20/210 KB   48/60 KB   
21/210 KB   48/60 KB   
21/210 KB   50/60 KB   
21/210 KB   52/60 KB   
21/210 KB   56/60 KB   
21/210 KB   60/60 KB   
21/210 KB   60/60 KB   
25/210 KB   60/60 KB   
29/210 KB   60/60 KB   
30/210 KB   60/60 KB   
32/210 KB   60/60 KB   
33/210 KB   60/60 KB   
37/210 KB   60/60 KB   
40/210 KB   60/60 KB   
41/210 KB   60/60 KB   
45/210 KB   60/60 KB   
49/210 KB   60/60 KB   
50/210 KB   60/60 KB   
54/210 KB   60/60 KB   
58/210 KB   60/60 KB   
62/210 KB   60/60 KB   
66/210 KB   60/60 KB   
69/210 KB   60/60 KB   
73/210 KB   60/60 KB   
74/210 KB   60/60 KB   
75/210 KB   60/60 KB   
79/210 KB   60/60 KB   
83/210 KB   60/60 KB   
84/210 KB   60/60 KB   
                       
Downloaded: http://repository.jboss.org/nexus/content/groups/public-jboss/commons-logging/commons-logging/1.1.1/commons-logging-1.1.1.jar (60 KB at 99.8 KB/sec)
88/210 KB              
92/210 KB   
94/210 KB   
95/210 KB   
96/210 KB   
100/210 KB   
104/210 KB   
107/210 KB   
108/210 KB   
112/210 KB   
116/210 KB   
117/210 KB   
119/210 KB   
123/210 KB   
125/210 KB   
129/210 KB   
133/210 KB   
137/210 KB   
141/210 KB   
145/210 KB   
148/210 KB   
152/210 KB   
156/210 KB   
160/210 KB   
164/210 KB   
168/210 KB   
172/210 KB   
176/210 KB   
180/210 KB   
184/210 KB   
188/210 KB   
192/210 KB   
196/210 KB   
200/210 KB   
204/210 KB   
208/210 KB   
210/210 KB   
             
Downloaded: http://repository.jboss.org/nexus/content/groups/public-jboss/commons-io/commons-io/2.6/commons-io-2.6.jar (210 KB at 214.3 KB/sec)
[INFO] 
[INFO] --- maven-clean-plugin:2.4.1:clean (default-clean) @ oxcore-util ---
[INFO] Deleting /home/jenkins/.jenkins/jobs/oxCore_3.1.7/workspace/oxUtil/target
[INFO] 
[INFO] --- maven-resources-plugin:2.4:resources (default-resources) @ oxcore-util ---
[INFO] Using 'UTF-8' encoding to copy filtered resources.
[INFO] skip non existing resourceDirectory /home/jenkins/.jenkins/jobs/oxCore_3.1.7/workspace/oxUtil/src/main/resources
[INFO] 
[INFO] --- maven-compiler-plugin:2.3.2:compile (default-compile) @ oxcore-util ---
[INFO] Compiling 61 source files to /home/jenkins/.jenkins/jobs/oxCore_3.1.7/workspace/oxUtil/target/classes
[INFO] -------------------------------------------------------------
[ERROR] COMPILATION ERROR : 
[INFO] -------------------------------------------------------------
[ERROR] /home/jenkins/.jenkins/jobs/oxCore_3.1.7/workspace/oxUtil/src/main/java/org/xdi/log/LoggingHelper.java:[5,36] error: package org.apache.logging.log4j.core does not exist
[ERROR] /home/jenkins/.jenkins/jobs/oxCore_3.1.7/workspace/oxUtil/src/main/java/org/xdi/log/LoggingHelper.java:[6,45] error: package org.apache.logging.log4j.core.appender does not exist
[ERROR] /home/jenkins/.jenkins/jobs/oxCore_3.1.7/workspace/oxUtil/src/main/java/org/xdi/log/LoggingHelper.java:[7,43] error: package org.apache.logging.log4j.core.config does not exist
[ERROR] /home/jenkins/.jenkins/jobs/oxCore_3.1.7/workspace/oxUtil/src/main/java/org/xdi/log/LoggingHelper.java:[8,43] error: package org.apache.logging.log4j.core.config does not exist
[ERROR] /home/jenkins/.jenkins/jobs/oxCore_3.1.7/workspace/oxUtil/src/main/java/org/xdi/log/LoggingHelper.java:[9,43] error: package org.apache.logging.log4j.core.config does not exist
[ERROR] /home/jenkins/.jenkins/jobs/oxCore_3.1.7/workspace/oxUtil/src/main/java/org/xdi/log/LoggingHelper.java:[10,43] error: package org.apache.logging.log4j.core.layout does not exist
[ERROR] /home/jenkins/.jenkins/jobs/oxCore_3.1.7/workspace/oxUtil/src/main/java/org/gluu/log/MacAddressLogIdConverter.java:[3,36] error: package org.apache.logging.log4j.core does not exist
[ERROR] /home/jenkins/.jenkins/jobs/oxCore_3.1.7/workspace/oxUtil/src/main/java/org/gluu/log/MacAddressLogIdConverter.java:[4,51] error: package org.apache.logging.log4j.core.config.plugins does not exist
[ERROR] /home/jenkins/.jenkins/jobs/oxCore_3.1.7/workspace/oxUtil/src/main/java/org/gluu/log/MacAddressLogIdConverter.java:[5,44] error: package org.apache.logging.log4j.core.pattern does not exist
[ERROR] /home/jenkins/.jenkins/jobs/oxCore_3.1.7/workspace/oxUtil/src/main/java/org/gluu/log/MacAddressLogIdConverter.java:[6,44] error: package org.apache.logging.log4j.core.pattern does not exist
[ERROR] /home/jenkins/.jenkins/jobs/oxCore_3.1.7/workspace/oxUtil/src/main/java/org/gluu/log/MacAddressLogIdConverter.java:[17,46] error: cannot find symbol
[ERROR]  class LogEventPatternConverter
/home/jenkins/.jenkins/jobs/oxCore_3.1.7/workspace/oxUtil/src/main/java/org/gluu/log/MacAddressLogIdConverter.java:[15,1] error: cannot find symbol
[ERROR]  class Plugin
/home/jenkins/.jenkins/jobs/oxCore_3.1.7/workspace/oxUtil/src/main/java/org/gluu/log/MacAddressLogIdConverter.java:[16,1] error: cannot find symbol
[ERROR]  class ConverterKeys
/home/jenkins/.jenkins/jobs/oxCore_3.1.7/workspace/oxUtil/src/main/java/org/gluu/log/MacAddressLogIdConverter.java:[30,20] error: cannot find symbol
[ERROR]  class MacAddressLogIdConverter
/home/jenkins/.jenkins/jobs/oxCore_3.1.7/workspace/oxUtil/src/main/java/org/xdi/log/LoggingHelper.java:[15,2] error: cannot find symbol
[ERROR]  class LoggingHelper
/home/jenkins/.jenkins/jobs/oxCore_3.1.7/workspace/oxUtil/src/main/java/org/xdi/log/LoggingHelper.java:[15,23] error: cannot find symbol
[ERROR]  class LoggingHelper
/home/jenkins/.jenkins/jobs/oxCore_3.1.7/workspace/oxUtil/src/main/java/org/xdi/log/LoggingHelper.java:[16,2] error: cannot find symbol
[ERROR]  class LoggingHelper
/home/jenkins/.jenkins/jobs/oxCore_3.1.7/workspace/oxUtil/src/main/java/org/xdi/log/LoggingHelper.java:[16,34] error: cannot find symbol
[ERROR]  class LoggingHelper
/home/jenkins/.jenkins/jobs/oxCore_3.1.7/workspace/oxUtil/src/main/java/org/xdi/log/LoggingHelper.java:[17,2] error: cannot find symbol
[ERROR]  class LoggingHelper
/home/jenkins/.jenkins/jobs/oxCore_3.1.7/workspace/oxUtil/src/main/java/org/xdi/log/LoggingHelper.java:[17,76] error: cannot find symbol
[ERROR]  class LoggingHelper
/home/jenkins/.jenkins/jobs/oxCore_3.1.7/workspace/oxUtil/src/main/java/org/xdi/log/LoggingHelper.java:[17,29] error: cannot find symbol
[ERROR]  class LoggingHelper
/home/jenkins/.jenkins/jobs/oxCore_3.1.7/workspace/oxUtil/src/main/java/org/xdi/log/LoggingHelper.java:[20,2] error: cannot find symbol
[ERROR]  class LoggingHelper
/home/jenkins/.jenkins/jobs/oxCore_3.1.7/workspace/oxUtil/src/main/java/org/xdi/log/LoggingHelper.java:[20,27] error: cannot find symbol
[ERROR]  class LoggingHelper
/home/jenkins/.jenkins/jobs/oxCore_3.1.7/workspace/oxUtil/src/main/java/org/xdi/log/LoggingHelper.java:[20,43] error: cannot find symbol
[ERROR]  class LoggingHelper
/home/jenkins/.jenkins/jobs/oxCore_3.1.7/workspace/oxUtil/src/main/java/org/xdi/log/LoggingHelper.java:[21,2] error: cannot find symbol
[ERROR]  class LoggingHelper
/home/jenkins/.jenkins/jobs/oxCore_3.1.7/workspace/oxUtil/src/main/java/org/xdi/log/LoggingHelper.java:[21,30] error: cannot find symbol
[ERROR]  class LoggingHelper
/home/jenkins/.jenkins/jobs/oxCore_3.1.7/workspace/oxUtil/src/main/java/org/gluu/log/MacAddressLogIdConverter.java:[29,1] error: method does not override or implement a method from a supertype
[INFO] 27 errors 
[INFO] -------------------------------------------------------------
[INFO] ------------------------------------------------------------------------
[INFO] Reactor Summary:
[INFO] 
[INFO] oxCore ............................................. SUCCESS [  3.167 s]
[INFO] oxLdap-annotations ................................. SUCCESS [  5.127 s]
[INFO] oxUtil ............................................. FAILURE [  1.802 s]
[INFO] oxLdap ............................................. SKIPPED
[INFO] oxLdapSample ....................................... SKIPPED
[INFO] oxModel ............................................ SKIPPED
[INFO] oxSaml ............................................. SKIPPED
[INFO] oxService .......................................... SKIPPED
[INFO] oxTomcat ........................................... SKIPPED
[INFO] oxServer ........................................... SKIPPED
[INFO] oxGwt .............................................. SKIPPED
[INFO] oxJsfUtil .......................................... SKIPPED
[INFO] ------------------------------------------------------------------------
[INFO] BUILD FAILURE
[INFO] ------------------------------------------------------------------------
[INFO] Total time: 10.730 s
[INFO] Finished at: 2021-12-16T13:25:31+00:00
[INFO] Final Memory: 62M/502M
[INFO] ------------------------------------------------------------------------
[ERROR] Failed to execute goal org.apache.maven.plugins:maven-compiler-plugin:2.3.2:compile (default-compile) on project oxcore-util: Compilation failure: Compilation failure:
[ERROR] /home/jenkins/.jenkins/jobs/oxCore_3.1.7/workspace/oxUtil/src/main/java/org/xdi/log/LoggingHelper.java:[5,36] error: package org.apache.logging.log4j.core does not exist
[ERROR] /home/jenkins/.jenkins/jobs/oxCore_3.1.7/workspace/oxUtil/src/main/java/org/xdi/log/LoggingHelper.java:[6,45] error: package org.apache.logging.log4j.core.appender does not exist
[ERROR] /home/jenkins/.jenkins/jobs/oxCore_3.1.7/workspace/oxUtil/src/main/java/org/xdi/log/LoggingHelper.java:[7,43] error: package org.apache.logging.log4j.core.config does not exist
[ERROR] /home/jenkins/.jenkins/jobs/oxCore_3.1.7/workspace/oxUtil/src/main/java/org/xdi/log/LoggingHelper.java:[8,43] error: package org.apache.logging.log4j.core.config does not exist
[ERROR] /home/jenkins/.jenkins/jobs/oxCore_3.1.7/workspace/oxUtil/src/main/java/org/xdi/log/LoggingHelper.java:[9,43] error: package org.apache.logging.log4j.core.config does not exist
[ERROR] /home/jenkins/.jenkins/jobs/oxCore_3.1.7/workspace/oxUtil/src/main/java/org/xdi/log/LoggingHelper.java:[10,43] error: package org.apache.logging.log4j.core.layout does not exist
[ERROR] /home/jenkins/.jenkins/jobs/oxCore_3.1.7/workspace/oxUtil/src/main/java/org/gluu/log/MacAddressLogIdConverter.java:[3,36] error: package org.apache.logging.log4j.core does not exist
[ERROR] /home/jenkins/.jenkins/jobs/oxCore_3.1.7/workspace/oxUtil/src/main/java/org/gluu/log/MacAddressLogIdConverter.java:[4,51] error: package org.apache.logging.log4j.core.config.plugins does not exist
[ERROR] /home/jenkins/.jenkins/jobs/oxCore_3.1.7/workspace/oxUtil/src/main/java/org/gluu/log/MacAddressLogIdConverter.java:[5,44] error: package org.apache.logging.log4j.core.pattern does not exist
[ERROR] /home/jenkins/.jenkins/jobs/oxCore_3.1.7/workspace/oxUtil/src/main/java/org/gluu/log/MacAddressLogIdConverter.java:[6,44] error: package org.apache.logging.log4j.core.pattern does not exist
[ERROR] /home/jenkins/.jenkins/jobs/oxCore_3.1.7/workspace/oxUtil/src/main/java/org/gluu/log/MacAddressLogIdConverter.java:[17,46] error: cannot find symbol
[ERROR] class LogEventPatternConverter
[ERROR] /home/jenkins/.jenkins/jobs/oxCore_3.1.7/workspace/oxUtil/src/main/java/org/gluu/log/MacAddressLogIdConverter.java:[15,1] error: cannot find symbol
[ERROR] class Plugin
[ERROR] /home/jenkins/.jenkins/jobs/oxCore_3.1.7/workspace/oxUtil/src/main/java/org/gluu/log/MacAddressLogIdConverter.java:[16,1] error: cannot find symbol
[ERROR] class ConverterKeys
[ERROR] /home/jenkins/.jenkins/jobs/oxCore_3.1.7/workspace/oxUtil/src/main/java/org/gluu/log/MacAddressLogIdConverter.java:[30,20] error: cannot find symbol
[ERROR] class MacAddressLogIdConverter
[ERROR] /home/jenkins/.jenkins/jobs/oxCore_3.1.7/workspace/oxUtil/src/main/java/org/xdi/log/LoggingHelper.java:[15,2] error: cannot find symbol
[ERROR] class LoggingHelper
[ERROR] /home/jenkins/.jenkins/jobs/oxCore_3.1.7/workspace/oxUtil/src/main/java/org/xdi/log/LoggingHelper.java:[15,23] error: cannot find symbol
[ERROR] class LoggingHelper
[ERROR] /home/jenkins/.jenkins/jobs/oxCore_3.1.7/workspace/oxUtil/src/main/java/org/xdi/log/LoggingHelper.java:[16,2] error: cannot find symbol
[ERROR] class LoggingHelper
[ERROR] /home/jenkins/.jenkins/jobs/oxCore_3.1.7/workspace/oxUtil/src/main/java/org/xdi/log/LoggingHelper.java:[16,34] error: cannot find symbol
[ERROR] class LoggingHelper
[ERROR] /home/jenkins/.jenkins/jobs/oxCore_3.1.7/workspace/oxUtil/src/main/java/org/xdi/log/LoggingHelper.java:[17,2] error: cannot find symbol
[ERROR] class LoggingHelper
[ERROR] /home/jenkins/.jenkins/jobs/oxCore_3.1.7/workspace/oxUtil/src/main/java/org/xdi/log/LoggingHelper.java:[17,76] error: cannot find symbol
[ERROR] class LoggingHelper
[ERROR] /home/jenkins/.jenkins/jobs/oxCore_3.1.7/workspace/oxUtil/src/main/java/org/xdi/log/LoggingHelper.java:[17,29] error: cannot find symbol
[ERROR] class LoggingHelper
[ERROR] /home/jenkins/.jenkins/jobs/oxCore_3.1.7/workspace/oxUtil/src/main/java/org/xdi/log/LoggingHelper.java:[20,2] error: cannot find symbol
[ERROR] class LoggingHelper
[ERROR] /home/jenkins/.jenkins/jobs/oxCore_3.1.7/workspace/oxUtil/src/main/java/org/xdi/log/LoggingHelper.java:[20,27] error: cannot find symbol
[ERROR] class LoggingHelper
[ERROR] /home/jenkins/.jenkins/jobs/oxCore_3.1.7/workspace/oxUtil/src/main/java/org/xdi/log/LoggingHelper.java:[20,43] error: cannot find symbol
[ERROR] class LoggingHelper
[ERROR] /home/jenkins/.jenkins/jobs/oxCore_3.1.7/workspace/oxUtil/src/main/java/org/xdi/log/LoggingHelper.java:[21,2] error: cannot find symbol
[ERROR] class LoggingHelper
[ERROR] /home/jenkins/.jenkins/jobs/oxCore_3.1.7/workspace/oxUtil/src/main/java/org/xdi/log/LoggingHelper.java:[21,30] error: cannot find symbol
[ERROR] class LoggingHelper
[ERROR] /home/jenkins/.jenkins/jobs/oxCore_3.1.7/workspace/oxUtil/src/main/java/org/gluu/log/MacAddressLogIdConverter.java:[29,1] error: method does not override or implement a method from a supertype
[ERROR] -> [Help 1]
[ERROR] 
[ERROR] To see the full stack trace of the errors, re-run Maven with the -e switch.
[ERROR] Re-run Maven using the -X switch to enable full debug logging.
[ERROR] 
[ERROR] For more information about the errors and possible solutions, please read the following articles:
[ERROR] [Help 1] http://cwiki.apache.org/confluence/display/MAVEN/MojoFailureException
[ERROR] 
[ERROR] After correcting the problems, you can resume the build with the command
[ERROR]   mvn <goals> -rf :oxcore-util
Build step 'Invoke top-level Maven targets' marked build as failure
[FINDBUGS] Skipping publisher since build result is FAILURE
TestNG Reports Processing: START
Looking for TestNG results report in workspace using pattern: **/testng-results.xml
testng-results.xml was last modified before this build started. Ignoring it.
Saving reports...
Found matching files but did not find any TestNG results.
Not sending mail to unregistered user Yuriy.Movchan@gmail.com
Sending e-mails to: support@gluu.org
ERROR: Couldn't connect to host, port: webmail.gluu.org, 465; timeout 60000
com.sun.mail.util.MailConnectException: Couldn't connect to host, port: webmail.gluu.org, 465; timeout 60000;
  nested exception is:
	java.net.SocketTimeoutException: connect timed out
	at com.sun.mail.smtp.SMTPTransport.openServer(SMTPTransport.java:2210)
	at com.sun.mail.smtp.SMTPTransport.protocolConnect(SMTPTransport.java:722)
	at javax.mail.Service.connect(Service.java:310)
	at javax.mail.Service.connect(Service.java:169)
	at javax.mail.Service.connect(Service.java:118)
	at javax.mail.Transport.send0(Transport.java:188)
	at javax.mail.Transport.send(Transport.java:118)
	at hudson.tasks.MailSender.run(MailSender.java:130)
	at hudson.tasks.Mailer.perform(Mailer.java:176)
	at hudson.tasks.Mailer.perform(Mailer.java:139)
	at hudson.tasks.BuildStepMonitor$1.perform(BuildStepMonitor.java:20)
	at hudson.model.AbstractBuild$AbstractBuildExecution.perform(AbstractBuild.java:741)
	at hudson.model.AbstractBuild$AbstractBuildExecution.performAllBuildSteps(AbstractBuild.java:690)
	at hudson.model.Build$BuildExecution.post2(Build.java:186)
	at hudson.model.AbstractBuild$AbstractBuildExecution.post(AbstractBuild.java:635)
	at hudson.model.Run.execute(Run.java:1905)
	at hudson.model.FreeStyleBuild.run(FreeStyleBuild.java:43)
	at hudson.model.ResourceController.execute(ResourceController.java:97)
	at hudson.model.Executor.run(Executor.java:428)
Caused by: java.net.SocketTimeoutException: connect timed out
	at java.net.PlainSocketImpl.socketConnect(Native Method)
	at java.net.AbstractPlainSocketImpl.doConnect(AbstractPlainSocketImpl.java:350)
	at java.net.AbstractPlainSocketImpl.connectToAddress(AbstractPlainSocketImpl.java:206)
	at java.net.AbstractPlainSocketImpl.connect(AbstractPlainSocketImpl.java:188)
	at java.net.SocksSocketImpl.connect(SocksSocketImpl.java:392)
	at java.net.Socket.connect(Socket.java:589)
	at com.sun.mail.util.SocketFetcher.createSocket(SocketFetcher.java:333)
	at com.sun.mail.util.SocketFetcher.getSocket(SocketFetcher.java:193)
	at com.sun.mail.smtp.SMTPTransport.openServer(SMTPTransport.java:2160)
	... 18 more
Finished: FAILURE