FailedConsole Output

Started by user Yuriy Movchan
Running as SYSTEM
Building on master in workspace /home/jenkins/.jenkins/jobs/gluu-jython/workspace
The recommended git tool is: NONE
No credentials specified
 > git rev-parse --is-inside-work-tree # timeout=10
Fetching changes from the remote Git repository
 > git config remote.origin.url https://github.com/GluuFederation/gluu-jython # timeout=10
Fetching upstream changes from https://github.com/GluuFederation/gluu-jython
 > git --version # timeout=10
 > git --version # 'git version 1.8.3.1'
 > git fetch --tags --progress https://github.com/GluuFederation/gluu-jython +refs/heads/*:refs/remotes/origin/* # timeout=10
 > git rev-parse refs/remotes/origin/v2.7.2.libs-update^{commit} # timeout=10
 > git rev-parse refs/remotes/origin/origin/v2.7.2.libs-update^{commit} # timeout=10
Checking out Revision 833dd1e94b6f9866622da66d243e5ebed5b10af7 (refs/remotes/origin/v2.7.2.libs-update)
 > git config core.sparsecheckout # timeout=10
 > git checkout -f 833dd1e94b6f9866622da66d243e5ebed5b10af7 # timeout=10
Commit message: "release 2.7.3"
 > git rev-list --no-walk 833dd1e94b6f9866622da66d243e5ebed5b10af7 # timeout=10
[workspace] $ /home/jenkins/.jenkins/tools/hudson.tasks.Ant_AntInstallation/Ant_1.10.3/bin/ant -DVERSION_NAME=v2.7.2.libs-update clean full-build
Buildfile: /home/jenkins/.jenkins/jobs/gluu-jython/workspace/build.xml

common-dirs:

clean-test:

clean:

common-dirs:

clean-test:

clean:

common-constants:

common-config:

full-preinit:

hg-present:
     [exec] Result: 255

hg-is-unmodified:

hg-is-clean:

common-version-strings:

hg-is-tagged:

force-snapshot-if-polluted:
     [echo] 
     [echo] The working directory is not a Mercurial repository - build is a snapshot.
     [echo] 
     [echo] ${build.hg.status}
     [echo]         

developer-preinit:

common-jars:

common-paths:

init:

hg-branch:

dump:
     [echo] .
     [echo] Build environment for jython
     [echo] (Note: if ${propertyname} is displayed, then the property is not set)
     [echo] --- build Jython version ---
     [echo] jython.version.short      = '2.7.3'
     [echo] jython.release            = '2.7.3'
     [echo] jython.version            = '2.7.3-SNAPSHOT'
     [echo] snapshot.name             = 'SNAPSHOT'
     [echo] snapshot.suffix           = '-SNAPSHOT'
     [echo] jython.dev.jar            = 'jython-dev.jar'
     [echo] jython.deploy.jar         = 'jython.jar'
     [echo] jython.standalone.jar     = 'jython-standalone.jar'
     [echo] jython.javadoc.jar        = 'javadoc.jar'
     [echo] jython.sources.jar        = 'sources.jar'
     [echo] jar.update                = 'false'
     [echo] --- optional libraries ---
     [echo] informix                  = '${informix.jar}'
     [echo] informix.present          = 'false'
     [echo] oracle                    = '${oracle.jar}'
     [echo] oracle.present            = 'false'
     [echo] --- properties ---
     [echo] basedir                   = '/home/jenkins/.jenkins/jobs/gluu-jython/workspace'
     [echo] source.dir                = '/home/jenkins/.jenkins/jobs/gluu-jython/workspace/src'
     [echo] build.dir                 = '/home/jenkins/.jenkins/jobs/gluu-jython/workspace/build'
     [echo] compile.dir               = '/home/jenkins/.jenkins/jobs/gluu-jython/workspace/build/classes'
     [echo] exposed.dir               = '/home/jenkins/.jenkins/jobs/gluu-jython/workspace/build/exposed'
     [echo] gensrc.dir                = '/home/jenkins/.jenkins/jobs/gluu-jython/workspace/build/gensrc'
     [echo] dist.dir                  = '/home/jenkins/.jenkins/jobs/gluu-jython/workspace/dist'
     [echo] apidoc.dir                = '/home/jenkins/.jenkins/jobs/gluu-jython/workspace/dist/Doc/javadoc'
     [echo] templates.dir             = '/home/jenkins/.jenkins/jobs/gluu-jython/workspace/src/templates'
     [echo] templates.lazy            = 'true'
     [echo] python.lib                = '/home/jenkins/.jenkins/jobs/gluu-jython/workspace/lib-python/2.7'
     [echo] --- compiler options ---
     [echo] build.compiler            = 'modern'
     [echo] jdk.target.version        = '1.8'
     [echo] jdk.source.version        = '1.7'
     [echo] deprecation               = 'true'
     [echo] debug                     = 'true'
     [echo] nowarn                    = 'true'
     [echo] main.classpath            = '/home/jenkins/.jenkins/jobs/gluu-jython/workspace/extlibs/servlet-api-2.5.jar:/home/jenkins/.jenkins/jobs/gluu-jython/workspace/extlibs/mysql-connector-java-5.1.42-bin.jar:/home/jenkins/.jenkins/jobs/gluu-jython/workspace/extlibs/postgresql-42.1.1.jre7.jar:/home/jenkins/.jenkins/jobs/gluu-jython/workspace/extlibs/antlr-complete-3.5.2.jar:/home/jenkins/.jenkins/jobs/gluu-jython/workspace/extlibs/asm-7.1.jar:/home/jenkins/.jenkins/jobs/gluu-jython/workspace/extlibs/asm-commons-7.1.jar:/home/jenkins/.jenkins/jobs/gluu-jython/workspace/extlibs/asm-util-7.1.jar:/home/jenkins/.jenkins/jobs/gluu-jython/workspace/extlibs/commons-compress-1.21.jar:/home/jenkins/.jenkins/jobs/gluu-jython/workspace/extlibs/failureaccess-1.0.1.jar:/home/jenkins/.jenkins/jobs/gluu-jython/workspace/extlibs/guava-28.0-android.jar:/home/jenkins/.jenkins/jobs/gluu-jython/workspace/extlibs/icu4j-59_1.jar:/home/jenkins/.jenkins/jobs/gluu-jython/workspace/extlibs/jffi-1.2.20.jar:/home/jenkins/.jenkins/jobs/gluu-jython/workspace/extlibs/java-sizeof-0.0.5.jar:/home/jenkins/.jenkins/jobs/gluu-jython/workspace/extlibs/jnr-ffi-2.1.10.jar:/home/jenkins/.jenkins/jobs/gluu-jython/workspace/extlibs/jnr-netdb-1.1.6.jar:/home/jenkins/.jenkins/jobs/gluu-jython/workspace/extlibs/jnr-posix-3.0.50.jar:/home/jenkins/.jenkins/jobs/gluu-jython/workspace/extlibs/jnr-constants-0.9.12.jar:/home/jenkins/.jenkins/jobs/gluu-jython/workspace/extlibs/jline-2.14.5.jar:/home/jenkins/.jenkins/jobs/gluu-jython/workspace/extlibs/netty-buffer-4.1.45.Final.jar:/home/jenkins/.jenkins/jobs/gluu-jython/workspace/extlibs/netty-codec-4.1.45.Final.jar:/home/jenkins/.jenkins/jobs/gluu-jython/workspace/extlibs/netty-common-4.1.45.Final.jar:/home/jenkins/.jenkins/jobs/gluu-jython/workspace/extlibs/netty-handler-4.1.45.Final.jar:/home/jenkins/.jenkins/jobs/gluu-jython/workspace/extlibs/netty-resolver-4.1.45.Final.jar:/home/jenkins/.jenkins/jobs/gluu-jython/workspace/extlibs/netty-transport-4.1.45.Final.jar'
     [echo] --- test config ---
     [echo] test                      = '${test}'
     [echo] test.source.dir           = '/home/jenkins/.jenkins/jobs/gluu-jython/workspace/tests/java'
     [echo] reports.dir               = '/home/jenkins/.jenkins/jobs/gluu-jython/workspace/reports'

full-dump:
     [echo] --- properties only used for a full-build ---
     [echo] hg.present                = 'false'
     [echo] build.hg.is_unmodified    = '${build.hg.is_unmodified}'
     [echo] build.hg.is_clean         = '${build.hg.is_clean}'
     [echo] build.hg.is_tagged        = '${build.hg.is_tagged}'
     [echo] build.hg.branch           = '${build.hg.branch}'
     [echo] build.hg.tag              = '${build.hg.tag}'
     [echo] build.hg.version          = '${build.hg.version}'

full-check:

BUILD FAILED
/home/jenkins/.jenkins/jobs/gluu-jython/workspace/build.xml:345: informix jar not present

Total time: 1 second
Build step 'Invoke Ant' marked build as failure
Sending e-mails to: support@gluu.org
ERROR: Couldn't connect to host, port: webmail.gluu.org, 465; timeout 60000
com.sun.mail.util.MailConnectException: Couldn't connect to host, port: webmail.gluu.org, 465; timeout 60000;
  nested exception is:
	java.net.SocketTimeoutException: connect timed out
	at com.sun.mail.smtp.SMTPTransport.openServer(SMTPTransport.java:2210)
	at com.sun.mail.smtp.SMTPTransport.protocolConnect(SMTPTransport.java:722)
	at javax.mail.Service.connect(Service.java:310)
	at javax.mail.Service.connect(Service.java:169)
	at javax.mail.Service.connect(Service.java:118)
	at javax.mail.Transport.send0(Transport.java:188)
	at javax.mail.Transport.send(Transport.java:118)
	at hudson.tasks.MailSender.run(MailSender.java:130)
	at hudson.tasks.Mailer.perform(Mailer.java:176)
	at hudson.tasks.Mailer.perform(Mailer.java:139)
	at hudson.tasks.BuildStepMonitor$1.perform(BuildStepMonitor.java:20)
	at hudson.model.AbstractBuild$AbstractBuildExecution.perform(AbstractBuild.java:741)
	at hudson.model.AbstractBuild$AbstractBuildExecution.performAllBuildSteps(AbstractBuild.java:690)
	at hudson.model.Build$BuildExecution.post2(Build.java:186)
	at hudson.model.AbstractBuild$AbstractBuildExecution.post(AbstractBuild.java:635)
	at hudson.model.Run.execute(Run.java:1905)
	at hudson.model.FreeStyleBuild.run(FreeStyleBuild.java:43)
	at hudson.model.ResourceController.execute(ResourceController.java:97)
	at hudson.model.Executor.run(Executor.java:428)
Caused by: java.net.SocketTimeoutException: connect timed out
	at java.net.PlainSocketImpl.socketConnect(Native Method)
	at java.net.AbstractPlainSocketImpl.doConnect(AbstractPlainSocketImpl.java:350)
	at java.net.AbstractPlainSocketImpl.connectToAddress(AbstractPlainSocketImpl.java:206)
	at java.net.AbstractPlainSocketImpl.connect(AbstractPlainSocketImpl.java:188)
	at java.net.SocksSocketImpl.connect(SocksSocketImpl.java:392)
	at java.net.Socket.connect(Socket.java:589)
	at com.sun.mail.util.SocketFetcher.createSocket(SocketFetcher.java:333)
	at com.sun.mail.util.SocketFetcher.getSocket(SocketFetcher.java:193)
	at com.sun.mail.smtp.SMTPTransport.openServer(SMTPTransport.java:2160)
	... 18 more
Finished: FAILURE