FailedConsole Output

Skipping 583 KB.. Full Log
l.project.ant.AntLoggingAdapter] [ant:expose] org/python/antlr/ast/Delete.class added as org/python/antlr/ast/Delete.class doesn't exist.
18:22:49.998 [DEBUG] [org.gradle.api.internal.project.ant.AntLoggingAdapter] [ant:expose] org/python/antlr/ast/Dict.class added as org/python/antlr/ast/Dict.class doesn't exist.
18:22:49.998 [DEBUG] [org.gradle.api.internal.project.ant.AntLoggingAdapter] [ant:expose] org/python/antlr/ast/Ellipsis.class added as org/python/antlr/ast/Ellipsis.class doesn't exist.
18:22:49.999 [DEBUG] [org.gradle.api.internal.project.ant.AntLoggingAdapter] [ant:expose] org/python/antlr/ast/ExceptHandler.class added as org/python/antlr/ast/ExceptHandler.class doesn't exist.
18:22:49.999 [DEBUG] [org.gradle.api.internal.project.ant.AntLoggingAdapter] [ant:expose] org/python/antlr/ast/Exec.class added as org/python/antlr/ast/Exec.class doesn't exist.
18:22:49.999 [DEBUG] [org.gradle.api.internal.project.ant.AntLoggingAdapter] [ant:expose] org/python/antlr/ast/Expr.class added as org/python/antlr/ast/Expr.class doesn't exist.
18:22:50.000 [DEBUG] [org.gradle.api.internal.project.ant.AntLoggingAdapter] [ant:expose] org/python/antlr/ast/Expression.class added as org/python/antlr/ast/Expression.class doesn't exist.
18:22:50.001 [DEBUG] [org.gradle.api.internal.project.ant.AntLoggingAdapter] [ant:expose] org/python/antlr/ast/ExtSlice.class added as org/python/antlr/ast/ExtSlice.class doesn't exist.
18:22:50.001 [DEBUG] [org.gradle.api.internal.project.ant.AntLoggingAdapter] [ant:expose] org/python/antlr/ast/For.class added as org/python/antlr/ast/For.class doesn't exist.
18:22:50.001 [DEBUG] [org.gradle.api.internal.project.ant.AntLoggingAdapter] [ant:expose] org/python/antlr/ast/FunctionDef.class added as org/python/antlr/ast/FunctionDef.class doesn't exist.
18:22:50.002 [DEBUG] [org.gradle.api.internal.project.ant.AntLoggingAdapter] [ant:expose] org/python/antlr/ast/GeneratorExp.class added as org/python/antlr/ast/GeneratorExp.class doesn't exist.
18:22:50.002 [DEBUG] [org.gradle.api.internal.project.ant.AntLoggingAdapter] [ant:expose] org/python/antlr/ast/Global.class added as org/python/antlr/ast/Global.class doesn't exist.
18:22:50.002 [DEBUG] [org.gradle.api.internal.project.ant.AntLoggingAdapter] [ant:expose] org/python/antlr/ast/If.class added as org/python/antlr/ast/If.class doesn't exist.
18:22:50.002 [DEBUG] [org.gradle.api.internal.project.ant.AntLoggingAdapter] [ant:expose] org/python/antlr/ast/IfExp.class added as org/python/antlr/ast/IfExp.class doesn't exist.
18:22:50.003 [DEBUG] [org.gradle.api.internal.project.ant.AntLoggingAdapter] [ant:expose] org/python/antlr/ast/Import.class added as org/python/antlr/ast/Import.class doesn't exist.
18:22:50.003 [DEBUG] [org.gradle.api.internal.project.ant.AntLoggingAdapter] [ant:expose] org/python/antlr/ast/ImportFrom.class added as org/python/antlr/ast/ImportFrom.class doesn't exist.
18:22:50.003 [DEBUG] [org.gradle.api.internal.project.ant.AntLoggingAdapter] [ant:expose] org/python/antlr/ast/Index.class added as org/python/antlr/ast/Index.class doesn't exist.
18:22:50.004 [DEBUG] [org.gradle.api.internal.project.ant.AntLoggingAdapter] [ant:expose] org/python/antlr/ast/Interactive.class added as org/python/antlr/ast/Interactive.class doesn't exist.
18:22:50.004 [DEBUG] [org.gradle.api.internal.project.ant.AntLoggingAdapter] [ant:expose] org/python/antlr/ast/Lambda.class added as org/python/antlr/ast/Lambda.class doesn't exist.
18:22:50.005 [DEBUG] [org.gradle.api.internal.project.ant.AntLoggingAdapter] [ant:expose] org/python/antlr/ast/List.class added as org/python/antlr/ast/List.class doesn't exist.
18:22:50.006 [DEBUG] [org.gradle.api.internal.project.ant.AntLoggingAdapter] [ant:expose] org/python/antlr/ast/ListComp.class added as org/python/antlr/ast/ListComp.class doesn't exist.
18:22:50.006 [DEBUG] [org.gradle.api.internal.project.ant.AntLoggingAdapter] [ant:expose] org/python/antlr/ast/Module.class added as org/python/antlr/ast/Module.class doesn't exist.
18:22:50.006 [DEBUG] [org.gradle.api.internal.project.ant.AntLoggingAdapter] [ant:expose] org/python/antlr/ast/Name.class added as org/python/antlr/ast/Name.class doesn't exist.
18:22:50.007 [DEBUG] [org.gradle.api.internal.project.ant.AntLoggingAdapter] [ant:expose] org/python/antlr/ast/Num.class added as org/python/antlr/ast/Num.class doesn't exist.
18:22:50.007 [DEBUG] [org.gradle.api.internal.project.ant.AntLoggingAdapter] [ant:expose] org/python/antlr/ast/Pass.class added as org/python/antlr/ast/Pass.class doesn't exist.
18:22:50.007 [DEBUG] [org.gradle.api.internal.project.ant.AntLoggingAdapter] [ant:expose] org/python/antlr/ast/Print.class added as org/python/antlr/ast/Print.class doesn't exist.
18:22:50.008 [DEBUG] [org.gradle.api.internal.project.ant.AntLoggingAdapter] [ant:expose] org/python/antlr/ast/Raise.class added as org/python/antlr/ast/Raise.class doesn't exist.
18:22:50.009 [DEBUG] [org.gradle.api.internal.project.ant.AntLoggingAdapter] [ant:expose] org/python/antlr/ast/Repr.class added as org/python/antlr/ast/Repr.class doesn't exist.
18:22:50.009 [DEBUG] [org.gradle.api.internal.project.ant.AntLoggingAdapter] [ant:expose] org/python/antlr/ast/Return.class added as org/python/antlr/ast/Return.class doesn't exist.
18:22:50.009 [DEBUG] [org.gradle.api.internal.project.ant.AntLoggingAdapter] [ant:expose] org/python/antlr/ast/Set.class added as org/python/antlr/ast/Set.class doesn't exist.
18:22:50.009 [DEBUG] [org.gradle.api.internal.project.ant.AntLoggingAdapter] [ant:expose] org/python/antlr/ast/SetComp.class added as org/python/antlr/ast/SetComp.class doesn't exist.
18:22:50.009 [DEBUG] [org.gradle.api.internal.project.ant.AntLoggingAdapter] [ant:expose] org/python/antlr/ast/Slice.class added as org/python/antlr/ast/Slice.class doesn't exist.
18:22:50.010 [DEBUG] [org.gradle.api.internal.project.ant.AntLoggingAdapter] [ant:expose] org/python/antlr/ast/Str.class added as org/python/antlr/ast/Str.class doesn't exist.
18:22:50.010 [DEBUG] [org.gradle.api.internal.project.ant.AntLoggingAdapter] [ant:expose] org/python/antlr/ast/Subscript.class added as org/python/antlr/ast/Subscript.class doesn't exist.
18:22:50.010 [DEBUG] [org.gradle.api.internal.project.ant.AntLoggingAdapter] [ant:expose] org/python/antlr/ast/Suite.class added as org/python/antlr/ast/Suite.class doesn't exist.
18:22:50.010 [DEBUG] [org.gradle.api.internal.project.ant.AntLoggingAdapter] [ant:expose] org/python/antlr/ast/TryExcept.class added as org/python/antlr/ast/TryExcept.class doesn't exist.
18:22:50.010 [DEBUG] [org.gradle.api.internal.project.ant.AntLoggingAdapter] [ant:expose] org/python/antlr/ast/TryFinally.class added as org/python/antlr/ast/TryFinally.class doesn't exist.
18:22:50.011 [DEBUG] [org.gradle.api.internal.project.ant.AntLoggingAdapter] [ant:expose] org/python/antlr/ast/Tuple.class added as org/python/antlr/ast/Tuple.class doesn't exist.
18:22:50.011 [DEBUG] [org.gradle.api.internal.project.ant.AntLoggingAdapter] [ant:expose] org/python/antlr/ast/UnaryOp.class added as org/python/antlr/ast/UnaryOp.class doesn't exist.
18:22:50.011 [DEBUG] [org.gradle.api.internal.project.ant.AntLoggingAdapter] [ant:expose] org/python/antlr/ast/While.class added as org/python/antlr/ast/While.class doesn't exist.
18:22:50.011 [DEBUG] [org.gradle.api.internal.project.ant.AntLoggingAdapter] [ant:expose] org/python/antlr/ast/With.class added as org/python/antlr/ast/With.class doesn't exist.
18:22:50.011 [DEBUG] [org.gradle.api.internal.project.ant.AntLoggingAdapter] [ant:expose] org/python/antlr/ast/Yield.class added as org/python/antlr/ast/Yield.class doesn't exist.
18:22:50.012 [DEBUG] [org.gradle.api.internal.project.ant.AntLoggingAdapter] [ant:expose] org/python/antlr/ast/alias.class added as org/python/antlr/ast/alias.class doesn't exist.
18:22:50.012 [DEBUG] [org.gradle.api.internal.project.ant.AntLoggingAdapter] [ant:expose] org/python/antlr/ast/arguments.class added as org/python/antlr/ast/arguments.class doesn't exist.
18:22:50.012 [DEBUG] [org.gradle.api.internal.project.ant.AntLoggingAdapter] [ant:expose] org/python/antlr/ast/comprehension.class added as org/python/antlr/ast/comprehension.class doesn't exist.
18:22:50.012 [DEBUG] [org.gradle.api.internal.project.ant.AntLoggingAdapter] [ant:expose] org/python/antlr/ast/keyword.class added as org/python/antlr/ast/keyword.class doesn't exist.
18:22:50.012 [DEBUG] [org.gradle.api.internal.project.ant.AntLoggingAdapter] [ant:expose] org/python/antlr/base/boolop.class added as org/python/antlr/base/boolop.class doesn't exist.
18:22:50.012 [DEBUG] [org.gradle.api.internal.project.ant.AntLoggingAdapter] [ant:expose] org/python/antlr/base/cmpop.class added as org/python/antlr/base/cmpop.class doesn't exist.
18:22:50.013 [DEBUG] [org.gradle.api.internal.project.ant.AntLoggingAdapter] [ant:expose] org/python/antlr/base/excepthandler.class added as org/python/antlr/base/excepthandler.class doesn't exist.
18:22:50.013 [DEBUG] [org.gradle.api.internal.project.ant.AntLoggingAdapter] [ant:expose] org/python/antlr/base/expr.class added as org/python/antlr/base/expr.class doesn't exist.
18:22:50.013 [DEBUG] [org.gradle.api.internal.project.ant.AntLoggingAdapter] [ant:expose] org/python/antlr/base/expr_context.class added as org/python/antlr/base/expr_context.class doesn't exist.
18:22:50.013 [DEBUG] [org.gradle.api.internal.project.ant.AntLoggingAdapter] [ant:expose] org/python/antlr/base/mod.class added as org/python/antlr/base/mod.class doesn't exist.
18:22:50.013 [DEBUG] [org.gradle.api.internal.project.ant.AntLoggingAdapter] [ant:expose] org/python/antlr/base/operator.class added as org/python/antlr/base/operator.class doesn't exist.
18:22:50.014 [DEBUG] [org.gradle.api.internal.project.ant.AntLoggingAdapter] [ant:expose] org/python/antlr/base/slice.class added as org/python/antlr/base/slice.class doesn't exist.
18:22:50.014 [DEBUG] [org.gradle.api.internal.project.ant.AntLoggingAdapter] [ant:expose] org/python/antlr/base/stmt.class added as org/python/antlr/base/stmt.class doesn't exist.
18:22:50.014 [DEBUG] [org.gradle.api.internal.project.ant.AntLoggingAdapter] [ant:expose] org/python/antlr/base/unaryop.class added as org/python/antlr/base/unaryop.class doesn't exist.
18:22:50.014 [DEBUG] [org.gradle.api.internal.project.ant.AntLoggingAdapter] [ant:expose] org/python/antlr/op/Add.class added as org/python/antlr/op/Add.class doesn't exist.
18:22:50.014 [DEBUG] [org.gradle.api.internal.project.ant.AntLoggingAdapter] [ant:expose] org/python/antlr/op/And.class added as org/python/antlr/op/And.class doesn't exist.
18:22:50.015 [DEBUG] [org.gradle.api.internal.project.ant.AntLoggingAdapter] [ant:expose] org/python/antlr/op/AugLoad.class added as org/python/antlr/op/AugLoad.class doesn't exist.
18:22:50.015 [DEBUG] [org.gradle.api.internal.project.ant.AntLoggingAdapter] [ant:expose] org/python/antlr/op/AugStore.class added as org/python/antlr/op/AugStore.class doesn't exist.
18:22:50.015 [DEBUG] [org.gradle.api.internal.project.ant.AntLoggingAdapter] [ant:expose] org/python/antlr/op/BitAnd.class added as org/python/antlr/op/BitAnd.class doesn't exist.
18:22:50.015 [DEBUG] [org.gradle.api.internal.project.ant.AntLoggingAdapter] [ant:expose] org/python/antlr/op/BitOr.class added as org/python/antlr/op/BitOr.class doesn't exist.
18:22:50.015 [DEBUG] [org.gradle.api.internal.project.ant.AntLoggingAdapter] [ant:expose] org/python/antlr/op/BitXor.class added as org/python/antlr/op/BitXor.class doesn't exist.
18:22:50.016 [DEBUG] [org.gradle.api.internal.project.ant.AntLoggingAdapter] [ant:expose] org/python/antlr/op/Del.class added as org/python/antlr/op/Del.class doesn't exist.
18:22:50.016 [DEBUG] [org.gradle.api.internal.project.ant.AntLoggingAdapter] [ant:expose] org/python/antlr/op/Div.class added as org/python/antlr/op/Div.class doesn't exist.
18:22:50.016 [DEBUG] [org.gradle.api.internal.project.ant.AntLoggingAdapter] [ant:expose] org/python/antlr/op/Eq.class added as org/python/antlr/op/Eq.class doesn't exist.
18:22:50.016 [DEBUG] [org.gradle.api.internal.project.ant.AntLoggingAdapter] [ant:expose] org/python/antlr/op/FloorDiv.class added as org/python/antlr/op/FloorDiv.class doesn't exist.
18:22:50.016 [DEBUG] [org.gradle.api.internal.project.ant.AntLoggingAdapter] [ant:expose] org/python/antlr/op/Gt.class added as org/python/antlr/op/Gt.class doesn't exist.
18:22:50.017 [DEBUG] [org.gradle.api.internal.project.ant.AntLoggingAdapter] [ant:expose] org/python/antlr/op/GtE.class added as org/python/antlr/op/GtE.class doesn't exist.
18:22:50.017 [DEBUG] [org.gradle.api.internal.project.ant.AntLoggingAdapter] [ant:expose] org/python/antlr/op/In.class added as org/python/antlr/op/In.class doesn't exist.
18:22:50.017 [DEBUG] [org.gradle.api.internal.project.ant.AntLoggingAdapter] [ant:expose] org/python/antlr/op/Invert.class added as org/python/antlr/op/Invert.class doesn't exist.
18:22:50.017 [DEBUG] [org.gradle.api.internal.project.ant.AntLoggingAdapter] [ant:expose] org/python/antlr/op/Is.class added as org/python/antlr/op/Is.class doesn't exist.
18:22:50.017 [DEBUG] [org.gradle.api.internal.project.ant.AntLoggingAdapter] [ant:expose] org/python/antlr/op/IsNot.class added as org/python/antlr/op/IsNot.class doesn't exist.
18:22:50.018 [DEBUG] [org.gradle.api.internal.project.ant.AntLoggingAdapter] [ant:expose] org/python/antlr/op/LShift.class added as org/python/antlr/op/LShift.class doesn't exist.
18:22:50.018 [DEBUG] [org.gradle.api.internal.project.ant.AntLoggingAdapter] [ant:expose] org/python/antlr/op/Load.class added as org/python/antlr/op/Load.class doesn't exist.
18:22:50.018 [DEBUG] [org.gradle.api.internal.project.ant.AntLoggingAdapter] [ant:expose] org/python/antlr/op/Lt.class added as org/python/antlr/op/Lt.class doesn't exist.
18:22:50.018 [DEBUG] [org.gradle.api.internal.project.ant.AntLoggingAdapter] [ant:expose] org/python/antlr/op/LtE.class added as org/python/antlr/op/LtE.class doesn't exist.
18:22:50.018 [DEBUG] [org.gradle.api.internal.project.ant.AntLoggingAdapter] [ant:expose] org/python/antlr/op/Mod.class added as org/python/antlr/op/Mod.class doesn't exist.
18:22:50.019 [DEBUG] [org.gradle.api.internal.project.ant.AntLoggingAdapter] [ant:expose] org/python/antlr/op/Mult.class added as org/python/antlr/op/Mult.class doesn't exist.
18:22:50.019 [DEBUG] [org.gradle.api.internal.project.ant.AntLoggingAdapter] [ant:expose] org/python/antlr/op/Not.class added as org/python/antlr/op/Not.class doesn't exist.
18:22:50.019 [DEBUG] [org.gradle.api.internal.project.ant.AntLoggingAdapter] [ant:expose] org/python/antlr/op/NotEq.class added as org/python/antlr/op/NotEq.class doesn't exist.
18:22:50.019 [DEBUG] [org.gradle.api.internal.project.ant.AntLoggingAdapter] [ant:expose] org/python/antlr/op/NotIn.class added as org/python/antlr/op/NotIn.class doesn't exist.
18:22:50.019 [DEBUG] [org.gradle.api.internal.project.ant.AntLoggingAdapter] [ant:expose] org/python/antlr/op/Or.class added as org/python/antlr/op/Or.class doesn't exist.
18:22:50.020 [DEBUG] [org.gradle.api.internal.project.ant.AntLoggingAdapter] [ant:expose] org/python/antlr/op/Param.class added as org/python/antlr/op/Param.class doesn't exist.
18:22:50.020 [DEBUG] [org.gradle.api.internal.project.ant.AntLoggingAdapter] [ant:expose] org/python/antlr/op/Pow.class added as org/python/antlr/op/Pow.class doesn't exist.
18:22:50.020 [DEBUG] [org.gradle.api.internal.project.ant.AntLoggingAdapter] [ant:expose] org/python/antlr/op/RShift.class added as org/python/antlr/op/RShift.class doesn't exist.
18:22:50.020 [DEBUG] [org.gradle.api.internal.project.ant.AntLoggingAdapter] [ant:expose] org/python/antlr/op/Store.class added as org/python/antlr/op/Store.class doesn't exist.
18:22:50.020 [DEBUG] [org.gradle.api.internal.project.ant.AntLoggingAdapter] [ant:expose] org/python/antlr/op/Sub.class added as org/python/antlr/op/Sub.class doesn't exist.
18:22:50.020 [DEBUG] [org.gradle.api.internal.project.ant.AntLoggingAdapter] [ant:expose] org/python/antlr/op/UAdd.class added as org/python/antlr/op/UAdd.class doesn't exist.
18:22:50.021 [DEBUG] [org.gradle.api.internal.project.ant.AntLoggingAdapter] [ant:expose] org/python/antlr/op/USub.class added as org/python/antlr/op/USub.class doesn't exist.
18:22:50.021 [DEBUG] [org.gradle.api.internal.project.ant.AntLoggingAdapter] [ant:expose] org/python/core/AstList.class added as org/python/core/AstList.class doesn't exist.
18:22:50.021 [DEBUG] [org.gradle.api.internal.project.ant.AntLoggingAdapter] [ant:expose] org/python/core/ClasspathPyImporter.class added as org/python/core/ClasspathPyImporter.class doesn't exist.
18:22:50.021 [DEBUG] [org.gradle.api.internal.project.ant.AntLoggingAdapter] [ant:expose] org/python/core/FloatInfo.class added as org/python/core/FloatInfo.class doesn't exist.
18:22:50.021 [DEBUG] [org.gradle.api.internal.project.ant.AntLoggingAdapter] [ant:expose] org/python/core/LongInfo.class added as org/python/core/LongInfo.class doesn't exist.
18:22:50.022 [DEBUG] [org.gradle.api.internal.project.ant.AntLoggingAdapter] [ant:expose] org/python/core/Py2kBuffer.class added as org/python/core/Py2kBuffer.class doesn't exist.
18:22:50.022 [DEBUG] [org.gradle.api.internal.project.ant.AntLoggingAdapter] [ant:expose] org/python/core/PyArray.class added as org/python/core/PyArray.class doesn't exist.
18:22:50.022 [DEBUG] [org.gradle.api.internal.project.ant.AntLoggingAdapter] [ant:expose] org/python/core/PyBaseException.class added as org/python/core/PyBaseException.class doesn't exist.
18:22:50.022 [DEBUG] [org.gradle.api.internal.project.ant.AntLoggingAdapter] [ant:expose] org/python/core/PyBaseString.class added as org/python/core/PyBaseString.class doesn't exist.
18:22:50.022 [DEBUG] [org.gradle.api.internal.project.ant.AntLoggingAdapter] [ant:expose] org/python/core/PyBoolean.class added as org/python/core/PyBoolean.class doesn't exist.
18:22:50.022 [DEBUG] [org.gradle.api.internal.project.ant.AntLoggingAdapter] [ant:expose] org/python/core/PyBuiltinCallable.class added as org/python/core/PyBuiltinCallable.class doesn't exist.
18:22:50.023 [DEBUG] [org.gradle.api.internal.project.ant.AntLoggingAdapter] [ant:expose] org/python/core/PyByteArray.class added as org/python/core/PyByteArray.class doesn't exist.
18:22:50.023 [DEBUG] [org.gradle.api.internal.project.ant.AntLoggingAdapter] [ant:expose] org/python/core/PyCell.class added as org/python/core/PyCell.class doesn't exist.
18:22:50.023 [DEBUG] [org.gradle.api.internal.project.ant.AntLoggingAdapter] [ant:expose] org/python/core/PyClass.class added as org/python/core/PyClass.class doesn't exist.
18:22:50.023 [DEBUG] [org.gradle.api.internal.project.ant.AntLoggingAdapter] [ant:expose] org/python/core/PyClassMethod.class added as org/python/core/PyClassMethod.class doesn't exist.
18:22:50.023 [DEBUG] [org.gradle.api.internal.project.ant.AntLoggingAdapter] [ant:expose] org/python/core/PyClassMethodDescr.class added as org/python/core/PyClassMethodDescr.class doesn't exist.
18:22:50.024 [DEBUG] [org.gradle.api.internal.project.ant.AntLoggingAdapter] [ant:expose] org/python/core/PyComplex.class added as org/python/core/PyComplex.class doesn't exist.
18:22:50.024 [DEBUG] [org.gradle.api.internal.project.ant.AntLoggingAdapter] [ant:expose] org/python/core/PyDataDescr.class added as org/python/core/PyDataDescr.class doesn't exist.
18:22:50.024 [DEBUG] [org.gradle.api.internal.project.ant.AntLoggingAdapter] [ant:expose] org/python/core/PyDictProxy.class added as org/python/core/PyDictProxy.class doesn't exist.
18:22:50.024 [DEBUG] [org.gradle.api.internal.project.ant.AntLoggingAdapter] [ant:expose] org/python/core/PyDictionary$PyDictionaryViewItems.class added as org/python/core/PyDictionary$PyDictionaryViewItems.class doesn't exist.
18:22:50.024 [DEBUG] [org.gradle.api.internal.project.ant.AntLoggingAdapter] [ant:expose] org/python/core/PyDictionary$PyDictionaryViewKeys.class added as org/python/core/PyDictionary$PyDictionaryViewKeys.class doesn't exist.
18:22:50.025 [DEBUG] [org.gradle.api.internal.project.ant.AntLoggingAdapter] [ant:expose] org/python/core/PyDictionary$PyDictionaryViewValues.class added as org/python/core/PyDictionary$PyDictionaryViewValues.class doesn't exist.
18:22:50.025 [DEBUG] [org.gradle.api.internal.project.ant.AntLoggingAdapter] [ant:expose] org/python/core/PyDictionary.class added as org/python/core/PyDictionary.class doesn't exist.
18:22:50.025 [DEBUG] [org.gradle.api.internal.project.ant.AntLoggingAdapter] [ant:expose] org/python/core/PyEllipsis.class added as org/python/core/PyEllipsis.class doesn't exist.
18:22:50.025 [DEBUG] [org.gradle.api.internal.project.ant.AntLoggingAdapter] [ant:expose] org/python/core/PyEnumerate.class added as org/python/core/PyEnumerate.class doesn't exist.
18:22:50.025 [DEBUG] [org.gradle.api.internal.project.ant.AntLoggingAdapter] [ant:expose] org/python/core/PyFastSequenceIter.class added as org/python/core/PyFastSequenceIter.class doesn't exist.
18:22:50.025 [DEBUG] [org.gradle.api.internal.project.ant.AntLoggingAdapter] [ant:expose] org/python/core/PyFile.class added as org/python/core/PyFile.class doesn't exist.
18:22:50.026 [DEBUG] [org.gradle.api.internal.project.ant.AntLoggingAdapter] [ant:expose] org/python/core/PyFloat.class added as org/python/core/PyFloat.class doesn't exist.
18:22:50.026 [DEBUG] [org.gradle.api.internal.project.ant.AntLoggingAdapter] [ant:expose] org/python/core/PyFrame.class added as org/python/core/PyFrame.class doesn't exist.
18:22:50.026 [DEBUG] [org.gradle.api.internal.project.ant.AntLoggingAdapter] [ant:expose] org/python/core/PyFrozenSet.class added as org/python/core/PyFrozenSet.class doesn't exist.
18:22:50.026 [DEBUG] [org.gradle.api.internal.project.ant.AntLoggingAdapter] [ant:expose] org/python/core/PyFunction.class added as org/python/core/PyFunction.class doesn't exist.
18:22:50.027 [DEBUG] [org.gradle.api.internal.project.ant.AntLoggingAdapter] [ant:expose] org/python/core/PyGenerator.class added as org/python/core/PyGenerator.class doesn't exist.
18:22:50.027 [DEBUG] [org.gradle.api.internal.project.ant.AntLoggingAdapter] [ant:expose] org/python/core/PyInstance.class added as org/python/core/PyInstance.class doesn't exist.
18:22:50.027 [DEBUG] [org.gradle.api.internal.project.ant.AntLoggingAdapter] [ant:expose] org/python/core/PyInteger.class added as org/python/core/PyInteger.class doesn't exist.
18:22:50.027 [DEBUG] [org.gradle.api.internal.project.ant.AntLoggingAdapter] [ant:expose] org/python/core/PyList.class added as org/python/core/PyList.class doesn't exist.
18:22:50.027 [DEBUG] [org.gradle.api.internal.project.ant.AntLoggingAdapter] [ant:expose] org/python/core/PyListIterator.class added as org/python/core/PyListIterator.class doesn't exist.
18:22:50.028 [DEBUG] [org.gradle.api.internal.project.ant.AntLoggingAdapter] [ant:expose] org/python/core/PyLong.class added as org/python/core/PyLong.class doesn't exist.
18:22:50.028 [DEBUG] [org.gradle.api.internal.project.ant.AntLoggingAdapter] [ant:expose] org/python/core/PyMemoryView.class added as org/python/core/PyMemoryView.class doesn't exist.
18:22:50.028 [DEBUG] [org.gradle.api.internal.project.ant.AntLoggingAdapter] [ant:expose] org/python/core/PyMethod.class added as org/python/core/PyMethod.class doesn't exist.
18:22:50.028 [DEBUG] [org.gradle.api.internal.project.ant.AntLoggingAdapter] [ant:expose] org/python/core/PyMethodDescr.class added as org/python/core/PyMethodDescr.class doesn't exist.
18:22:50.028 [DEBUG] [org.gradle.api.internal.project.ant.AntLoggingAdapter] [ant:expose] org/python/core/PyModule.class added as org/python/core/PyModule.class doesn't exist.
18:22:50.028 [DEBUG] [org.gradle.api.internal.project.ant.AntLoggingAdapter] [ant:expose] org/python/core/PyNone.class added as org/python/core/PyNone.class doesn't exist.
18:22:50.029 [DEBUG] [org.gradle.api.internal.project.ant.AntLoggingAdapter] [ant:expose] org/python/core/PyNullImporter.class added as org/python/core/PyNullImporter.class doesn't exist.
18:22:50.029 [DEBUG] [org.gradle.api.internal.project.ant.AntLoggingAdapter] [ant:expose] org/python/core/PyObject.class added as org/python/core/PyObject.class doesn't exist.
18:22:50.029 [DEBUG] [org.gradle.api.internal.project.ant.AntLoggingAdapter] [ant:expose] org/python/core/PyProperty.class added as org/python/core/PyProperty.class doesn't exist.
18:22:50.029 [DEBUG] [org.gradle.api.internal.project.ant.AntLoggingAdapter] [ant:expose] org/python/core/PySet.class added as org/python/core/PySet.class doesn't exist.
18:22:50.029 [DEBUG] [org.gradle.api.internal.project.ant.AntLoggingAdapter] [ant:expose] org/python/core/PyShadowString.class added as org/python/core/PyShadowString.class doesn't exist.
18:22:50.030 [DEBUG] [org.gradle.api.internal.project.ant.AntLoggingAdapter] [ant:expose] org/python/core/PySlice.class added as org/python/core/PySlice.class doesn't exist.
18:22:50.030 [DEBUG] [org.gradle.api.internal.project.ant.AntLoggingAdapter] [ant:expose] org/python/core/PySlot.class added as org/python/core/PySlot.class doesn't exist.
18:22:50.030 [DEBUG] [org.gradle.api.internal.project.ant.AntLoggingAdapter] [ant:expose] org/python/core/PyStaticMethod.class added as org/python/core/PyStaticMethod.class doesn't exist.
18:22:50.030 [DEBUG] [org.gradle.api.internal.project.ant.AntLoggingAdapter] [ant:expose] org/python/core/PyString.class added as org/python/core/PyString.class doesn't exist.
18:22:50.030 [DEBUG] [org.gradle.api.internal.project.ant.AntLoggingAdapter] [ant:expose] org/python/core/PyStringMap.class added as org/python/core/PyStringMap.class doesn't exist.
18:22:50.030 [DEBUG] [org.gradle.api.internal.project.ant.AntLoggingAdapter] [ant:expose] org/python/core/PySuper.class added as org/python/core/PySuper.class doesn't exist.
18:22:50.031 [DEBUG] [org.gradle.api.internal.project.ant.AntLoggingAdapter] [ant:expose] org/python/core/PyTraceback.class added as org/python/core/PyTraceback.class doesn't exist.
18:22:50.031 [DEBUG] [org.gradle.api.internal.project.ant.AntLoggingAdapter] [ant:expose] org/python/core/PyTuple.class added as org/python/core/PyTuple.class doesn't exist.
18:22:50.031 [DEBUG] [org.gradle.api.internal.project.ant.AntLoggingAdapter] [ant:expose] org/python/core/PyTupleIterator.class added as org/python/core/PyTupleIterator.class doesn't exist.
18:22:50.031 [DEBUG] [org.gradle.api.internal.project.ant.AntLoggingAdapter] [ant:expose] org/python/core/PyType.class added as org/python/core/PyType.class doesn't exist.
18:22:50.031 [DEBUG] [org.gradle.api.internal.project.ant.AntLoggingAdapter] [ant:expose] org/python/core/PyUnicode.class added as org/python/core/PyUnicode.class doesn't exist.
18:22:50.032 [DEBUG] [org.gradle.api.internal.project.ant.AntLoggingAdapter] [ant:expose] org/python/core/PyVersionInfo.class added as org/python/core/PyVersionInfo.class doesn't exist.
18:22:50.032 [DEBUG] [org.gradle.api.internal.project.ant.AntLoggingAdapter] [ant:expose] org/python/core/PyXRange.class added as org/python/core/PyXRange.class doesn't exist.
18:22:50.032 [DEBUG] [org.gradle.api.internal.project.ant.AntLoggingAdapter] [ant:expose] org/python/core/PyXRangeIter.class added as org/python/core/PyXRangeIter.class doesn't exist.
18:22:50.032 [DEBUG] [org.gradle.api.internal.project.ant.AntLoggingAdapter] [ant:expose] org/python/core/WinVersion.class added as org/python/core/WinVersion.class doesn't exist.
18:22:50.032 [DEBUG] [org.gradle.api.internal.project.ant.AntLoggingAdapter] [ant:expose] org/python/core/stringlib/FieldNameIterator.class added as org/python/core/stringlib/FieldNameIterator.class doesn't exist.
18:22:50.033 [DEBUG] [org.gradle.api.internal.project.ant.AntLoggingAdapter] [ant:expose] org/python/core/stringlib/MarkupIterator.class added as org/python/core/stringlib/MarkupIterator.class doesn't exist.
18:22:50.033 [DEBUG] [org.gradle.api.internal.project.ant.AntLoggingAdapter] [ant:expose] org/python/jsr223/PyScriptEngineScope.class added as org/python/jsr223/PyScriptEngineScope.class doesn't exist.
18:22:50.033 [DEBUG] [org.gradle.api.internal.project.ant.AntLoggingAdapter] [ant:expose] org/python/modules/PyStruct.class added as org/python/modules/PyStruct.class doesn't exist.
18:22:50.033 [DEBUG] [org.gradle.api.internal.project.ant.AntLoggingAdapter] [ant:expose] org/python/modules/_codecs$EncodingMap.class added as org/python/modules/_codecs$EncodingMap.class doesn't exist.
18:22:50.033 [DEBUG] [org.gradle.api.internal.project.ant.AntLoggingAdapter] [ant:expose] org/python/modules/_collections/PyDefaultDict.class added as org/python/modules/_collections/PyDefaultDict.class doesn't exist.
18:22:50.033 [DEBUG] [org.gradle.api.internal.project.ant.AntLoggingAdapter] [ant:expose] org/python/modules/_collections/PyDeque.class added as org/python/modules/_collections/PyDeque.class doesn't exist.
18:22:50.034 [DEBUG] [org.gradle.api.internal.project.ant.AntLoggingAdapter] [ant:expose] org/python/modules/_csv/PyDialect.class added as org/python/modules/_csv/PyDialect.class doesn't exist.
18:22:50.034 [DEBUG] [org.gradle.api.internal.project.ant.AntLoggingAdapter] [ant:expose] org/python/modules/_csv/PyReader.class added as org/python/modules/_csv/PyReader.class doesn't exist.
18:22:50.034 [DEBUG] [org.gradle.api.internal.project.ant.AntLoggingAdapter] [ant:expose] org/python/modules/_csv/PyWriter.class added as org/python/modules/_csv/PyWriter.class doesn't exist.
18:22:50.034 [DEBUG] [org.gradle.api.internal.project.ant.AntLoggingAdapter] [ant:expose] org/python/modules/_functools/PyPartial.class added as org/python/modules/_functools/PyPartial.class doesn't exist.
18:22:50.034 [DEBUG] [org.gradle.api.internal.project.ant.AntLoggingAdapter] [ant:expose] org/python/modules/_hashlib$Hash.class added as org/python/modules/_hashlib$Hash.class doesn't exist.
18:22:50.035 [DEBUG] [org.gradle.api.internal.project.ant.AntLoggingAdapter] [ant:expose] org/python/modules/_io/PyFileIO.class added as org/python/modules/_io/PyFileIO.class doesn't exist.
18:22:50.035 [DEBUG] [org.gradle.api.internal.project.ant.AntLoggingAdapter] [ant:expose] org/python/modules/_io/PyIOBase.class added as org/python/modules/_io/PyIOBase.class doesn't exist.
18:22:50.035 [DEBUG] [org.gradle.api.internal.project.ant.AntLoggingAdapter] [ant:expose] org/python/modules/_io/PyRawIOBase.class added as org/python/modules/_io/PyRawIOBase.class doesn't exist.
18:22:50.035 [DEBUG] [org.gradle.api.internal.project.ant.AntLoggingAdapter] [ant:expose] org/python/modules/_json/Encoder.class added as org/python/modules/_json/Encoder.class doesn't exist.
18:22:50.035 [DEBUG] [org.gradle.api.internal.project.ant.AntLoggingAdapter] [ant:expose] org/python/modules/_json/Scanner.class added as org/python/modules/_json/Scanner.class doesn't exist.
18:22:50.035 [DEBUG] [org.gradle.api.internal.project.ant.AntLoggingAdapter] [ant:expose] org/python/modules/_threading/Condition.class added as org/python/modules/_threading/Condition.class doesn't exist.
18:22:50.036 [DEBUG] [org.gradle.api.internal.project.ant.AntLoggingAdapter] [ant:expose] org/python/modules/_threading/Lock.class added as org/python/modules/_threading/Lock.class doesn't exist.
18:22:50.036 [DEBUG] [org.gradle.api.internal.project.ant.AntLoggingAdapter] [ant:expose] org/python/modules/_threading/RLock.class added as org/python/modules/_threading/RLock.class doesn't exist.
18:22:50.036 [DEBUG] [org.gradle.api.internal.project.ant.AntLoggingAdapter] [ant:expose] org/python/modules/_weakref/CallableProxyType.class added as org/python/modules/_weakref/CallableProxyType.class doesn't exist.
18:22:50.036 [DEBUG] [org.gradle.api.internal.project.ant.AntLoggingAdapter] [ant:expose] org/python/modules/_weakref/ProxyType.class added as org/python/modules/_weakref/ProxyType.class doesn't exist.
18:22:50.036 [DEBUG] [org.gradle.api.internal.project.ant.AntLoggingAdapter] [ant:expose] org/python/modules/_weakref/ReferenceType.class added as org/python/modules/_weakref/ReferenceType.class doesn't exist.
18:22:50.037 [DEBUG] [org.gradle.api.internal.project.ant.AntLoggingAdapter] [ant:expose] org/python/modules/bz2/PyBZ2Compressor.class added as org/python/modules/bz2/PyBZ2Compressor.class doesn't exist.
18:22:50.037 [DEBUG] [org.gradle.api.internal.project.ant.AntLoggingAdapter] [ant:expose] org/python/modules/bz2/PyBZ2Decompressor.class added as org/python/modules/bz2/PyBZ2Decompressor.class doesn't exist.
18:22:50.037 [DEBUG] [org.gradle.api.internal.project.ant.AntLoggingAdapter] [ant:expose] org/python/modules/bz2/PyBZ2File.class added as org/python/modules/bz2/PyBZ2File.class doesn't exist.
18:22:50.037 [DEBUG] [org.gradle.api.internal.project.ant.AntLoggingAdapter] [ant:expose] org/python/modules/itertools/PyTeeIterator.class added as org/python/modules/itertools/PyTeeIterator.class doesn't exist.
18:22:50.037 [DEBUG] [org.gradle.api.internal.project.ant.AntLoggingAdapter] [ant:expose] org/python/modules/itertools/chain.class added as org/python/modules/itertools/chain.class doesn't exist.
18:22:50.038 [DEBUG] [org.gradle.api.internal.project.ant.AntLoggingAdapter] [ant:expose] org/python/modules/itertools/combinations.class added as org/python/modules/itertools/combinations.class doesn't exist.
18:22:50.038 [DEBUG] [org.gradle.api.internal.project.ant.AntLoggingAdapter] [ant:expose] org/python/modules/itertools/combinationsWithReplacement.class added as org/python/modules/itertools/combinationsWithReplacement.class doesn't exist.
18:22:50.038 [DEBUG] [org.gradle.api.internal.project.ant.AntLoggingAdapter] [ant:expose] org/python/modules/itertools/compress.class added as org/python/modules/itertools/compress.class doesn't exist.
18:22:50.038 [DEBUG] [org.gradle.api.internal.project.ant.AntLoggingAdapter] [ant:expose] org/python/modules/itertools/count.class added as org/python/modules/itertools/count.class doesn't exist.
18:22:50.038 [DEBUG] [org.gradle.api.internal.project.ant.AntLoggingAdapter] [ant:expose] org/python/modules/itertools/cycle.class added as org/python/modules/itertools/cycle.class doesn't exist.
18:22:50.039 [DEBUG] [org.gradle.api.internal.project.ant.AntLoggingAdapter] [ant:expose] org/python/modules/itertools/dropwhile.class added as org/python/modules/itertools/dropwhile.class doesn't exist.
18:22:50.039 [DEBUG] [org.gradle.api.internal.project.ant.AntLoggingAdapter] [ant:expose] org/python/modules/itertools/groupby.class added as org/python/modules/itertools/groupby.class doesn't exist.
18:22:50.039 [DEBUG] [org.gradle.api.internal.project.ant.AntLoggingAdapter] [ant:expose] org/python/modules/itertools/ifilter.class added as org/python/modules/itertools/ifilter.class doesn't exist.
18:22:50.039 [DEBUG] [org.gradle.api.internal.project.ant.AntLoggingAdapter] [ant:expose] org/python/modules/itertools/ifilterfalse.class added as org/python/modules/itertools/ifilterfalse.class doesn't exist.
18:22:50.039 [DEBUG] [org.gradle.api.internal.project.ant.AntLoggingAdapter] [ant:expose] org/python/modules/itertools/imap.class added as org/python/modules/itertools/imap.class doesn't exist.
18:22:50.040 [DEBUG] [org.gradle.api.internal.project.ant.AntLoggingAdapter] [ant:expose] org/python/modules/itertools/islice.class added as org/python/modules/itertools/islice.class doesn't exist.
18:22:50.040 [DEBUG] [org.gradle.api.internal.project.ant.AntLoggingAdapter] [ant:expose] org/python/modules/itertools/izip.class added as org/python/modules/itertools/izip.class doesn't exist.
18:22:50.040 [DEBUG] [org.gradle.api.internal.project.ant.AntLoggingAdapter] [ant:expose] org/python/modules/itertools/izipLongest.class added as org/python/modules/itertools/izipLongest.class doesn't exist.
18:22:50.040 [DEBUG] [org.gradle.api.internal.project.ant.AntLoggingAdapter] [ant:expose] org/python/modules/itertools/permutations.class added as org/python/modules/itertools/permutations.class doesn't exist.
18:22:50.040 [DEBUG] [org.gradle.api.internal.project.ant.AntLoggingAdapter] [ant:expose] org/python/modules/itertools/product.class added as org/python/modules/itertools/product.class doesn't exist.
18:22:50.041 [DEBUG] [org.gradle.api.internal.project.ant.AntLoggingAdapter] [ant:expose] org/python/modules/itertools/repeat.class added as org/python/modules/itertools/repeat.class doesn't exist.
18:22:50.041 [DEBUG] [org.gradle.api.internal.project.ant.AntLoggingAdapter] [ant:expose] org/python/modules/itertools/starmap.class added as org/python/modules/itertools/starmap.class doesn't exist.
18:22:50.041 [DEBUG] [org.gradle.api.internal.project.ant.AntLoggingAdapter] [ant:expose] org/python/modules/itertools/takewhile.class added as org/python/modules/itertools/takewhile.class doesn't exist.
18:22:50.041 [DEBUG] [org.gradle.api.internal.project.ant.AntLoggingAdapter] [ant:expose] org/python/modules/jffi/ArrayCData.class added as org/python/modules/jffi/ArrayCData.class doesn't exist.
18:22:50.041 [DEBUG] [org.gradle.api.internal.project.ant.AntLoggingAdapter] [ant:expose] org/python/modules/jffi/ByReference.class added as org/python/modules/jffi/ByReference.class doesn't exist.
18:22:50.041 [DEBUG] [org.gradle.api.internal.project.ant.AntLoggingAdapter] [ant:expose] org/python/modules/jffi/CData.class added as org/python/modules/jffi/CData.class doesn't exist.
18:22:50.042 [DEBUG] [org.gradle.api.internal.project.ant.AntLoggingAdapter] [ant:expose] org/python/modules/jffi/CType$Array.class added as org/python/modules/jffi/CType$Array.class doesn't exist.
18:22:50.042 [DEBUG] [org.gradle.api.internal.project.ant.AntLoggingAdapter] [ant:expose] org/python/modules/jffi/CType$Custom.class added as org/python/modules/jffi/CType$Custom.class doesn't exist.
18:22:50.042 [DEBUG] [org.gradle.api.internal.project.ant.AntLoggingAdapter] [ant:expose] org/python/modules/jffi/CType$Pointer.class added as org/python/modules/jffi/CType$Pointer.class doesn't exist.
18:22:50.042 [DEBUG] [org.gradle.api.internal.project.ant.AntLoggingAdapter] [ant:expose] org/python/modules/jffi/CType.class added as org/python/modules/jffi/CType.class doesn't exist.
18:22:50.042 [DEBUG] [org.gradle.api.internal.project.ant.AntLoggingAdapter] [ant:expose] org/python/modules/jffi/DynamicLibrary$Symbol.class added as org/python/modules/jffi/DynamicLibrary$Symbol.class doesn't exist.
18:22:50.043 [DEBUG] [org.gradle.api.internal.project.ant.AntLoggingAdapter] [ant:expose] org/python/modules/jffi/DynamicLibrary.class added as org/python/modules/jffi/DynamicLibrary.class doesn't exist.
18:22:50.043 [DEBUG] [org.gradle.api.internal.project.ant.AntLoggingAdapter] [ant:expose] org/python/modules/jffi/Function.class added as org/python/modules/jffi/Function.class doesn't exist.
18:22:50.043 [DEBUG] [org.gradle.api.internal.project.ant.AntLoggingAdapter] [ant:expose] org/python/modules/jffi/PointerCData.class added as org/python/modules/jffi/PointerCData.class doesn't exist.
18:22:50.043 [DEBUG] [org.gradle.api.internal.project.ant.AntLoggingAdapter] [ant:expose] org/python/modules/jffi/ScalarCData.class added as org/python/modules/jffi/ScalarCData.class doesn't exist.
18:22:50.043 [DEBUG] [org.gradle.api.internal.project.ant.AntLoggingAdapter] [ant:expose] org/python/modules/jffi/StringCData.class added as org/python/modules/jffi/StringCData.class doesn't exist.
18:22:50.043 [DEBUG] [org.gradle.api.internal.project.ant.AntLoggingAdapter] [ant:expose] org/python/modules/jffi/StructLayout$Field.class added as org/python/modules/jffi/StructLayout$Field.class doesn't exist.
18:22:50.044 [DEBUG] [org.gradle.api.internal.project.ant.AntLoggingAdapter] [ant:expose] org/python/modules/jffi/StructLayout$ScalarField.class added as org/python/modules/jffi/StructLayout$ScalarField.class doesn't exist.
18:22:50.044 [DEBUG] [org.gradle.api.internal.project.ant.AntLoggingAdapter] [ant:expose] org/python/modules/jffi/StructLayout.class added as org/python/modules/jffi/StructLayout.class doesn't exist.
18:22:50.044 [DEBUG] [org.gradle.api.internal.project.ant.AntLoggingAdapter] [ant:expose] org/python/modules/jffi/Structure.class added as org/python/modules/jffi/Structure.class doesn't exist.
18:22:50.044 [DEBUG] [org.gradle.api.internal.project.ant.AntLoggingAdapter] [ant:expose] org/python/modules/operator$PyAttrGetter.class added as org/python/modules/operator$PyAttrGetter.class doesn't exist.
18:22:50.044 [DEBUG] [org.gradle.api.internal.project.ant.AntLoggingAdapter] [ant:expose] org/python/modules/operator$PyItemGetter.class added as org/python/modules/operator$PyItemGetter.class doesn't exist.
18:22:50.045 [DEBUG] [org.gradle.api.internal.project.ant.AntLoggingAdapter] [ant:expose] org/python/modules/operator$PyMethodCaller.class added as org/python/modules/operator$PyMethodCaller.class doesn't exist.
18:22:50.045 [DEBUG] [org.gradle.api.internal.project.ant.AntLoggingAdapter] [ant:expose] org/python/modules/posix/PyStatResult.class added as org/python/modules/posix/PyStatResult.class doesn't exist.
18:22:50.045 [DEBUG] [org.gradle.api.internal.project.ant.AntLoggingAdapter] [ant:expose] org/python/modules/random/PyRandom.class added as org/python/modules/random/PyRandom.class doesn't exist.
18:22:50.045 [DEBUG] [org.gradle.api.internal.project.ant.AntLoggingAdapter] [ant:expose] org/python/modules/sre/PatternObject.class added as org/python/modules/sre/PatternObject.class doesn't exist.
18:22:50.045 [DEBUG] [org.gradle.api.internal.project.ant.AntLoggingAdapter] [ant:expose] org/python/modules/thread/PyLocal.class added as org/python/modules/thread/PyLocal.class doesn't exist.
18:22:50.045 [DEBUG] [org.gradle.api.internal.project.ant.AntLoggingAdapter] [ant:expose] org/python/modules/time/PyTimeTuple.class added as org/python/modules/time/PyTimeTuple.class doesn't exist.
18:22:50.046 [DEBUG] [org.gradle.api.internal.project.ant.AntLoggingAdapter] [ant:expose] org/python/modules/zipimport/zipimporter.class added as org/python/modules/zipimport/zipimporter.class doesn't exist.
18:22:50.046 [DEBUG] [org.gradle.api.internal.project.ant.AntLoggingAdapter] Class java.lang.StringBuilder loaded from parent loader (parentFirst)
18:22:50.046 [INFO] [org.gradle.api.internal.project.ant.AntLoggingAdapter] [ant:expose] Exposing 235 classes
18:22:50.047 [DEBUG] [org.gradle.api.internal.project.ant.AntLoggingAdapter] Class java.util.Iterator loaded from parent loader (parentFirst)
18:22:50.047 [DEBUG] [org.gradle.api.internal.project.ant.AntLoggingAdapter] Finding class org.python.expose.generate.ExposedTypeProcessor
18:22:50.047 [DEBUG] [org.gradle.api.internal.project.ant.AntLoggingAdapter] Loaded from /home/jenkins/.jenkins/jobs/gluu-jython/workspace/build2/unexposed org/python/expose/generate/ExposedTypeProcessor.class
18:22:50.047 [DEBUG] [org.gradle.api.internal.project.ant.AntLoggingAdapter] Class org.python.expose.generate.ExposedTypeProcessor loaded from ant loader (parentFirst)
18:22:50.048 [DEBUG] [org.gradle.api.internal.project.ant.AntLoggingAdapter] Class java.util.Collection loaded from parent loader (parentFirst)
18:22:50.048 [DEBUG] [org.gradle.api.internal.project.ant.AntLoggingAdapter] Finding class org.python.expose.generate.ExposedTypeProcessor$TypeProcessor
18:22:50.048 [DEBUG] [org.gradle.api.internal.project.ant.AntLoggingAdapter] Loaded from /home/jenkins/.jenkins/jobs/gluu-jython/workspace/build2/unexposed org/python/expose/generate/ExposedTypeProcessor$TypeProcessor.class
18:22:50.049 [DEBUG] [org.gradle.api.internal.project.ant.AntLoggingAdapter] Class org.python.expose.generate.ExposedTypeProcessor$TypeProcessor loaded from ant loader (parentFirst)
18:22:50.050 [DEBUG] [org.gradle.api.internal.project.ant.AntLoggingAdapter] Class java.util.ArrayList loaded from parent loader (parentFirst)
18:22:50.050 [DEBUG] [org.gradle.api.internal.project.ant.AntLoggingAdapter] Class java.util.HashMap loaded from parent loader (parentFirst)
18:22:50.050 [DEBUG] [org.gradle.api.internal.project.ant.AntLoggingAdapter] Finding class org.objectweb.asm.ClassReader
18:22:50.050 [DEBUG] [org.gradle.api.internal.project.ant.AntLoggingAdapter] Loaded from /home/jenkins/.gradle/caches/modules-2/files-2.1/org.ow2.asm/asm/7.1/fa29aa438674ff19d5e1386d2c3527a0267f291e/asm-7.1.jar org/objectweb/asm/ClassReader.class
18:22:50.052 [DEBUG] [org.gradle.api.internal.project.ant.AntLoggingAdapter] Class org.objectweb.asm.ClassReader loaded from ant loader (parentFirst)
18:22:50.054 [DEBUG] [org.gradle.api.internal.project.ant.AntLoggingAdapter] Class java.lang.IllegalArgumentException loaded from parent loader (parentFirst)
18:22:50.057 [DEBUG] [org.gradle.api.internal.project.ant.AntLoggingAdapter] Class java.lang.AssertionError loaded from parent loader (parentFirst)
18:22:50.059 [DEBUG] [org.gradle.api.internal.project.ant.AntLoggingAdapter] Class java.io.ByteArrayOutputStream loaded from parent loader (parentFirst)
18:22:50.059 [DEBUG] [org.gradle.api.internal.project.ant.AntLoggingAdapter] Class java.lang.String loaded from parent loader (parentFirst)
18:22:50.060 [DEBUG] [org.gradle.api.internal.project.ant.AntLoggingAdapter] Class java.lang.UnsupportedOperationException loaded from parent loader (parentFirst)
18:22:50.060 [DEBUG] [org.gradle.api.internal.project.ant.AntLoggingAdapter] Finding class org.objectweb.asm.ModuleVisitor
18:22:50.060 [DEBUG] [org.gradle.api.internal.project.ant.AntLoggingAdapter] Loaded from /home/jenkins/.gradle/caches/modules-2/files-2.1/org.ow2.asm/asm/7.1/fa29aa438674ff19d5e1386d2c3527a0267f291e/asm-7.1.jar org/objectweb/asm/ModuleVisitor.class
18:22:50.061 [DEBUG] [org.gradle.api.internal.project.ant.AntLoggingAdapter] Class org.objectweb.asm.ModuleVisitor loaded from ant loader (parentFirst)
18:22:50.061 [DEBUG] [org.gradle.api.internal.project.ant.AntLoggingAdapter] Finding class org.objectweb.asm.ModuleWriter
18:22:50.061 [DEBUG] [org.gradle.api.internal.project.ant.AntLoggingAdapter] Loaded from /home/jenkins/.gradle/caches/modules-2/files-2.1/org.ow2.asm/asm/7.1/fa29aa438674ff19d5e1386d2c3527a0267f291e/asm-7.1.jar org/objectweb/asm/ModuleWriter.class
18:22:50.062 [DEBUG] [org.gradle.api.internal.project.ant.AntLoggingAdapter] Class org.objectweb.asm.ModuleWriter loaded from ant loader (parentFirst)
18:22:50.062 [DEBUG] [org.gradle.api.internal.project.ant.AntLoggingAdapter] Finding class org.objectweb.asm.ClassTooLargeException
18:22:50.062 [DEBUG] [org.gradle.api.internal.project.ant.AntLoggingAdapter] Loaded from /home/jenkins/.gradle/caches/modules-2/files-2.1/org.ow2.asm/asm/7.1/fa29aa438674ff19d5e1386d2c3527a0267f291e/asm-7.1.jar org/objectweb/asm/ClassTooLargeException.class
18:22:50.062 [DEBUG] [org.gradle.api.internal.project.ant.AntLoggingAdapter] Class java.lang.IndexOutOfBoundsException loaded from parent loader (parentFirst)
18:22:50.063 [DEBUG] [org.gradle.api.internal.project.ant.AntLoggingAdapter] Class org.objectweb.asm.ClassTooLargeException loaded from ant loader (parentFirst)
18:22:50.063 [DEBUG] [org.gradle.api.internal.project.ant.AntLoggingAdapter] Finding class org.objectweb.asm.MethodVisitor
18:22:50.063 [DEBUG] [org.gradle.api.internal.project.ant.AntLoggingAdapter] Loaded from /home/jenkins/.gradle/caches/modules-2/files-2.1/org.ow2.asm/asm/7.1/fa29aa438674ff19d5e1386d2c3527a0267f291e/asm-7.1.jar org/objectweb/asm/MethodVisitor.class
18:22:50.064 [DEBUG] [org.gradle.api.internal.project.ant.AntLoggingAdapter] Class org.objectweb.asm.MethodVisitor loaded from ant loader (parentFirst)
18:22:50.064 [DEBUG] [org.gradle.api.internal.project.ant.AntLoggingAdapter] Finding class org.objectweb.asm.MethodWriter
18:22:50.064 [DEBUG] [org.gradle.api.internal.project.ant.AntLoggingAdapter] Loaded from /home/jenkins/.gradle/caches/modules-2/files-2.1/org.ow2.asm/asm/7.1/fa29aa438674ff19d5e1386d2c3527a0267f291e/asm-7.1.jar org/objectweb/asm/MethodWriter.class
18:22:50.065 [DEBUG] [org.gradle.api.internal.project.ant.AntLoggingAdapter] Class org.objectweb.asm.MethodWriter loaded from ant loader (parentFirst)
18:22:50.065 [DEBUG] [org.gradle.api.internal.project.ant.AntLoggingAdapter] Finding class org.objectweb.asm.AnnotationVisitor
18:22:50.065 [DEBUG] [org.gradle.api.internal.project.ant.AntLoggingAdapter] Loaded from /home/jenkins/.gradle/caches/modules-2/files-2.1/org.ow2.asm/asm/7.1/fa29aa438674ff19d5e1386d2c3527a0267f291e/asm-7.1.jar org/objectweb/asm/AnnotationVisitor.class
18:22:50.066 [DEBUG] [org.gradle.api.internal.project.ant.AntLoggingAdapter] Class org.objectweb.asm.AnnotationVisitor loaded from ant loader (parentFirst)
18:22:50.066 [DEBUG] [org.gradle.api.internal.project.ant.AntLoggingAdapter] Finding class org.objectweb.asm.AnnotationWriter
18:22:50.066 [DEBUG] [org.gradle.api.internal.project.ant.AntLoggingAdapter] Loaded from /home/jenkins/.gradle/caches/modules-2/files-2.1/org.ow2.asm/asm/7.1/fa29aa438674ff19d5e1386d2c3527a0267f291e/asm-7.1.jar org/objectweb/asm/AnnotationWriter.class
18:22:50.066 [DEBUG] [org.gradle.api.internal.project.ant.AntLoggingAdapter] Class org.objectweb.asm.AnnotationWriter loaded from ant loader (parentFirst)
18:22:50.067 [DEBUG] [org.gradle.api.internal.project.ant.AntLoggingAdapter] Finding class org.objectweb.asm.FieldVisitor
18:22:50.067 [DEBUG] [org.gradle.api.internal.project.ant.AntLoggingAdapter] Loaded from /home/jenkins/.gradle/caches/modules-2/files-2.1/org.ow2.asm/asm/7.1/fa29aa438674ff19d5e1386d2c3527a0267f291e/asm-7.1.jar org/objectweb/asm/FieldVisitor.class
18:22:50.067 [DEBUG] [org.gradle.api.internal.project.ant.AntLoggingAdapter] Class org.objectweb.asm.FieldVisitor loaded from ant loader (parentFirst)
18:22:50.067 [DEBUG] [org.gradle.api.internal.project.ant.AntLoggingAdapter] Finding class org.objectweb.asm.FieldWriter
18:22:50.067 [DEBUG] [org.gradle.api.internal.project.ant.AntLoggingAdapter] Loaded from /home/jenkins/.gradle/caches/modules-2/files-2.1/org.ow2.asm/asm/7.1/fa29aa438674ff19d5e1386d2c3527a0267f291e/asm-7.1.jar org/objectweb/asm/FieldWriter.class
18:22:50.068 [DEBUG] [org.gradle.api.internal.project.ant.AntLoggingAdapter] Class org.objectweb.asm.FieldWriter loaded from ant loader (parentFirst)
18:22:50.068 [DEBUG] [org.gradle.api.internal.project.ant.AntLoggingAdapter] Class java.lang.ClassNotFoundException loaded from parent loader (parentFirst)
18:22:50.068 [DEBUG] [org.gradle.api.internal.project.ant.AntLoggingAdapter] Class java.lang.TypeNotPresentException loaded from parent loader (parentFirst)
18:22:50.069 [DEBUG] [org.gradle.api.internal.project.ant.AntLoggingAdapter] Finding class org.objectweb.asm.SymbolTable
18:22:50.069 [DEBUG] [org.gradle.api.internal.project.ant.AntLoggingAdapter] Loaded from /home/jenkins/.gradle/caches/modules-2/files-2.1/org.ow2.asm/asm/7.1/fa29aa438674ff19d5e1386d2c3527a0267f291e/asm-7.1.jar org/objectweb/asm/SymbolTable.class
18:22:50.070 [DEBUG] [org.gradle.api.internal.project.ant.AntLoggingAdapter] Class org.objectweb.asm.SymbolTable loaded from ant loader (parentFirst)
18:22:50.070 [DEBUG] [org.gradle.api.internal.project.ant.AntLoggingAdapter] Finding class org.objectweb.asm.Symbol
18:22:50.070 [DEBUG] [org.gradle.api.internal.project.ant.AntLoggingAdapter] Loaded from /home/jenkins/.gradle/caches/modules-2/files-2.1/org.ow2.asm/asm/7.1/fa29aa438674ff19d5e1386d2c3527a0267f291e/asm-7.1.jar org/objectweb/asm/Symbol.class
18:22:50.070 [DEBUG] [org.gradle.api.internal.project.ant.AntLoggingAdapter] Class org.objectweb.asm.Symbol loaded from ant loader (parentFirst)
18:22:50.071 [DEBUG] [org.gradle.api.internal.project.ant.AntLoggingAdapter] Finding class org.objectweb.asm.SymbolTable$Entry
18:22:50.071 [DEBUG] [org.gradle.api.internal.project.ant.AntLoggingAdapter] Loaded from /home/jenkins/.gradle/caches/modules-2/files-2.1/org.ow2.asm/asm/7.1/fa29aa438674ff19d5e1386d2c3527a0267f291e/asm-7.1.jar org/objectweb/asm/SymbolTable$Entry.class
18:22:50.071 [DEBUG] [org.gradle.api.internal.project.ant.AntLoggingAdapter] Class org.objectweb.asm.SymbolTable$Entry loaded from ant loader (parentFirst)
18:22:50.072 [DEBUG] [org.gradle.api.internal.project.ant.AntLoggingAdapter] Finding class org.objectweb.asm.ByteVector
18:22:50.072 [DEBUG] [org.gradle.api.internal.project.ant.AntLoggingAdapter] Loaded from /home/jenkins/.gradle/caches/modules-2/files-2.1/org.ow2.asm/asm/7.1/fa29aa438674ff19d5e1386d2c3527a0267f291e/asm-7.1.jar org/objectweb/asm/ByteVector.class
18:22:50.073 [DEBUG] [org.gradle.api.internal.project.ant.AntLoggingAdapter] Class org.objectweb.asm.ByteVector loaded from ant loader (parentFirst)
18:22:50.073 [DEBUG] [org.gradle.api.internal.project.ant.AntLoggingAdapter] Class java.lang.System loaded from parent loader (parentFirst)
18:22:50.074 [DEBUG] [org.gradle.api.internal.project.ant.AntLoggingAdapter] Finding class org.python.expose.generate.ExposedTypeProcessor$TypeProcessor$4
18:22:50.074 [DEBUG] [org.gradle.api.internal.project.ant.AntLoggingAdapter] Loaded from /home/jenkins/.jenkins/jobs/gluu-jython/workspace/build2/unexposed org/python/expose/generate/ExposedTypeProcessor$TypeProcessor$4.class
18:22:50.075 [DEBUG] [org.gradle.api.internal.project.ant.AntLoggingAdapter] Finding class org.python.expose.generate.ExposedFieldFinder
18:22:50.075 [DEBUG] [org.gradle.api.internal.project.ant.AntLoggingAdapter] Loaded from /home/jenkins/.jenkins/jobs/gluu-jython/workspace/build2/unexposed org/python/expose/generate/ExposedFieldFinder.class
18:22:50.075 [DEBUG] [org.gradle.api.internal.project.ant.AntLoggingAdapter] Class org.python.expose.generate.ExposedFieldFinder loaded from ant loader (parentFirst)
18:22:50.075 [DEBUG] [org.gradle.api.internal.project.ant.AntLoggingAdapter] Class org.python.expose.generate.ExposedTypeProcessor$TypeProcessor$4 loaded from ant loader (parentFirst)
18:22:50.075 [DEBUG] [org.gradle.api.internal.project.ant.AntLoggingAdapter] Finding class org.python.expose.generate.ExposedTypeProcessor$TypeProcessor$1
18:22:50.075 [DEBUG] [org.gradle.api.internal.project.ant.AntLoggingAdapter] Loaded from /home/jenkins/.jenkins/jobs/gluu-jython/workspace/build2/unexposed org/python/expose/generate/ExposedTypeProcessor$TypeProcessor$1.class
18:22:50.076 [DEBUG] [org.gradle.api.internal.project.ant.AntLoggingAdapter] Finding class org.python.expose.generate.ExposedTypeVisitor
18:22:50.076 [DEBUG] [org.gradle.api.internal.project.ant.AntLoggingAdapter] Loaded from /home/jenkins/.jenkins/jobs/gluu-jython/workspace/build2/unexposed org/python/expose/generate/ExposedTypeVisitor.class
18:22:50.076 [DEBUG] [org.gradle.api.internal.project.ant.AntLoggingAdapter] Finding class org.python.expose.generate.RestrictiveAnnotationVisitor
18:22:50.076 [DEBUG] [org.gradle.api.internal.project.ant.AntLoggingAdapter] Loaded from /home/jenkins/.jenkins/jobs/gluu-jython/workspace/build2/unexposed org/python/expose/generate/RestrictiveAnnotationVisitor.class
18:22:50.077 [DEBUG] [org.gradle.api.internal.project.ant.AntLoggingAdapter] Class org.python.expose.generate.RestrictiveAnnotationVisitor loaded from ant loader (parentFirst)
18:22:50.077 [DEBUG] [org.gradle.api.internal.project.ant.AntLoggingAdapter] Class org.python.expose.generate.ExposedTypeVisitor loaded from ant loader (parentFirst)
18:22:50.077 [DEBUG] [org.gradle.api.internal.project.ant.AntLoggingAdapter] Class org.python.expose.generate.ExposedTypeProcessor$TypeProcessor$1 loaded from ant loader (parentFirst)
18:22:50.077 [DEBUG] [org.gradle.api.internal.project.ant.AntLoggingAdapter] Finding class org.python.expose.generate.ExposedTypeProcessor$TypeProcessor$2
18:22:50.077 [DEBUG] [org.gradle.api.internal.project.ant.AntLoggingAdapter] Loaded from /home/jenkins/.jenkins/jobs/gluu-jython/workspace/build2/unexposed org/python/expose/generate/ExposedTypeProcessor$TypeProcessor$2.class
18:22:50.078 [DEBUG] [org.gradle.api.internal.project.ant.AntLoggingAdapter] Class org.python.expose.generate.ExposedTypeProcessor$TypeProcessor$2 loaded from ant loader (parentFirst)
18:22:50.078 [DEBUG] [org.gradle.api.internal.project.ant.AntLoggingAdapter] Finding class org.python.expose.generate.ExposedTypeProcessor$TypeProcessor$3
18:22:50.078 [DEBUG] [org.gradle.api.internal.project.ant.AntLoggingAdapter] Loaded from /home/jenkins/.jenkins/jobs/gluu-jython/workspace/build2/unexposed org/python/expose/generate/ExposedTypeProcessor$TypeProcessor$3.class
18:22:50.078 [DEBUG] [org.gradle.api.internal.project.ant.AntLoggingAdapter] Finding class org.python.expose.generate.ExposedMethodFinder
18:22:50.078 [DEBUG] [org.gradle.api.internal.project.ant.AntLoggingAdapter] Loaded from /home/jenkins/.jenkins/jobs/gluu-jython/workspace/build2/unexposed org/python/expose/generate/ExposedMethodFinder.class
18:22:50.079 [DEBUG] [org.gradle.api.internal.project.ant.AntLoggingAdapter] Class org.python.expose.generate.ExposedMethodFinder loaded from ant loader (parentFirst)
18:22:50.079 [DEBUG] [org.gradle.api.internal.project.ant.AntLoggingAdapter] Class org.python.expose.generate.ExposedTypeProcessor$TypeProcessor$3 loaded from ant loader (parentFirst)
18:22:50.079 [DEBUG] [org.gradle.api.internal.project.ant.AntLoggingAdapter] Finding class org.python.core.PyObject
18:22:50.079 [DEBUG] [org.gradle.api.internal.project.ant.AntLoggingAdapter] Loaded from /home/jenkins/.jenkins/jobs/gluu-jython/workspace/build2/unexposed org/python/core/PyObject.class
18:22:50.081 [DEBUG] [org.gradle.api.internal.project.ant.AntLoggingAdapter] Class java.io.Serializable loaded from parent loader (parentFirst)
18:22:50.082 [DEBUG] [org.gradle.api.internal.project.ant.AntLoggingAdapter] Class org.python.core.PyObject loaded from ant loader (parentFirst)
18:22:50.082 [DEBUG] [org.gradle.api.internal.project.ant.AntLoggingAdapter] Finding class org.objectweb.asm.Type
18:22:50.082 [DEBUG] [org.gradle.api.internal.project.ant.AntLoggingAdapter] Loaded from /home/jenkins/.gradle/caches/modules-2/files-2.1/org.ow2.asm/asm/7.1/fa29aa438674ff19d5e1386d2c3527a0267f291e/asm-7.1.jar org/objectweb/asm/Type.class
18:22:50.083 [DEBUG] [org.gradle.api.internal.project.ant.AntLoggingAdapter] Class org.objectweb.asm.Type loaded from ant loader (parentFirst)
18:22:50.083 [DEBUG] [org.gradle.api.internal.project.ant.AntLoggingAdapter] Class java.lang.CharSequence loaded from parent loader (parentFirst)
18:22:50.084 [DEBUG] [org.gradle.api.internal.project.ant.AntLoggingAdapter] Class java.lang.Class loaded from parent loader (parentFirst)
18:22:50.084 [DEBUG] [org.gradle.api.internal.project.ant.AntLoggingAdapter] Finding class org.python.core.PyType
18:22:50.084 [DEBUG] [org.gradle.api.internal.project.ant.AntLoggingAdapter] Loaded from /home/jenkins/.jenkins/jobs/gluu-jython/workspace/build2/unexposed org/python/core/PyType.class
18:22:50.086 [DEBUG] [org.gradle.api.internal.project.ant.AntLoggingAdapter] Finding class org.python.core.Traverseproc
18:22:50.086 [DEBUG] [org.gradle.api.internal.project.ant.AntLoggingAdapter] Loaded from /home/jenkins/.jenkins/jobs/gluu-jython/workspace/build2/unexposed org/python/core/Traverseproc.class
18:22:50.086 [DEBUG] [org.gradle.api.internal.project.ant.AntLoggingAdapter] Class org.python.core.Traverseproc loaded from ant loader (parentFirst)
18:22:50.086 [DEBUG] [org.gradle.api.internal.project.ant.AntLoggingAdapter] Class org.python.core.PyType loaded from ant loader (parentFirst)
18:22:50.087 [DEBUG] [org.gradle.api.internal.project.ant.AntLoggingAdapter] Finding class org.python.expose.ExposeAsSuperclass
18:22:50.087 [DEBUG] [org.gradle.api.internal.project.ant.AntLoggingAdapter] Loaded from /home/jenkins/.jenkins/jobs/gluu-jython/workspace/build2/unexposed org/python/expose/ExposeAsSuperclass.class
18:22:50.087 [DEBUG] [org.gradle.api.internal.project.ant.AntLoggingAdapter] Class org.python.expose.ExposeAsSuperclass loaded from ant loader (parentFirst)
18:22:50.087 [DEBUG] [org.gradle.api.internal.project.ant.AntLoggingAdapter] Finding class org.python.core.PyException
18:22:50.087 [DEBUG] [org.gradle.api.internal.project.ant.AntLoggingAdapter] Loaded from /home/jenkins/.jenkins/jobs/gluu-jython/workspace/build2/unexposed org/python/core/PyException.class
18:22:50.088 [DEBUG] [org.gradle.api.internal.project.ant.AntLoggingAdapter] Class org.python.core.PyException loaded from ant loader (parentFirst)
18:22:50.088 [DEBUG] [org.gradle.api.internal.project.ant.AntLoggingAdapter] Finding class org.python.core.Py
18:22:50.088 [DEBUG] [org.gradle.api.internal.project.ant.AntLoggingAdapter] Loaded from /home/jenkins/.jenkins/jobs/gluu-jython/workspace/build2/unexposed org/python/core/Py.class
18:22:50.090 [DEBUG] [org.gradle.api.internal.project.ant.AntLoggingAdapter] Finding class org.python.core.PrePy
18:22:50.090 [DEBUG] [org.gradle.api.internal.project.ant.AntLoggingAdapter] Loaded from /home/jenkins/.jenkins/jobs/gluu-jython/workspace/build2/unexposed org/python/core/PrePy.class
18:22:50.091 [DEBUG] [org.gradle.api.internal.project.ant.AntLoggingAdapter] Class org.python.core.PrePy loaded from ant loader (parentFirst)
18:22:50.091 [DEBUG] [org.gradle.api.internal.project.ant.AntLoggingAdapter] Class org.python.core.Py loaded from ant loader (parentFirst)
18:22:50.091 [DEBUG] [org.gradle.api.internal.project.ant.AntLoggingAdapter] Finding class org.python.core.PyString
18:22:50.091 [DEBUG] [org.gradle.api.internal.project.ant.AntLoggingAdapter] Loaded from /home/jenkins/.jenkins/jobs/gluu-jython/workspace/build2/unexposed org/python/core/PyString.class
18:22:50.093 [DEBUG] [org.gradle.api.internal.project.ant.AntLoggingAdapter] Finding class org.python.core.BufferProtocol
18:22:50.093 [DEBUG] [org.gradle.api.internal.project.ant.AntLoggingAdapter] Loaded from /home/jenkins/.jenkins/jobs/gluu-jython/workspace/build2/unexposed org/python/core/BufferProtocol.class
18:22:50.093 [DEBUG] [org.gradle.api.internal.project.ant.AntLoggingAdapter] Class org.python.core.BufferProtocol loaded from ant loader (parentFirst)
18:22:50.094 [DEBUG] [org.gradle.api.internal.project.ant.AntLoggingAdapter] Finding class org.python.core.PyBaseString
18:22:50.094 [DEBUG] [org.gradle.api.internal.project.ant.AntLoggingAdapter] Loaded from /home/jenkins/.jenkins/jobs/gluu-jython/workspace/build2/unexposed org/python/core/PyBaseString.class
18:22:50.095 [DEBUG] [org.gradle.api.internal.project.ant.AntLoggingAdapter] Finding class org.python.core.PySequence
18:22:50.095 [DEBUG] [org.gradle.api.internal.project.ant.AntLoggingAdapter] Loaded from /home/jenkins/.jenkins/jobs/gluu-jython/workspace/build2/unexposed org/python/core/PySequence.class
18:22:50.095 [DEBUG] [org.gradle.api.internal.project.ant.AntLoggingAdapter] Class org.python.core.PySequence loaded from ant loader (parentFirst)
18:22:50.095 [DEBUG] [org.gradle.api.internal.project.ant.AntLoggingAdapter] Class org.python.core.PyBaseString loaded from ant loader (parentFirst)
18:22:50.096 [DEBUG] [org.gradle.api.internal.project.ant.AntLoggingAdapter] Class org.python.core.PyString loaded from ant loader (parentFirst)
18:22:50.096 [DEBUG] [org.gradle.api.internal.project.ant.AntLoggingAdapter] Finding class org.python.core.PyBoolean
18:22:50.096 [DEBUG] [org.gradle.api.internal.project.ant.AntLoggingAdapter] Loaded from /home/jenkins/.jenkins/jobs/gluu-jython/workspace/build2/unexposed org/python/core/PyBoolean.class
18:22:50.096 [DEBUG] [org.gradle.api.internal.project.ant.AntLoggingAdapter] Finding class org.python.core.PyInteger
18:22:50.097 [DEBUG] [org.gradle.api.internal.project.ant.AntLoggingAdapter] Loaded from /home/jenkins/.jenkins/jobs/gluu-jython/workspace/build2/unexposed org/python/core/PyInteger.class
18:22:50.098 [DEBUG] [org.gradle.api.internal.project.ant.AntLoggingAdapter] Class org.python.core.PyInteger loaded from ant loader (parentFirst)
18:22:50.098 [DEBUG] [org.gradle.api.internal.project.ant.AntLoggingAdapter] Class org.python.core.PyBoolean loaded from ant loader (parentFirst)
18:22:50.098 [DEBUG] [org.gradle.api.internal.project.ant.AntLoggingAdapter] Finding class org.python.core.PyLong
18:22:50.098 [DEBUG] [org.gradle.api.internal.project.ant.AntLoggingAdapter] Loaded from /home/jenkins/.jenkins/jobs/gluu-jython/workspace/build2/unexposed org/python/core/PyLong.class
18:22:50.099 [DEBUG] [org.gradle.api.internal.project.ant.AntLoggingAdapter] Class org.python.core.PyLong loaded from ant loader (parentFirst)
18:22:50.099 [DEBUG] [org.gradle.api.internal.project.ant.AntLoggingAdapter] Finding class org.python.core.PyFloat
18:22:50.099 [DEBUG] [org.gradle.api.internal.project.ant.AntLoggingAdapter] Loaded from /home/jenkins/.jenkins/jobs/gluu-jython/workspace/build2/unexposed org/python/core/PyFloat.class
18:22:50.100 [DEBUG] [org.gradle.api.internal.project.ant.AntLoggingAdapter] Class org.python.core.PyFloat loaded from ant loader (parentFirst)
18:22:50.100 [DEBUG] [org.gradle.api.internal.project.ant.AntLoggingAdapter] Finding class org.python.core.PyNewWrapper
18:22:50.100 [DEBUG] [org.gradle.api.internal.project.ant.AntLoggingAdapter] Loaded from /home/jenkins/.jenkins/jobs/gluu-jython/workspace/build2/unexposed org/python/core/PyNewWrapper.class
18:22:50.101 [DEBUG] [org.gradle.api.internal.project.ant.AntLoggingAdapter] Finding class org.python.core.PyBuiltinMethod
18:22:50.101 [DEBUG] [org.gradle.api.internal.project.ant.AntLoggingAdapter] Loaded from /home/jenkins/.jenkins/jobs/gluu-jython/workspace/build2/unexposed org/python/core/PyBuiltinMethod.class
18:22:50.101 [DEBUG] [org.gradle.api.internal.project.ant.AntLoggingAdapter] Class java.lang.Cloneable loaded from parent loader (parentFirst)
18:22:50.101 [DEBUG] [org.gradle.api.internal.project.ant.AntLoggingAdapter] Finding class org.python.core.PyBuiltinCallable
18:22:50.102 [DEBUG] [org.gradle.api.internal.project.ant.AntLoggingAdapter] Loaded from /home/jenkins/.jenkins/jobs/gluu-jython/workspace/build2/unexposed org/python/core/PyBuiltinCallable.class
18:22:50.102 [DEBUG] [org.gradle.api.internal.project.ant.AntLoggingAdapter] Class org.python.core.PyBuiltinCallable loaded from ant loader (parentFirst)
18:22:50.102 [DEBUG] [org.gradle.api.internal.project.ant.AntLoggingAdapter] Class org.python.core.PyBuiltinMethod loaded from ant loader (parentFirst)
18:22:50.102 [DEBUG] [org.gradle.api.internal.project.ant.AntLoggingAdapter] Class org.python.core.PyNewWrapper loaded from ant loader (parentFirst)
18:22:50.102 [DEBUG] [org.gradle.api.internal.project.ant.AntLoggingAdapter] Finding class org.python.core.PyBuiltinMethodNarrow
18:22:50.102 [DEBUG] [org.gradle.api.internal.project.ant.AntLoggingAdapter] Loaded from /home/jenkins/.jenkins/jobs/gluu-jython/workspace/build2/unexposed org/python/core/PyBuiltinMethodNarrow.class
18:22:50.103 [DEBUG] [org.gradle.api.internal.project.ant.AntLoggingAdapter] Class org.python.core.PyBuiltinMethodNarrow loaded from ant loader (parentFirst)
18:22:50.103 [DEBUG] [org.gradle.api.internal.project.ant.AntLoggingAdapter] Finding class org.python.core.PyDataDescr
18:22:50.103 [DEBUG] [org.gradle.api.internal.project.ant.AntLoggingAdapter] Loaded from /home/jenkins/.jenkins/jobs/gluu-jython/workspace/build2/unexposed org/python/core/PyDataDescr.class
18:22:50.103 [DEBUG] [org.gradle.api.internal.project.ant.AntLoggingAdapter] Finding class org.python.core.PyDescriptor
18:22:50.104 [DEBUG] [org.gradle.api.internal.project.ant.AntLoggingAdapter] Loaded from /home/jenkins/.jenkins/jobs/gluu-jython/workspace/build2/unexposed org/python/core/PyDescriptor.class
18:22:50.104 [DEBUG] [org.gradle.api.internal.project.ant.AntLoggingAdapter] Class org.python.core.PyDescriptor loaded from ant loader (parentFirst)
18:22:50.104 [DEBUG] [org.gradle.api.internal.project.ant.AntLoggingAdapter] Class org.python.core.PyDataDescr loaded from ant loader (parentFirst)
18:22:50.104 [DEBUG] [org.gradle.api.internal.project.ant.AntLoggingAdapter] Finding class org.python.core.PyBuiltinCallable$Info
18:22:50.104 [DEBUG] [org.gradle.api.internal.project.ant.AntLoggingAdapter] Loaded from /home/jenkins/.jenkins/jobs/gluu-jython/workspace/build2/unexposed org/python/core/PyBuiltinCallable$Info.class
18:22:50.104 [DEBUG] [org.gradle.api.internal.project.ant.AntLoggingAdapter] Class org.python.core.PyBuiltinCallable$Info loaded from ant loader (parentFirst)
18:22:50.105 [DEBUG] [org.gradle.api.internal.project.ant.AntLoggingAdapter] Finding class org.python.core.ThreadState
18:22:50.105 [DEBUG] [org.gradle.api.internal.project.ant.AntLoggingAdapter] Loaded from /home/jenkins/.jenkins/jobs/gluu-jython/workspace/build2/unexposed org/python/core/ThreadState.class
18:22:50.105 [DEBUG] [org.gradle.api.internal.project.ant.AntLoggingAdapter] Class org.python.core.ThreadState loaded from ant loader (parentFirst)
18:22:50.105 [DEBUG] [org.gradle.api.internal.project.ant.AntLoggingAdapter] Finding class org.python.expose.ExposedType
18:22:50.105 [DEBUG] [org.gradle.api.internal.project.ant.AntLoggingAdapter] Loaded from /home/jenkins/.jenkins/jobs/gluu-jython/workspace/build2/unexposed org/python/expose/ExposedType.class
18:22:50.106 [DEBUG] [org.gradle.api.internal.project.ant.AntLoggingAdapter] Class java.lang.annotation.Annotation loaded from parent loader (parentFirst)
18:22:50.106 [DEBUG] [org.gradle.api.internal.project.ant.AntLoggingAdapter] Class org.python.expose.ExposedType loaded from ant loader (parentFirst)
18:22:50.106 [DEBUG] [org.gradle.api.internal.project.ant.AntLoggingAdapter] Finding class org.python.expose.ExposedMethod
18:22:50.106 [DEBUG] [org.gradle.api.internal.project.ant.AntLoggingAdapter] Loaded from /home/jenkins/.jenkins/jobs/gluu-jython/workspace/build2/unexposed org/python/expose/ExposedMethod.class
18:22:50.106 [DEBUG] [org.gradle.api.internal.project.ant.AntLoggingAdapter] Class org.python.expose.ExposedMethod loaded from ant loader (parentFirst)
18:22:50.106 [DEBUG] [org.gradle.api.internal.project.ant.AntLoggingAdapter] Finding class org.python.expose.ExposedClassMethod
18:22:50.107 [DEBUG] [org.gradle.api.internal.project.ant.AntLoggingAdapter] Loaded from /home/jenkins/.jenkins/jobs/gluu-jython/workspace/build2/unexposed org/python/expose/ExposedClassMethod.class
18:22:50.107 [DEBUG] [org.gradle.api.internal.project.ant.AntLoggingAdapter] Class org.python.expose.ExposedClassMethod loaded from ant loader (parentFirst)
18:22:50.107 [DEBUG] [org.gradle.api.internal.project.ant.AntLoggingAdapter] Finding class org.python.expose.ExposedNew
18:22:50.107 [DEBUG] [org.gradle.api.internal.project.ant.AntLoggingAdapter] Loaded from /home/jenkins/.jenkins/jobs/gluu-jython/workspace/build2/unexposed org/python/expose/ExposedNew.class
18:22:50.107 [DEBUG] [org.gradle.api.internal.project.ant.AntLoggingAdapter] Class org.python.expose.ExposedNew loaded from ant loader (parentFirst)
18:22:50.107 [DEBUG] [org.gradle.api.internal.project.ant.AntLoggingAdapter] Finding class org.python.expose.ExposedGet
18:22:50.108 [DEBUG] [org.gradle.api.internal.project.ant.AntLoggingAdapter] Loaded from /home/jenkins/.jenkins/jobs/gluu-jython/workspace/build2/unexposed org/python/expose/ExposedGet.class
18:22:50.108 [DEBUG] [org.gradle.api.internal.project.ant.AntLoggingAdapter] Class org.python.expose.ExposedGet loaded from ant loader (parentFirst)
18:22:50.108 [DEBUG] [org.gradle.api.internal.project.ant.AntLoggingAdapter] Finding class org.python.expose.ExposedSet
18:22:50.108 [DEBUG] [org.gradle.api.internal.project.ant.AntLoggingAdapter] Loaded from /home/jenkins/.jenkins/jobs/gluu-jython/workspace/build2/unexposed org/python/expose/ExposedSet.class
18:22:50.108 [DEBUG] [org.gradle.api.internal.project.ant.AntLoggingAdapter] Class org.python.expose.ExposedSet loaded from ant loader (parentFirst)
18:22:50.109 [DEBUG] [org.gradle.api.internal.project.ant.AntLoggingAdapter] Finding class org.python.expose.ExposedDelete
18:22:50.109 [DEBUG] [org.gradle.api.internal.project.ant.AntLoggingAdapter] Loaded from /home/jenkins/.jenkins/jobs/gluu-jython/workspace/build2/unexposed org/python/expose/ExposedDelete.class
18:22:50.109 [DEBUG] [org.gradle.api.internal.project.ant.AntLoggingAdapter] Class org.python.expose.ExposedDelete loaded from ant loader (parentFirst)
18:22:50.109 [DEBUG] [org.gradle.api.internal.project.ant.AntLoggingAdapter] Finding class org.python.expose.TypeBuilder
18:22:50.110 [DEBUG] [org.gradle.api.internal.project.ant.AntLoggingAdapter] Loaded from /home/jenkins/.jenkins/jobs/gluu-jython/workspace/build2/unexposed org/python/expose/TypeBuilder.class
18:22:50.110 [DEBUG] [org.gradle.api.internal.project.ant.AntLoggingAdapter] Class org.python.expose.TypeBuilder loaded from ant loader (parentFirst)
18:22:50.110 [DEBUG] [org.gradle.api.internal.project.ant.AntLoggingAdapter] Finding class org.objectweb.asm.Attribute
18:22:50.111 [DEBUG] [org.gradle.api.internal.project.ant.AntLoggingAdapter] Loaded from /home/jenkins/.gradle/caches/modules-2/files-2.1/org.ow2.asm/asm/7.1/fa29aa438674ff19d5e1386d2c3527a0267f291e/asm-7.1.jar org/objectweb/asm/Attribute.class
18:22:50.111 [DEBUG] [org.gradle.api.internal.project.ant.AntLoggingAdapter] Class org.objectweb.asm.Attribute loaded from ant loader (parentFirst)
18:22:50.111 [DEBUG] [org.gradle.api.internal.project.ant.AntLoggingAdapter] Finding class org.objectweb.asm.Context
18:22:50.112 [DEBUG] [org.gradle.api.internal.project.ant.AntLoggingAdapter] Loaded from /home/jenkins/.gradle/caches/modules-2/files-2.1/org.ow2.asm/asm/7.1/fa29aa438674ff19d5e1386d2c3527a0267f291e/asm-7.1.jar org/objectweb/asm/Context.class
18:22:50.112 [DEBUG] [org.gradle.api.internal.project.ant.AntLoggingAdapter] Class org.objectweb.asm.Context loaded from ant loader (parentFirst)
18:22:50.114 [DEBUG] [org.gradle.api.internal.project.ant.AntLoggingAdapter] Finding class org.python.expose.generate.ExposedFieldFinder$1
18:22:50.114 [DEBUG] [org.gradle.api.internal.project.ant.AntLoggingAdapter] Loaded from /home/jenkins/.jenkins/jobs/gluu-jython/workspace/build2/unexposed org/python/expose/generate/ExposedFieldFinder$1.class
18:22:50.114 [DEBUG] [org.gradle.api.internal.project.ant.AntLoggingAdapter] Finding class org.python.expose.generate.DescriptorVisitor
18:22:50.114 [DEBUG] [org.gradle.api.internal.project.ant.AntLoggingAdapter] Loaded from /home/jenkins/.jenkins/jobs/gluu-jython/workspace/build2/unexposed org/python/expose/generate/DescriptorVisitor.class
18:22:50.115 [DEBUG] [org.gradle.api.internal.project.ant.AntLoggingAdapter] Class org.python.expose.generate.DescriptorVisitor loaded from ant loader (parentFirst)
18:22:50.115 [DEBUG] [org.gradle.api.internal.project.ant.AntLoggingAdapter] Class org.python.expose.generate.ExposedFieldFinder$1 loaded from ant loader (parentFirst)
18:22:50.115 [DEBUG] [org.gradle.api.internal.project.ant.AntLoggingAdapter] Finding class org.python.expose.generate.ExposedFieldFinder$2
18:22:50.115 [DEBUG] [org.gradle.api.internal.project.ant.AntLoggingAdapter] Loaded from /home/jenkins/.jenkins/jobs/gluu-jython/workspace/build2/unexposed org/python/expose/generate/ExposedFieldFinder$2.class
18:22:50.115 [DEBUG] [org.gradle.api.internal.project.ant.AntLoggingAdapter] Class org.python.expose.generate.ExposedFieldFinder$2 loaded from ant loader (parentFirst)
18:22:50.116 [DEBUG] [org.gradle.api.internal.project.ant.AntLoggingAdapter] Finding class org.objectweb.asm.MethodTooLargeException
18:22:50.117 [DEBUG] [org.gradle.api.internal.project.ant.AntLoggingAdapter] Loaded from /home/jenkins/.gradle/caches/modules-2/files-2.1/org.ow2.asm/asm/7.1/fa29aa438674ff19d5e1386d2c3527a0267f291e/asm-7.1.jar org/objectweb/asm/MethodTooLargeException.class
18:22:50.117 [DEBUG] [org.gradle.api.internal.project.ant.AntLoggingAdapter] Class org.objectweb.asm.MethodTooLargeException loaded from ant loader (parentFirst)
18:22:50.118 [DEBUG] [org.gradle.api.internal.project.ant.AntLoggingAdapter] Finding class org.objectweb.asm.Frame
18:22:50.118 [DEBUG] [org.gradle.api.internal.project.ant.AntLoggingAdapter] Loaded from /home/jenkins/.gradle/caches/modules-2/files-2.1/org.ow2.asm/asm/7.1/fa29aa438674ff19d5e1386d2c3527a0267f291e/asm-7.1.jar org/objectweb/asm/Frame.class
18:22:50.119 [DEBUG] [org.gradle.api.internal.project.ant.AntLoggingAdapter] Class org.objectweb.asm.Frame loaded from ant loader (parentFirst)
18:22:50.119 [DEBUG] [org.gradle.api.internal.project.ant.AntLoggingAdapter] Finding class org.objectweb.asm.CurrentFrame
18:22:50.119 [DEBUG] [org.gradle.api.internal.project.ant.AntLoggingAdapter] Loaded from /home/jenkins/.gradle/caches/modules-2/files-2.1/org.ow2.asm/asm/7.1/fa29aa438674ff19d5e1386d2c3527a0267f291e/asm-7.1.jar org/objectweb/asm/CurrentFrame.class
18:22:50.120 [DEBUG] [org.gradle.api.internal.project.ant.AntLoggingAdapter] Class org.objectweb.asm.CurrentFrame loaded from ant loader (parentFirst)
18:22:50.120 [DEBUG] [org.gradle.api.internal.project.ant.AntLoggingAdapter] Class java.lang.IllegalStateException loaded from parent loader (parentFirst)
18:22:50.121 [DEBUG] [org.gradle.api.internal.project.ant.AntLoggingAdapter] Finding class org.objectweb.asm.Label
18:22:50.121 [DEBUG] [org.gradle.api.internal.project.ant.AntLoggingAdapter] Loaded from /home/jenkins/.gradle/caches/modules-2/files-2.1/org.ow2.asm/asm/7.1/fa29aa438674ff19d5e1386d2c3527a0267f291e/asm-7.1.jar org/objectweb/asm/Label.class
18:22:50.122 [DEBUG] [org.gradle.api.internal.project.ant.AntLoggingAdapter] Class org.objectweb.asm.Label loaded from ant loader (parentFirst)
18:22:50.123 [DEBUG] [org.gradle.api.internal.project.ant.AntLoggingAdapter] Finding class org.python.expose.generate.NewExposer
18:22:50.123 [DEBUG] [org.gradle.api.internal.project.ant.AntLoggingAdapter] Loaded from /home/jenkins/.jenkins/jobs/gluu-jython/workspace/build2/unexposed org/python/expose/generate/NewExposer.class
18:22:50.123 [DEBUG] [org.gradle.api.internal.project.ant.AntLoggingAdapter] Class org.python.expose.generate.NewExposer loaded from ant loader (parentFirst)
18:22:50.124 [DEBUG] [org.gradle.api.internal.project.ant.AntLoggingAdapter] Finding class org.python.expose.generate.OverridableNewExposer
18:22:50.124 [DEBUG] [org.gradle.api.internal.project.ant.AntLoggingAdapter] Loaded from /home/jenkins/.jenkins/jobs/gluu-jython/workspace/build2/unexposed org/python/expose/generate/OverridableNewExposer.class
18:22:50.124 [DEBUG] [org.gradle.api.internal.project.ant.AntLoggingAdapter] Class org.python.expose.generate.OverridableNewExposer loaded from ant loader (parentFirst)
18:22:50.124 [DEBUG] [org.gradle.api.internal.project.ant.AntLoggingAdapter] Finding class org.python.expose.generate.ExposedMethodFinder$ExposedMethodVisitor
18:22:50.124 [DEBUG] [org.gradle.api.internal.project.ant.AntLoggingAdapter] Loaded from /home/jenkins/.jenkins/jobs/gluu-jython/workspace/build2/unexposed org/python/expose/generate/ExposedMethodFinder$ExposedMethodVisitor.class
18:22:50.125 [DEBUG] [org.gradle.api.internal.project.ant.AntLoggingAdapter] Class org.python.expose.generate.ExposedMethodFinder$ExposedMethodVisitor loaded from ant loader (parentFirst)
18:22:50.125 [DEBUG] [org.gradle.api.internal.project.ant.AntLoggingAdapter] Finding class org.python.expose.generate.ExposedMethodFinder$1
18:22:50.125 [DEBUG] [org.gradle.api.internal.project.ant.AntLoggingAdapter] Loaded from /home/jenkins/.jenkins/jobs/gluu-jython/workspace/build2/unexposed org/python/expose/generate/ExposedMethodFinder$1.class
18:22:50.125 [DEBUG] [org.gradle.api.internal.project.ant.AntLoggingAdapter] Class org.python.expose.generate.ExposedMethodFinder$1 loaded from ant loader (parentFirst)
18:22:50.125 [DEBUG] [org.gradle.api.internal.project.ant.AntLoggingAdapter] Finding class org.python.expose.generate.ExposedMethodFinder$2
18:22:50.126 [DEBUG] [org.gradle.api.internal.project.ant.AntLoggingAdapter] Loaded from /home/jenkins/.jenkins/jobs/gluu-jython/workspace/build2/unexposed org/python/expose/generate/ExposedMethodFinder$2.class
18:22:50.126 [DEBUG] [org.gradle.api.internal.project.ant.AntLoggingAdapter] Class org.python.expose.generate.ExposedMethodFinder$2 loaded from ant loader (parentFirst)
18:22:50.126 [DEBUG] [org.gradle.api.internal.project.ant.AntLoggingAdapter] Finding class org.python.expose.generate.ExposedMethodFinder$3
18:22:50.126 [DEBUG] [org.gradle.api.internal.project.ant.AntLoggingAdapter] Loaded from /home/jenkins/.jenkins/jobs/gluu-jython/workspace/build2/unexposed org/python/expose/generate/ExposedMethodFinder$3.class
18:22:50.126 [DEBUG] [org.gradle.api.internal.project.ant.AntLoggingAdapter] Class org.python.expose.generate.ExposedMethodFinder$3 loaded from ant loader (parentFirst)
18:22:50.127 [DEBUG] [org.gradle.api.internal.project.ant.AntLoggingAdapter] Class java.lang.Math loaded from parent loader (parentFirst)
18:22:50.128 [DEBUG] [org.gradle.api.internal.project.ant.AntLoggingAdapter] Finding class org.python.expose.generate.Exposer$1
18:22:50.128 [DEBUG] [org.gradle.api.internal.project.ant.AntLoggingAdapter] Loaded from /home/jenkins/.jenkins/jobs/gluu-jython/workspace/build2/unexposed org/python/expose/generate/Exposer$1.class
18:22:50.128 [DEBUG] [org.gradle.api.internal.project.ant.AntLoggingAdapter] Class org.python.expose.generate.Exposer$1 loaded from ant loader (parentFirst)
18:22:50.129 [DEBUG] [org.gradle.api.internal.project.ant.AntLoggingAdapter] Class java.lang.Boolean loaded from parent loader (parentFirst)
18:22:50.129 [DEBUG] [org.gradle.api.internal.project.ant.AntLoggingAdapter] Class java.lang.Byte loaded from parent loader (parentFirst)
18:22:50.129 [DEBUG] [org.gradle.api.internal.project.ant.AntLoggingAdapter] Class java.lang.Character loaded from parent loader (parentFirst)
18:22:50.129 [DEBUG] [org.gradle.api.internal.project.ant.AntLoggingAdapter] Class java.lang.Double loaded from parent loader (parentFirst)
18:22:50.129 [DEBUG] [org.gradle.api.internal.project.ant.AntLoggingAdapter] Class java.lang.Float loaded from parent loader (parentFirst)
18:22:50.129 [DEBUG] [org.gradle.api.internal.project.ant.AntLoggingAdapter] Class java.lang.Integer loaded from parent loader (parentFirst)
18:22:50.129 [DEBUG] [org.gradle.api.internal.project.ant.AntLoggingAdapter] Class java.lang.Long loaded from parent loader (parentFirst)
18:22:50.129 [DEBUG] [org.gradle.api.internal.project.ant.AntLoggingAdapter] Class java.lang.Short loaded from parent loader (parentFirst)
18:22:50.130 [DEBUG] [org.gradle.api.internal.project.ant.AntLoggingAdapter] Class java.lang.Void loaded from parent loader (parentFirst)
18:22:50.130 [DEBUG] [org.gradle.api.internal.project.ant.AntLoggingAdapter] Finding class org.objectweb.asm.Edge
18:22:50.130 [DEBUG] [org.gradle.api.internal.project.ant.AntLoggingAdapter] Loaded from /home/jenkins/.gradle/caches/modules-2/files-2.1/org.ow2.asm/asm/7.1/fa29aa438674ff19d5e1386d2c3527a0267f291e/asm-7.1.jar org/objectweb/asm/Edge.class
18:22:50.131 [DEBUG] [org.gradle.api.internal.project.ant.AntLoggingAdapter] Class org.objectweb.asm.Edge loaded from ant loader (parentFirst)
18:22:50.131 [DEBUG] [org.gradle.api.internal.project.ant.AntLoggingAdapter] Finding class org.python.modules.thread.PyLocal
18:22:50.131 [DEBUG] [org.gradle.api.internal.project.ant.AntLoggingAdapter] Loaded from /home/jenkins/.jenkins/jobs/gluu-jython/workspace/build2/unexposed org/python/modules/thread/PyLocal.class
18:22:50.132 [DEBUG] [org.gradle.api.internal.project.ant.AntLoggingAdapter] Class org.python.modules.thread.PyLocal loaded from ant loader (parentFirst)
18:22:50.132 [DEBUG] [org.gradle.api.internal.project.ant.AntLoggingAdapter] Finding class org.python.modules.thread.PyLocalDerived
18:22:50.132 [DEBUG] [org.gradle.api.internal.project.ant.AntLoggingAdapter] Loaded from /home/jenkins/.jenkins/jobs/gluu-jython/workspace/build2/unexposed org/python/modules/thread/PyLocalDerived.class
18:22:50.133 [DEBUG] [org.gradle.api.internal.project.ant.AntLoggingAdapter] Finding class org.python.core.Slotted
18:22:50.133 [DEBUG] [org.gradle.api.internal.project.ant.AntLoggingAdapter] Loaded from /home/jenkins/.jenkins/jobs/gluu-jython/workspace/build2/unexposed org/python/core/Slotted.class
18:22:50.133 [DEBUG] [org.gradle.api.internal.project.ant.AntLoggingAdapter] Class org.python.core.Slotted loaded from ant loader (parentFirst)
18:22:50.133 [DEBUG] [org.gradle.api.internal.project.ant.AntLoggingAdapter] Finding class org.python.core.finalization.FinalizablePyObjectDerived
18:22:50.133 [DEBUG] [org.gradle.api.internal.project.ant.AntLoggingAdapter] Loaded from /home/jenkins/.jenkins/jobs/gluu-jython/workspace/build2/unexposed org/python/core/finalization/FinalizablePyObjectDerived.class
18:22:50.133 [DEBUG] [org.gradle.api.internal.project.ant.AntLoggingAdapter] Class org.python.core.finalization.FinalizablePyObjectDerived loaded from ant loader (parentFirst)
18:22:50.134 [DEBUG] [org.gradle.api.internal.project.ant.AntLoggingAdapter] Finding class org.python.core.TraverseprocDerived
18:22:50.134 [DEBUG] [org.gradle.api.internal.project.ant.AntLoggingAdapter] Loaded from /home/jenkins/.jenkins/jobs/gluu-jython/workspace/build2/unexposed org/python/core/TraverseprocDerived.class
18:22:50.134 [DEBUG] [org.gradle.api.internal.project.ant.AntLoggingAdapter] Class org.python.core.TraverseprocDerived loaded from ant loader (parentFirst)
18:22:50.134 [DEBUG] [org.gradle.api.internal.project.ant.AntLoggingAdapter] Class org.python.modules.thread.PyLocalDerived loaded from ant loader (parentFirst)
18:22:50.137 [DEBUG] [org.gradle.api.internal.project.ant.AntLoggingAdapter] Class java.lang.Exception loaded from parent loader (parentFirst)
18:22:50.137 [DEBUG] [org.gradle.api.internal.project.ant.AntLoggingAdapter] Finding class org.python.expose.generate.Exposer$Instantiator
18:22:50.137 [DEBUG] [org.gradle.api.internal.project.ant.AntLoggingAdapter] Loaded from /home/jenkins/.jenkins/jobs/gluu-jython/workspace/build2/unexposed org/python/expose/generate/Exposer$Instantiator.class
18:22:50.137 [DEBUG] [org.gradle.api.internal.project.ant.AntLoggingAdapter] Class org.python.expose.generate.Exposer$Instantiator loaded from ant loader (parentFirst)
18:22:50.137 [DEBUG] [org.gradle.api.internal.project.ant.AntLoggingAdapter] Finding class org.python.expose.generate.TypeExposer$1
18:22:50.138 [DEBUG] [org.gradle.api.internal.project.ant.AntLoggingAdapter] Loaded from /home/jenkins/.jenkins/jobs/gluu-jython/workspace/build2/unexposed org/python/expose/generate/TypeExposer$1.class
18:22:50.138 [DEBUG] [org.gradle.api.internal.project.ant.AntLoggingAdapter] Class org.python.expose.generate.TypeExposer$1 loaded from ant loader (parentFirst)
18:22:50.138 [DEBUG] [org.gradle.api.internal.project.ant.AntLoggingAdapter] Finding class org.python.expose.BaseTypeBuilder
18:22:50.138 [DEBUG] [org.gradle.api.internal.project.ant.AntLoggingAdapter] Loaded from /home/jenkins/.jenkins/jobs/gluu-jython/workspace/build2/unexposed org/python/expose/BaseTypeBuilder.class
18:22:50.139 [DEBUG] [org.gradle.api.internal.project.ant.AntLoggingAdapter] Class org.python.expose.BaseTypeBuilder loaded from ant loader (parentFirst)
18:22:50.140 [DEBUG] [org.gradle.api.internal.project.ant.AntLoggingAdapter] Finding class org.objectweb.asm.Handler
18:22:50.140 [DEBUG] [org.gradle.api.internal.project.ant.AntLoggingAdapter] Loaded from /home/jenkins/.gradle/caches/modules-2/files-2.1/org.ow2.asm/asm/7.1/fa29aa438674ff19d5e1386d2c3527a0267f291e/asm-7.1.jar org/objectweb/asm/Handler.class
18:22:50.140 [DEBUG] [org.gradle.api.internal.project.ant.AntLoggingAdapter] Class org.objectweb.asm.Handler loaded from ant loader (parentFirst)
18:22:50.141 [DEBUG] [org.gradle.api.internal.project.ant.AntLoggingAdapter] Class java.io.FileOutputStream loaded from parent loader (parentFirst)
18:22:50.144 [DEBUG] [org.gradle.api.internal.project.ant.AntLoggingAdapter] Finding class org.python.expose.generate.OverridableNewExposer$1
18:22:50.144 [DEBUG] [org.gradle.api.internal.project.ant.AntLoggingAdapter] Loaded from /home/jenkins/.jenkins/jobs/gluu-jython/workspace/build2/unexposed org/python/expose/generate/OverridableNewExposer$1.class
18:22:50.145 [DEBUG] [org.gradle.api.internal.project.ant.AntLoggingAdapter] Class org.python.expose.generate.OverridableNewExposer$1 loaded from ant loader (parentFirst)
18:22:50.145 [DEBUG] [org.gradle.api.internal.project.ant.AntLoggingAdapter] Finding class org.python.expose.generate.OverridableNewExposer$2
18:22:50.145 [DEBUG] [org.gradle.api.internal.project.ant.AntLoggingAdapter] Loaded from /home/jenkins/.jenkins/jobs/gluu-jython/workspace/build2/unexposed org/python/expose/generate/OverridableNewExposer$2.class
18:22:50.145 [DEBUG] [org.gradle.api.internal.project.ant.AntLoggingAdapter] Class org.python.expose.generate.OverridableNewExposer$2 loaded from ant loader (parentFirst)
18:22:50.145 [DEBUG] [org.gradle.api.internal.project.ant.AntLoggingAdapter] Finding class org.python.core.PyOverridableNew
18:22:50.146 [DEBUG] [org.gradle.api.internal.project.ant.AntLoggingAdapter] Loaded from /home/jenkins/.jenkins/jobs/gluu-jython/workspace/build2/unexposed org/python/core/PyOverridableNew.class
18:22:50.146 [DEBUG] [org.gradle.api.internal.project.ant.AntLoggingAdapter] Class org.python.core.PyOverridableNew loaded from ant loader (parentFirst)
18:22:50.146 [DEBUG] [org.gradle.api.internal.project.ant.AntLoggingAdapter] Finding class org.python.expose.generate.ExposedMethodFinder$ExposedMethodVisitor$1
18:22:50.146 [DEBUG] [org.gradle.api.internal.project.ant.AntLoggingAdapter] Loaded from /home/jenkins/.jenkins/jobs/gluu-jython/workspace/build2/unexposed org/python/expose/generate/ExposedMethodFinder$ExposedMethodVisitor$1.class
18:22:50.146 [DEBUG] [org.gradle.api.internal.project.ant.AntLoggingAdapter] Finding class org.python.expose.generate.ExposedMethodFinder$StringArrayBuilder
18:22:50.147 [DEBUG] [org.gradle.api.internal.project.ant.AntLoggingAdapter] Loaded from /home/jenkins/.jenkins/jobs/gluu-jython/workspace/build2/unexposed org/python/expose/generate/ExposedMethodFinder$StringArrayBuilder.class
18:22:50.147 [DEBUG] [org.gradle.api.internal.project.ant.AntLoggingAdapter] Class org.python.expose.generate.ExposedMethodFinder$StringArrayBuilder loaded from ant loader (parentFirst)
18:22:50.147 [DEBUG] [org.gradle.api.internal.project.ant.AntLoggingAdapter] Class org.python.expose.generate.ExposedMethodFinder$ExposedMethodVisitor$1 loaded from ant loader (parentFirst)
18:22:50.147 [DEBUG] [org.gradle.api.internal.project.ant.AntLoggingAdapter] Finding class org.python.expose.generate.ExposedMethodFinder$ExposedMethodVisitor$2
18:22:50.147 [DEBUG] [org.gradle.api.internal.project.ant.AntLoggingAdapter] Loaded from /home/jenkins/.jenkins/jobs/gluu-jython/workspace/build2/unexposed org/python/expose/generate/ExposedMethodFinder$ExposedMethodVisitor$2.class
18:22:50.147 [DEBUG] [org.gradle.api.internal.project.ant.AntLoggingAdapter] Class org.python.expose.generate.ExposedMethodFinder$ExposedMethodVisitor$2 loaded from ant loader (parentFirst)
18:22:50.148 [DEBUG] [org.gradle.api.internal.project.ant.AntLoggingAdapter] Finding class org.python.expose.MethodType
18:22:50.148 [DEBUG] [org.gradle.api.internal.project.ant.AntLoggingAdapter] Loaded from /home/jenkins/.jenkins/jobs/gluu-jython/workspace/build2/unexposed org/python/expose/MethodType.class
18:22:50.148 [DEBUG] [org.gradle.api.internal.project.ant.AntLoggingAdapter] Class java.lang.Enum loaded from parent loader (parentFirst)
18:22:50.148 [DEBUG] [org.gradle.api.internal.project.ant.AntLoggingAdapter] Class org.python.expose.MethodType loaded from ant loader (parentFirst)
18:22:50.149 [DEBUG] [org.gradle.api.internal.project.ant.AntLoggingAdapter] Finding class org.python.expose.generate.InstanceMethodExposer
18:22:50.149 [DEBUG] [org.gradle.api.internal.project.ant.AntLoggingAdapter] Loaded from /home/jenkins/.jenkins/jobs/gluu-jython/workspace/build2/unexposed org/python/expose/generate/InstanceMethodExposer.class
18:22:50.150 [DEBUG] [org.gradle.api.internal.project.ant.AntLoggingAdapter] Class org.python.expose.generate.InstanceMethodExposer loaded from ant loader (parentFirst)
18:22:50.150 [DEBUG] [org.gradle.api.internal.project.ant.AntLoggingAdapter] Finding class org.python.expose.generate.MethodExposer$1
18:22:50.150 [DEBUG] [org.gradle.api.internal.project.ant.AntLoggingAdapter] Loaded from /home/jenkins/.jenkins/jobs/gluu-jython/workspace/build2/unexposed org/python/expose/generate/MethodExposer$1.class
18:22:50.150 [DEBUG] [org.gradle.api.internal.project.ant.AntLoggingAdapter] Class org.python.expose.generate.MethodExposer$1 loaded from ant loader (parentFirst)
18:22:50.151 [DEBUG] [org.gradle.api.internal.project.ant.AntLoggingAdapter] Finding class org.python.expose.generate.InstanceMethodExposer$1
18:22:50.151 [DEBUG] [org.gradle.api.internal.project.ant.AntLoggingAdapter] Loaded from /home/jenkins/.jenkins/jobs/gluu-jython/workspace/build2/unexposed org/python/expose/generate/InstanceMethodExposer$1.class
18:22:50.151 [DEBUG] [org.gradle.api.internal.project.ant.AntLoggingAdapter] Class org.python.expose.generate.InstanceMethodExposer$1 loaded from ant loader (parentFirst)
18:22:50.183 [DEBUG] [org.gradle.api.internal.project.ant.AntLoggingAdapter] Finding class org.python.modules._functools.PyPartial
18:22:50.183 [DEBUG] [org.gradle.api.internal.project.ant.AntLoggingAdapter] Loaded from /home/jenkins/.jenkins/jobs/gluu-jython/workspace/build2/unexposed org/python/modules/_functools/PyPartial.class
18:22:50.184 [DEBUG] [org.gradle.api.internal.project.ant.AntLoggingAdapter] Class org.python.modules._functools.PyPartial loaded from ant loader (parentFirst)
18:22:50.184 [DEBUG] [org.gradle.api.internal.project.ant.AntLoggingAdapter] Finding class org.python.modules._functools.PyPartialDerived
18:22:50.184 [DEBUG] [org.gradle.api.internal.project.ant.AntLoggingAdapter] Loaded from /home/jenkins/.jenkins/jobs/gluu-jython/workspace/build2/unexposed org/python/modules/_functools/PyPartialDerived.class
18:22:50.185 [DEBUG] [org.gradle.api.internal.project.ant.AntLoggingAdapter] Class org.python.modules._functools.PyPartialDerived loaded from ant loader (parentFirst)
18:22:50.201 [DEBUG] [org.gradle.api.internal.project.ant.AntLoggingAdapter] Finding class org.python.expose.generate.ClassMethodExposer
18:22:50.201 [DEBUG] [org.gradle.api.internal.project.ant.AntLoggingAdapter] Loaded from /home/jenkins/.jenkins/jobs/gluu-jython/workspace/build2/unexposed org/python/expose/generate/ClassMethodExposer.class
18:22:50.201 [DEBUG] [org.gradle.api.internal.project.ant.AntLoggingAdapter] Class org.python.expose.generate.ClassMethodExposer loaded from ant loader (parentFirst)
18:22:50.202 [DEBUG] [org.gradle.api.internal.project.ant.AntLoggingAdapter] Finding class org.python.core.PyBuiltinClassMethodNarrow
18:22:50.202 [DEBUG] [org.gradle.api.internal.project.ant.AntLoggingAdapter] Loaded from /home/jenkins/.jenkins/jobs/gluu-jython/workspace/build2/unexposed org/python/core/PyBuiltinClassMethodNarrow.class
18:22:50.202 [DEBUG] [org.gradle.api.internal.project.ant.AntLoggingAdapter] Class org.python.core.PyBuiltinClassMethodNarrow loaded from ant loader (parentFirst)
18:22:50.224 [DEBUG] [org.gradle.api.internal.project.ant.AntLoggingAdapter] Finding class org.python.core.PyTypeDerived
18:22:50.225 [DEBUG] [org.gradle.api.internal.project.ant.AntLoggingAdapter] Loaded from /home/jenkins/.jenkins/jobs/gluu-jython/workspace/build2/unexposed org/python/core/PyTypeDerived.class
18:22:50.226 [DEBUG] [org.gradle.api.internal.project.ant.AntLoggingAdapter] Class org.python.core.PyTypeDerived loaded from ant loader (parentFirst)
18:22:50.227 [DEBUG] [org.gradle.api.internal.project.ant.AntLoggingAdapter] Finding class org.python.core.PyTuple
18:22:50.227 [DEBUG] [org.gradle.api.internal.project.ant.AntLoggingAdapter] Loaded from /home/jenkins/.jenkins/jobs/gluu-jython/workspace/build2/unexposed org/python/core/PyTuple.class
18:22:50.228 [DEBUG] [org.gradle.api.internal.project.ant.AntLoggingAdapter] Finding class org.python.core.PySequenceList
18:22:50.228 [DEBUG] [org.gradle.api.internal.project.ant.AntLoggingAdapter] Loaded from /home/jenkins/.jenkins/jobs/gluu-jython/workspace/build2/unexposed org/python/core/PySequenceList.class
18:22:50.228 [DEBUG] [org.gradle.api.internal.project.ant.AntLoggingAdapter] Class org.python.core.PySequenceList loaded from ant loader (parentFirst)
18:22:50.228 [DEBUG] [org.gradle.api.internal.project.ant.AntLoggingAdapter] Class org.python.core.PyTuple loaded from ant loader (parentFirst)
18:22:50.231 [DEBUG] [org.gradle.api.internal.project.ant.AntLoggingAdapter] Finding class org.python.core.PyNone
18:22:50.232 [DEBUG] [org.gradle.api.internal.project.ant.AntLoggingAdapter] Loaded from /home/jenkins/.jenkins/jobs/gluu-jython/workspace/build2/unexposed org/python/core/PyNone.class
18:22:50.232 [DEBUG] [org.gradle.api.internal.project.ant.AntLoggingAdapter] Class org.python.core.PyNone loaded from ant loader (parentFirst)
18:22:50.256 [DEBUG] [org.gradle.api.internal.project.ant.AntLoggingAdapter] Finding class org.python.modules.sre.MatchObject
18:22:50.256 [DEBUG] [org.gradle.api.internal.project.ant.AntLoggingAdapter] Loaded from /home/jenkins/.jenkins/jobs/gluu-jython/workspace/build2/unexposed org/python/modules/sre/MatchObject.class
18:22:50.256 [DEBUG] [org.gradle.api.internal.project.ant.AntLoggingAdapter] Class org.python.modules.sre.MatchObject loaded from ant loader (parentFirst)
18:22:50.273 [DEBUG] [org.gradle.api.internal.project.ant.AntLoggingAdapter] Finding class org.python.core.PyArray
18:22:50.273 [DEBUG] [org.gradle.api.internal.project.ant.AntLoggingAdapter] Loaded from /home/jenkins/.jenkins/jobs/gluu-jython/workspace/build2/unexposed org/python/core/PyArray.class
18:22:50.274 [DEBUG] [org.gradle.api.internal.project.ant.AntLoggingAdapter] Class org.python.core.PyArray loaded from ant loader (parentFirst)
18:22:50.275 [DEBUG] [org.gradle.api.internal.project.ant.AntLoggingAdapter] Finding class org.python.core.PyArrayDerived
18:22:50.275 [DEBUG] [org.gradle.api.internal.project.ant.AntLoggingAdapter] Loaded from /home/jenkins/.jenkins/jobs/gluu-jython/workspace/build2/unexposed org/python/core/PyArrayDerived.class
18:22:50.276 [DEBUG] [org.gradle.api.internal.project.ant.AntLoggingAdapter] Class org.python.core.PyArrayDerived loaded from ant loader (parentFirst)
18:22:50.280 [DEBUG] [org.gradle.api.internal.project.ant.AntLoggingAdapter] Finding class org.python.core.PyBuffer
18:22:50.280 [DEBUG] [org.gradle.api.internal.project.ant.AntLoggingAdapter] Loaded from /home/jenkins/.jenkins/jobs/gluu-jython/workspace/build2/unexposed org/python/core/PyBuffer.class
18:22:50.281 [DEBUG] [org.gradle.api.internal.project.ant.AntLoggingAdapter] Finding class org.python.core.PyBUF
18:22:50.281 [DEBUG] [org.gradle.api.internal.project.ant.AntLoggingAdapter] Loaded from /home/jenkins/.jenkins/jobs/gluu-jython/workspace/build2/unexposed org/python/core/PyBUF.class
18:22:50.281 [DEBUG] [org.gradle.api.internal.project.ant.AntLoggingAdapter] Class org.python.core.PyBUF loaded from ant loader (parentFirst)
18:22:50.282 [DEBUG] [org.gradle.api.internal.project.ant.AntLoggingAdapter] Class java.lang.AutoCloseable loaded from parent loader (parentFirst)
18:22:50.282 [DEBUG] [org.gradle.api.internal.project.ant.AntLoggingAdapter] Class org.python.core.PyBuffer loaded from ant loader (parentFirst)
18:22:50.286 [DEBUG] [org.gradle.api.internal.project.ant.AntLoggingAdapter] Finding class org.python.core.buffer.SimpleStringBuffer
18:22:50.286 [DEBUG] [org.gradle.api.internal.project.ant.AntLoggingAdapter] Loaded from /home/jenkins/.jenkins/jobs/gluu-jython/workspace/build2/unexposed org/python/core/buffer/SimpleStringBuffer.class
18:22:50.287 [DEBUG] [org.gradle.api.internal.project.ant.AntLoggingAdapter] Finding class org.python.core.buffer.SimpleBuffer
18:22:50.287 [DEBUG] [org.gradle.api.internal.project.ant.AntLoggingAdapter] Loaded from /home/jenkins/.jenkins/jobs/gluu-jython/workspace/build2/unexposed org/python/core/buffer/SimpleBuffer.class
18:22:50.287 [DEBUG] [org.gradle.api.internal.project.ant.AntLoggingAdapter] Finding class org.python.core.buffer.BaseArrayBuffer
18:22:50.287 [DEBUG] [org.gradle.api.internal.project.ant.AntLoggingAdapter] Loaded from /home/jenkins/.jenkins/jobs/gluu-jython/workspace/build2/unexposed org/python/core/buffer/BaseArrayBuffer.class
18:22:50.288 [DEBUG] [org.gradle.api.internal.project.ant.AntLoggingAdapter] Finding class org.python.core.buffer.Base1DBuffer
18:22:50.288 [DEBUG] [org.gradle.api.internal.project.ant.AntLoggingAdapter] Loaded from /home/jenkins/.jenkins/jobs/gluu-jython/workspace/build2/unexposed org/python/core/buffer/Base1DBuffer.class
18:22:50.288 [DEBUG] [org.gradle.api.internal.project.ant.AntLoggingAdapter] Finding class org.python.core.buffer.BaseBuffer
18:22:50.288 [DEBUG] [org.gradle.api.internal.project.ant.AntLoggingAdapter] Loaded from /home/jenkins/.jenkins/jobs/gluu-jython/workspace/build2/unexposed org/python/core/buffer/BaseBuffer.class
18:22:50.289 [DEBUG] [org.gradle.api.internal.project.ant.AntLoggingAdapter] Class org.python.core.buffer.BaseBuffer loaded from ant loader (parentFirst)
18:22:50.289 [DEBUG] [org.gradle.api.internal.project.ant.AntLoggingAdapter] Class org.python.core.buffer.Base1DBuffer loaded from ant loader (parentFirst)
18:22:50.289 [DEBUG] [org.gradle.api.internal.project.ant.AntLoggingAdapter] Class org.python.core.buffer.BaseArrayBuffer loaded from ant loader (parentFirst)
18:22:50.289 [DEBUG] [org.gradle.api.internal.project.ant.AntLoggingAdapter] Class org.python.core.buffer.SimpleBuffer loaded from ant loader (parentFirst)
18:22:50.289 [DEBUG] [org.gradle.api.internal.project.ant.AntLoggingAdapter] Class org.python.core.buffer.SimpleStringBuffer loaded from ant loader (parentFirst)
18:22:50.369 [DEBUG] [org.gradle.api.internal.project.ant.AntLoggingAdapter] Finding class org.python.core.PyStringMap
18:22:50.370 [DEBUG] [org.gradle.api.internal.project.ant.AntLoggingAdapter] Loaded from /home/jenkins/.jenkins/jobs/gluu-jython/workspace/build2/unexposed org/python/core/PyStringMap.class
18:22:50.371 [DEBUG] [org.gradle.api.internal.project.ant.AntLoggingAdapter] Finding class org.python.core.AbstractDict
18:22:50.371 [DEBUG] [org.gradle.api.internal.project.ant.AntLoggingAdapter] Loaded from /home/jenkins/.jenkins/jobs/gluu-jython/workspace/build2/unexposed org/python/core/AbstractDict.class
18:22:50.371 [DEBUG] [org.gradle.api.internal.project.ant.AntLoggingAdapter] Class org.python.core.AbstractDict loaded from ant loader (parentFirst)
18:22:50.371 [DEBUG] [org.gradle.api.internal.project.ant.AntLoggingAdapter] Class org.python.core.PyStringMap loaded from ant loader (parentFirst)
18:22:50.373 [DEBUG] [org.gradle.api.internal.project.ant.AntLoggingAdapter] Finding class org.python.core.PyInstance
18:22:50.374 [DEBUG] [org.gradle.api.internal.project.ant.AntLoggingAdapter] Loaded from /home/jenkins/.jenkins/jobs/gluu-jython/workspace/build2/unexposed org/python/core/PyInstance.class
18:22:50.375 [DEBUG] [org.gradle.api.internal.project.ant.AntLoggingAdapter] Finding class org.python.core.finalization.FinalizablePyObject
18:22:50.375 [DEBUG] [org.gradle.api.internal.project.ant.AntLoggingAdapter] Loaded from /home/jenkins/.jenkins/jobs/gluu-jython/workspace/build2/unexposed org/python/core/finalization/FinalizablePyObject.class
18:22:50.375 [DEBUG] [org.gradle.api.internal.project.ant.AntLoggingAdapter] Class org.python.core.finalization.FinalizablePyObject loaded from ant loader (parentFirst)
18:22:50.376 [DEBUG] [org.gradle.api.internal.project.ant.AntLoggingAdapter] Class org.python.core.PyInstance loaded from ant loader (parentFirst)
18:22:50.438 [DEBUG] [org.gradle.api.internal.project.ant.AntLoggingAdapter] Finding class org.python.core.PyUnicode
18:22:50.438 [DEBUG] [org.gradle.api.internal.project.ant.AntLoggingAdapter] Loaded from /home/jenkins/.jenkins/jobs/gluu-jython/workspace/build2/unexposed org/python/core/PyUnicode.class
18:22:50.439 [DEBUG] [org.gradle.api.internal.project.ant.AntLoggingAdapter] Class java.lang.Iterable loaded from parent loader (parentFirst)
18:22:50.440 [DEBUG] [org.gradle.api.internal.project.ant.AntLoggingAdapter] Class org.python.core.PyUnicode loaded from ant loader (parentFirst)
18:22:50.499 [DEBUG] [org.gradle.api.internal.project.ant.AntLoggingAdapter] Finding class org.python.modules.jffi.Function$ErrCheckInvoker
18:22:50.499 [DEBUG] [org.gradle.api.internal.project.ant.AntLoggingAdapter] Loaded from /home/jenkins/.jenkins/jobs/gluu-jython/workspace/build2/unexposed org/python/modules/jffi/Function$ErrCheckInvoker.class
18:22:50.500 [DEBUG] [org.gradle.api.internal.project.ant.AntLoggingAdapter] Finding class org.python.modules.jffi.Invoker
18:22:50.500 [DEBUG] [org.gradle.api.internal.project.ant.AntLoggingAdapter] Loaded from /home/jenkins/.jenkins/jobs/gluu-jython/workspace/build2/unexposed org/python/modules/jffi/Invoker.class
18:22:50.500 [DEBUG] [org.gradle.api.internal.project.ant.AntLoggingAdapter] Class org.python.modules.jffi.Invoker loaded from ant loader (parentFirst)
18:22:50.500 [DEBUG] [org.gradle.api.internal.project.ant.AntLoggingAdapter] Class org.python.modules.jffi.Function$ErrCheckInvoker loaded from ant loader (parentFirst)
18:22:50.529 [DEBUG] [org.gradle.api.internal.project.ant.AntLoggingAdapter] Finding class org.python.core.buffer.SimpleWritableBuffer
18:22:50.529 [DEBUG] [org.gradle.api.internal.project.ant.AntLoggingAdapter] Loaded from /home/jenkins/.jenkins/jobs/gluu-jython/workspace/build2/unexposed org/python/core/buffer/SimpleWritableBuffer.class
18:22:50.530 [DEBUG] [org.gradle.api.internal.project.ant.AntLoggingAdapter] Class org.python.core.buffer.SimpleWritableBuffer loaded from ant loader (parentFirst)
18:22:50.531 [DEBUG] [org.gradle.api.internal.project.ant.AntLoggingAdapter] Finding class org.python.core.PyByteArray
18:22:50.531 [DEBUG] [org.gradle.api.internal.project.ant.AntLoggingAdapter] Loaded from /home/jenkins/.jenkins/jobs/gluu-jython/workspace/build2/unexposed org/python/core/PyByteArray.class
18:22:50.533 [DEBUG] [org.gradle.api.internal.project.ant.AntLoggingAdapter] Finding class org.python.core.BaseBytes
18:22:50.533 [DEBUG] [org.gradle.api.internal.project.ant.AntLoggingAdapter] Loaded from /home/jenkins/.jenkins/jobs/gluu-jython/workspace/build2/unexposed org/python/core/BaseBytes.class
18:22:50.535 [DEBUG] [org.gradle.api.internal.project.ant.AntLoggingAdapter] Class org.python.core.BaseBytes loaded from ant loader (parentFirst)
18:22:50.535 [DEBUG] [org.gradle.api.internal.project.ant.AntLoggingAdapter] Class org.python.core.PyByteArray loaded from ant loader (parentFirst)
18:22:50.539 [DEBUG] [org.gradle.api.internal.project.ant.AntLoggingAdapter] Finding class org.python.core.BaseBytes$ByteSet
18:22:50.539 [DEBUG] [org.gradle.api.internal.project.ant.AntLoggingAdapter] Loaded from /home/jenkins/.jenkins/jobs/gluu-jython/workspace/build2/unexposed org/python/core/BaseBytes$ByteSet.class
18:22:50.539 [DEBUG] [org.gradle.api.internal.project.ant.AntLoggingAdapter] Class org.python.core.BaseBytes$ByteSet loaded from ant loader (parentFirst)
18:22:50.592 [DEBUG] [org.gradle.api.internal.project.ant.AntLoggingAdapter] Finding class org.python.core.BaseSet
18:22:50.593 [DEBUG] [org.gradle.api.internal.project.ant.AntLoggingAdapter] Loaded from /home/jenkins/.jenkins/jobs/gluu-jython/workspace/build2/unexposed org/python/core/BaseSet.class
18:22:50.594 [DEBUG] [org.gradle.api.internal.project.ant.AntLoggingAdapter] Class org.python.core.BaseSet loaded from ant loader (parentFirst)
18:22:50.594 [DEBUG] [org.gradle.api.internal.project.ant.AntLoggingAdapter] Finding class org.python.core.PySet
18:22:50.594 [DEBUG] [org.gradle.api.internal.project.ant.AntLoggingAdapter] Loaded from /home/jenkins/.jenkins/jobs/gluu-jython/workspace/build2/unexposed org/python/core/PySet.class
18:22:50.595 [DEBUG] [org.gradle.api.internal.project.ant.AntLoggingAdapter] Class org.python.core.PySet loaded from ant loader (parentFirst)
18:22:50.633 [DEBUG] [org.gradle.api.internal.project.ant.AntLoggingAdapter] Finding class org.python.core.PyFrozenSet
18:22:50.633 [DEBUG] [org.gradle.api.internal.project.ant.AntLoggingAdapter] Loaded from /home/jenkins/.jenkins/jobs/gluu-jython/workspace/build2/unexposed org/python/core/PyFrozenSet.class
18:22:50.633 [DEBUG] [org.gradle.api.internal.project.ant.AntLoggingAdapter] Class org.python.core.PyFrozenSet loaded from ant loader (parentFirst)
18:22:50.634 [DEBUG] [org.gradle.api.internal.project.ant.AntLoggingAdapter] Finding class org.python.core.PyFrozenSetDerived
18:22:50.634 [DEBUG] [org.gradle.api.internal.project.ant.AntLoggingAdapter] Loaded from /home/jenkins/.jenkins/jobs/gluu-jython/workspace/build2/unexposed org/python/core/PyFrozenSetDerived.class
18:22:50.635 [DEBUG] [org.gradle.api.internal.project.ant.AntLoggingAdapter] Class org.python.core.PyFrozenSetDerived loaded from ant loader (parentFirst)
18:22:50.643 [DEBUG] [org.gradle.api.internal.project.ant.AntLoggingAdapter] Finding class org.python.core.PyDictionary
18:22:50.643 [DEBUG] [org.gradle.api.internal.project.ant.AntLoggingAdapter] Loaded from /home/jenkins/.jenkins/jobs/gluu-jython/workspace/build2/unexposed org/python/core/PyDictionary.class
18:22:50.644 [DEBUG] [org.gradle.api.internal.project.ant.AntLoggingAdapter] Class org.python.core.PyDictionary loaded from ant loader (parentFirst)
18:22:50.648 [DEBUG] [org.gradle.api.internal.project.ant.AntLoggingAdapter] Finding class org.python.core.PyList
18:22:50.648 [DEBUG] [org.gradle.api.internal.project.ant.AntLoggingAdapter] Loaded from /home/jenkins/.jenkins/jobs/gluu-jython/workspace/build2/unexposed org/python/core/PyList.class
18:22:50.649 [DEBUG] [org.gradle.api.internal.project.ant.AntLoggingAdapter] Class org.python.core.PyList loaded from ant loader (parentFirst)
18:22:50.663 [DEBUG] [org.gradle.api.internal.project.ant.AntLoggingAdapter] Class java.nio.ByteBuffer loaded from parent loader (parentFirst)
18:22:50.664 [DEBUG] [org.gradle.api.internal.project.ant.AntLoggingAdapter] Class java.io.OutputStream loaded from parent loader (parentFirst)
18:22:50.679 [DEBUG] [org.gradle.api.internal.project.ant.AntLoggingAdapter] Finding class org.python.modules._csv.PyDialect
18:22:50.680 [DEBUG] [org.gradle.api.internal.project.ant.AntLoggingAdapter] Loaded from /home/jenkins/.jenkins/jobs/gluu-jython/workspace/build2/unexposed org/python/modules/_csv/PyDialect.class
18:22:50.680 [DEBUG] [org.gradle.api.internal.project.ant.AntLoggingAdapter] Class org.python.modules._csv.PyDialect loaded from ant loader (parentFirst)
18:22:50.681 [DEBUG] [org.gradle.api.internal.project.ant.AntLoggingAdapter] Finding class org.python.modules._csv.PyDialectDerived
18:22:50.681 [DEBUG] [org.gradle.api.internal.project.ant.AntLoggingAdapter] Loaded from /home/jenkins/.jenkins/jobs/gluu-jython/workspace/build2/unexposed org/python/modules/_csv/PyDialectDerived.class
18:22:50.682 [DEBUG] [org.gradle.api.internal.project.ant.AntLoggingAdapter] Class org.python.modules._csv.PyDialectDerived loaded from ant loader (parentFirst)
18:22:50.772 [DEBUG] [org.gradle.api.internal.project.ant.AntLoggingAdapter] Finding class org.python.core.stringlib.IntegerFormatter
18:22:50.772 [DEBUG] [org.gradle.api.internal.project.ant.AntLoggingAdapter] Loaded from /home/jenkins/.jenkins/jobs/gluu-jython/workspace/build2/unexposed org/python/core/stringlib/IntegerFormatter.class
18:22:50.773 [DEBUG] [org.gradle.api.internal.project.ant.AntLoggingAdapter] Finding class org.python.core.stringlib.InternalFormat$Formatter
18:22:50.773 [DEBUG] [org.gradle.api.internal.project.ant.AntLoggingAdapter] Loaded from /home/jenkins/.jenkins/jobs/gluu-jython/workspace/build2/unexposed org/python/core/stringlib/InternalFormat$Formatter.class
18:22:50.773 [DEBUG] [org.gradle.api.internal.project.ant.AntLoggingAdapter] Class java.lang.Appendable loaded from parent loader (parentFirst)
18:22:50.774 [DEBUG] [org.gradle.api.internal.project.ant.AntLoggingAdapter] Class org.python.core.stringlib.InternalFormat$Formatter loaded from ant loader (parentFirst)
18:22:50.774 [DEBUG] [org.gradle.api.internal.project.ant.AntLoggingAdapter] Class org.python.core.stringlib.IntegerFormatter loaded from ant loader (parentFirst)
18:22:50.774 [DEBUG] [org.gradle.api.internal.project.ant.AntLoggingAdapter] Finding class org.python.core.stringlib.FloatFormatter
18:22:50.774 [DEBUG] [org.gradle.api.internal.project.ant.AntLoggingAdapter] Loaded from /home/jenkins/.jenkins/jobs/gluu-jython/workspace/build2/unexposed org/python/core/stringlib/FloatFormatter.class
18:22:50.775 [DEBUG] [org.gradle.api.internal.project.ant.AntLoggingAdapter] Class org.python.core.stringlib.FloatFormatter loaded from ant loader (parentFirst)
18:22:50.788 [DEBUG] [org.gradle.api.internal.project.ant.AntLoggingAdapter] Finding class org.python.modules.jffi.StructLayout$Field
18:22:50.788 [DEBUG] [org.gradle.api.internal.project.ant.AntLoggingAdapter] Loaded from /home/jenkins/.jenkins/jobs/gluu-jython/workspace/build2/unexposed org/python/modules/jffi/StructLayout$Field.class
18:22:50.789 [DEBUG] [org.gradle.api.internal.project.ant.AntLoggingAdapter] Class org.python.modules.jffi.StructLayout$Field loaded from ant loader (parentFirst)
18:22:50.807 [DEBUG] [org.gradle.api.internal.project.ant.AntLoggingAdapter] Finding class org.python.core.PyUnicode$IndexTranslator
18:22:50.807 [DEBUG] [org.gradle.api.internal.project.ant.AntLoggingAdapter] Loaded from /home/jenkins/.jenkins/jobs/gluu-jython/workspace/build2/unexposed org/python/core/PyUnicode$IndexTranslator.class
18:22:50.808 [DEBUG] [org.gradle.api.internal.project.ant.AntLoggingAdapter] Class org.python.core.PyUnicode$IndexTranslator loaded from ant loader (parentFirst)
18:22:50.808 [DEBUG] [org.gradle.api.internal.project.ant.AntLoggingAdapter] Finding class org.python.core.PyUnicode$Supplementary
18:22:50.808 [DEBUG] [org.gradle.api.internal.project.ant.AntLoggingAdapter] Loaded from /home/jenkins/.jenkins/jobs/gluu-jython/workspace/build2/unexposed org/python/core/PyUnicode$Supplementary.class
18:22:50.808 [DEBUG] [org.gradle.api.internal.project.ant.AntLoggingAdapter] Class org.python.core.PyUnicode$Supplementary loaded from ant loader (parentFirst)
18:22:50.826 [DEBUG] [org.gradle.api.internal.project.ant.AntLoggingAdapter] Finding class org.python.core.PyComplex
18:22:50.827 [DEBUG] [org.gradle.api.internal.project.ant.AntLoggingAdapter] Loaded from /home/jenkins/.jenkins/jobs/gluu-jython/workspace/build2/unexposed org/python/core/PyComplex.class
18:22:50.828 [DEBUG] [org.gradle.api.internal.project.ant.AntLoggingAdapter] Class org.python.core.PyComplex loaded from ant loader (parentFirst)
18:22:50.828 [DEBUG] [org.gradle.api.internal.project.ant.AntLoggingAdapter] Finding class org.python.core.PyComplexDerived
18:22:50.828 [DEBUG] [org.gradle.api.internal.project.ant.AntLoggingAdapter] Loaded from /home/jenkins/.jenkins/jobs/gluu-jython/workspace/build2/unexposed org/python/core/PyComplexDerived.class
18:22:50.829 [DEBUG] [org.gradle.api.internal.project.ant.AntLoggingAdapter] Class org.python.core.PyComplexDerived loaded from ant loader (parentFirst)
18:22:50.841 [DEBUG] [org.gradle.api.internal.project.ant.AntLoggingAdapter] Finding class org.python.core.io.LineBufferedWriter
18:22:50.842 [DEBUG] [org.gradle.api.internal.project.ant.AntLoggingAdapter] Loaded from /home/jenkins/.jenkins/jobs/gluu-jython/workspace/build2/unexposed org/python/core/io/LineBufferedWriter.class
18:22:50.842 [DEBUG] [org.gradle.api.internal.project.ant.AntLoggingAdapter] Finding class org.python.core.io.BufferedWriter
18:22:50.843 [DEBUG] [org.gradle.api.internal.project.ant.AntLoggingAdapter] Loaded from /home/jenkins/.jenkins/jobs/gluu-jython/workspace/build2/unexposed org/python/core/io/BufferedWriter.class
18:22:50.843 [DEBUG] [org.gradle.api.internal.project.ant.AntLoggingAdapter] Finding class org.python.core.io.BufferedIOMixin
18:22:50.843 [DEBUG] [org.gradle.api.internal.project.ant.AntLoggingAdapter] Loaded from /home/jenkins/.jenkins/jobs/gluu-jython/workspace/build2/unexposed org/python/core/io/BufferedIOMixin.class
18:22:50.844 [DEBUG] [org.gradle.api.internal.project.ant.AntLoggingAdapter] Finding class org.python.core.io.BufferedIOBase
18:22:50.844 [DEBUG] [org.gradle.api.internal.project.ant.AntLoggingAdapter] Loaded from /home/jenkins/.jenkins/jobs/gluu-jython/workspace/build2/unexposed org/python/core/io/BufferedIOBase.class
18:22:50.844 [DEBUG] [org.gradle.api.internal.project.ant.AntLoggingAdapter] Finding class org.python.core.io.IOBase
18:22:50.844 [DEBUG] [org.gradle.api.internal.project.ant.AntLoggingAdapter] Loaded from /home/jenkins/.jenkins/jobs/gluu-jython/workspace/build2/unexposed org/python/core/io/IOBase.class
18:22:50.845 [DEBUG] [org.gradle.api.internal.project.ant.AntLoggingAdapter] Class org.python.core.io.IOBase loaded from ant loader (parentFirst)
18:22:50.845 [DEBUG] [org.gradle.api.internal.project.ant.AntLoggingAdapter] Class org.python.core.io.BufferedIOBase loaded from ant loader (parentFirst)
18:22:50.845 [DEBUG] [org.gradle.api.internal.project.ant.AntLoggingAdapter] Class org.python.core.io.BufferedIOMixin loaded from ant loader (parentFirst)
18:22:50.845 [DEBUG] [org.gradle.api.internal.project.ant.AntLoggingAdapter] Class org.python.core.io.BufferedWriter loaded from ant loader (parentFirst)
18:22:50.845 [DEBUG] [org.gradle.api.internal.project.ant.AntLoggingAdapter] Class org.python.core.io.LineBufferedWriter loaded from ant loader (parentFirst)
18:22:50.845 [DEBUG] [org.gradle.api.internal.project.ant.AntLoggingAdapter] Finding class org.python.core.io.BufferedReader
18:22:50.845 [DEBUG] [org.gradle.api.internal.project.ant.AntLoggingAdapter] Loaded from /home/jenkins/.jenkins/jobs/gluu-jython/workspace/build2/unexposed org/python/core/io/BufferedReader.class
18:22:50.846 [DEBUG] [org.gradle.api.internal.project.ant.AntLoggingAdapter] Class org.python.core.io.BufferedReader loaded from ant loader (parentFirst)
18:22:50.846 [DEBUG] [org.gradle.api.internal.project.ant.AntLoggingAdapter] Finding class org.python.core.io.BufferedRandom
18:22:50.846 [DEBUG] [org.gradle.api.internal.project.ant.AntLoggingAdapter] Loaded from /home/jenkins/.jenkins/jobs/gluu-jython/workspace/build2/unexposed org/python/core/io/BufferedRandom.class
18:22:50.846 [DEBUG] [org.gradle.api.internal.project.ant.AntLoggingAdapter] Class org.python.core.io.BufferedRandom loaded from ant loader (parentFirst)
18:22:50.847 [DEBUG] [org.gradle.api.internal.project.ant.AntLoggingAdapter] Finding class org.python.core.io.LineBufferedRandom
18:22:50.847 [DEBUG] [org.gradle.api.internal.project.ant.AntLoggingAdapter] Loaded from /home/jenkins/.jenkins/jobs/gluu-jython/workspace/build2/unexposed org/python/core/io/LineBufferedRandom.class
18:22:50.847 [DEBUG] [org.gradle.api.internal.project.ant.AntLoggingAdapter] Class org.python.core.io.LineBufferedRandom loaded from ant loader (parentFirst)
18:22:50.848 [DEBUG] [org.gradle.api.internal.project.ant.AntLoggingAdapter] Class java.lang.ClassCastException loaded from parent loader (parentFirst)
18:22:50.908 [DEBUG] [org.gradle.api.internal.project.ant.AntLoggingAdapter] Finding class org.python.core.PyObjectDerived
18:22:50.908 [DEBUG] [org.gradle.api.internal.project.ant.AntLoggingAdapter] Loaded from /home/jenkins/.jenkins/jobs/gluu-jython/workspace/build2/unexposed org/python/core/PyObjectDerived.class
18:22:50.909 [DEBUG] [org.gradle.api.internal.project.ant.AntLoggingAdapter] Class org.python.core.PyObjectDerived loaded from ant loader (parentFirst)
18:22:50.909 [DEBUG] [org.gradle.api.internal.project.ant.AntLoggingAdapter] Class java.lang.InstantiationException loaded from parent loader (parentFirst)
18:22:50.909 [DEBUG] [org.gradle.api.internal.project.ant.AntLoggingAdapter] Class java.lang.NoSuchMethodException loaded from parent loader (parentFirst)
18:22:50.967 [DEBUG] [org.gradle.internal.operations.DefaultBuildOperationExecutor] Completing Build operation 'Execute doLast {} action for :expose'
18:22:50.967 [DEBUG] [org.gradle.internal.operations.DefaultBuildOperationExecutor] Build operation 'Execute doLast {} action for :expose' completed
18:22:50.968 [DEBUG] [org.gradle.api.internal.changedetection.state.CacheBackedTaskHistoryRepository] Fingerprinting property $1 (Output) for task ':expose'
18:22:51.755 [DEBUG] [org.gradle.api.internal.tasks.execution.ResolveTaskArtifactStateTaskExecuter] Removed task artifact state for {} from context.
18:22:51.755 [DEBUG] [org.gradle.api.internal.tasks.execution.ExecuteAtMostOnceTaskExecuter] Finished executing task ':expose'
18:22:51.755 [DEBUG] [org.gradle.internal.operations.DefaultBuildOperationExecutor] Completing Build operation 'Task :expose'
18:22:51.755 [DEBUG] [org.gradle.internal.operations.DefaultBuildOperationExecutor] Build operation 'Task :expose' completed
18:22:51.755 [INFO] [org.gradle.execution.taskgraph.DefaultTaskPlanExecutor] :expose (Thread[Task worker for ':',5,main]) completed. Took 2.258 secs.
18:22:51.755 [DEBUG] [org.gradle.internal.resources.AbstractTrackedResourceLock] Task worker for ':': released lock on :
18:22:51.755 [DEBUG] [org.gradle.internal.work.DefaultWorkerLeaseService] Worker lease root.1.2 completed (1 worker(s) in use)
18:22:51.755 [DEBUG] [org.gradle.internal.resources.AbstractTrackedResourceLock] Task worker for ':': released lock on root.1.2
18:22:51.756 [DEBUG] [org.gradle.internal.resources.AbstractTrackedResourceLock] Task worker for ':': acquired lock on :
18:22:51.756 [DEBUG] [org.gradle.internal.work.DefaultWorkerLeaseService] Worker lease root.1.2 started (1 worker(s) in use).
18:22:51.757 [DEBUG] [org.gradle.internal.resources.AbstractTrackedResourceLock] Task worker for ':': acquired lock on root.1.2
18:22:51.757 [INFO] [org.gradle.execution.taskgraph.DefaultTaskPlanExecutor] :mergeExposed (Thread[Task worker for ':',5,main]) started.
18:22:53.634 [DEBUG] [org.gradle.process.internal.health.memory.MemoryManager] Emitting OS memory status event {Total: 16656596992, Free: 10026106880}
18:22:53.634 [DEBUG] [org.gradle.launcher.daemon.server.health.LowMemoryDaemonExpirationStrategy] Received memory status update: {Total: 16656596992, Free: 10026106880}
18:22:53.634 [DEBUG] [org.gradle.process.internal.health.memory.MemoryManager] Emitting JVM memory status event {Maximum: 954728448, Committed: 680001536}
18:22:51.757 [LIFECYCLE] [class org.gradle.internal.buildevents.TaskExecutionLogger] 
18:22:51.757 [LIFECYCLE] [class org.gradle.internal.buildevents.TaskExecutionLogger] > Task :mergeExposed
18:22:51.757 [DEBUG] [org.gradle.internal.operations.DefaultBuildOperationExecutor] Build operation 'Task :mergeExposed' started
18:22:51.757 [DEBUG] [org.gradle.api.internal.tasks.execution.ExecuteAtMostOnceTaskExecuter] Starting to execute task ':mergeExposed'
18:22:51.757 [DEBUG] [org.gradle.api.internal.tasks.execution.ResolveTaskArtifactStateTaskExecuter] Putting task artifact state for task ':mergeExposed' into context took 0.0 secs.
18:22:51.760 [DEBUG] [org.gradle.api.internal.tasks.execution.SkipUpToDateTaskExecuter] Determining if task ':mergeExposed' is up-to-date
18:22:51.788 [DEBUG] [org.gradle.api.internal.changedetection.state.CacheBackedTaskHistoryRepository] Implementation for task ':mergeExposed': org.gradle.api.tasks.Copy_Decorated@59d5e613deb5bb7f413476642a045e99
18:22:51.788 [DEBUG] [org.gradle.api.internal.changedetection.state.CacheBackedTaskHistoryRepository] Action implementations for task ':mergeExposed': [org.gradle.api.tasks.Copy_Decorated@59d5e613deb5bb7f413476642a045e99]
18:22:51.788 [DEBUG] [org.gradle.api.internal.changedetection.state.CacheBackedTaskHistoryRepository] Fingerprinting property rootSpec$1 (RelativePathInput) for task ':mergeExposed'
18:22:51.857 [DEBUG] [org.gradle.api.internal.changedetection.state.CacheBackedTaskHistoryRepository] Fingerprinting property destinationDir (Output) for task ':mergeExposed'
18:22:51.858 [INFO] [org.gradle.api.internal.tasks.execution.SkipUpToDateTaskExecuter] Task ':mergeExposed' is not up-to-date because:
  Output property 'destinationDir' file /home/jenkins/.jenkins/jobs/gluu-jython/workspace/build2/classes/java/main has been removed.
  Output property 'destinationDir' file /home/jenkins/.jenkins/jobs/gluu-jython/workspace/build2/classes/java/main/com has been removed.
  Output property 'destinationDir' file /home/jenkins/.jenkins/jobs/gluu-jython/workspace/build2/classes/java/main/com/xhaus has been removed.
18:22:51.858 [DEBUG] [org.gradle.api.internal.tasks.execution.OutputDirectoryCreatingTaskExecuter] Ensuring directory exists for property destinationDir (Output) at /home/jenkins/.jenkins/jobs/gluu-jython/workspace/build2/classes/java/main
18:22:51.859 [DEBUG] [org.gradle.api.internal.tasks.execution.ExecuteActionsTaskExecuter] Executing actions for task ':mergeExposed'.
18:22:51.859 [DEBUG] [org.gradle.internal.operations.DefaultBuildOperationExecutor] Build operation 'Execute copy for :mergeExposed' started
18:22:53.014 [DEBUG] [org.gradle.internal.operations.DefaultBuildOperationExecutor] Completing Build operation 'Execute copy for :mergeExposed'
18:22:53.014 [DEBUG] [org.gradle.internal.operations.DefaultBuildOperationExecutor] Build operation 'Execute copy for :mergeExposed' completed
18:22:53.014 [DEBUG] [org.gradle.api.internal.changedetection.state.CacheBackedTaskHistoryRepository] Fingerprinting property destinationDir (Output) for task ':mergeExposed'
18:22:53.942 [DEBUG] [org.gradle.api.internal.tasks.execution.ResolveTaskArtifactStateTaskExecuter] Removed task artifact state for {} from context.
18:22:53.942 [DEBUG] [org.gradle.api.internal.tasks.execution.ExecuteAtMostOnceTaskExecuter] Finished executing task ':mergeExposed'
18:22:53.942 [DEBUG] [org.gradle.internal.operations.DefaultBuildOperationExecutor] Completing Build operation 'Task :mergeExposed'
18:22:53.942 [DEBUG] [org.gradle.internal.operations.DefaultBuildOperationExecutor] Build operation 'Task :mergeExposed' completed
18:22:53.942 [INFO] [org.gradle.execution.taskgraph.DefaultTaskPlanExecutor] :mergeExposed (Thread[Task worker for ':',5,main]) completed. Took 2.185 secs.
18:22:53.942 [DEBUG] [org.gradle.internal.resources.AbstractTrackedResourceLock] Task worker for ':': released lock on :
18:22:53.942 [DEBUG] [org.gradle.internal.work.DefaultWorkerLeaseService] Worker lease root.1.2 completed (1 worker(s) in use)
18:22:53.942 [DEBUG] [org.gradle.internal.resources.AbstractTrackedResourceLock] Task worker for ':': released lock on root.1.2
18:22:53.943 [DEBUG] [org.gradle.internal.resources.AbstractTrackedResourceLock] Task worker for ':': acquired lock on :
18:22:53.943 [DEBUG] [org.gradle.internal.work.DefaultWorkerLeaseService] Worker lease root.1.2 started (1 worker(s) in use).
18:22:53.943 [DEBUG] [org.gradle.internal.resources.AbstractTrackedResourceLock] Task worker for ':': acquired lock on root.1.2
18:22:53.944 [INFO] [org.gradle.execution.taskgraph.DefaultTaskPlanExecutor] :mergePythonLib (Thread[Task worker for ':',5,main]) started.
18:22:53.944 [LIFECYCLE] [class org.gradle.internal.buildevents.TaskExecutionLogger] 
18:22:53.944 [LIFECYCLE] [class org.gradle.internal.buildevents.TaskExecutionLogger] > Task :mergePythonLib
18:22:53.944 [DEBUG] [org.gradle.internal.operations.DefaultBuildOperationExecutor] Build operation 'Task :mergePythonLib' started
18:22:53.944 [DEBUG] [org.gradle.api.internal.tasks.execution.ExecuteAtMostOnceTaskExecuter] Starting to execute task ':mergePythonLib'
18:22:53.944 [DEBUG] [org.gradle.api.internal.tasks.execution.ResolveTaskArtifactStateTaskExecuter] Putting task artifact state for task ':mergePythonLib' into context took 0.0 secs.
18:22:53.945 [DEBUG] [org.gradle.api.internal.tasks.execution.SkipUpToDateTaskExecuter] Determining if task ':mergePythonLib' is up-to-date
18:22:53.966 [DEBUG] [org.gradle.api.internal.changedetection.state.CacheBackedTaskHistoryRepository] Implementation for task ':mergePythonLib': org.gradle.api.tasks.Copy_Decorated@59d5e613deb5bb7f413476642a045e99
18:22:53.966 [DEBUG] [org.gradle.api.internal.changedetection.state.CacheBackedTaskHistoryRepository] Action implementations for task ':mergePythonLib': [_BuildScript_$_run_closure14$_closure47_b05467536180cbe863273fc60851167c@9212f560a9dfc097b0685cecb8daf8b2, org.gradle.api.tasks.Copy_Decorated@59d5e613deb5bb7f413476642a045e99]
18:22:53.967 [DEBUG] [org.gradle.api.internal.changedetection.state.CacheBackedTaskHistoryRepository] Fingerprinting property $1 (AbsolutePathInput) for task ':mergePythonLib'
18:22:54.013 [DEBUG] [org.gradle.api.internal.changedetection.state.CacheBackedTaskHistoryRepository] Fingerprinting property $2 (AbsolutePathInput) for task ':mergePythonLib'
18:22:54.162 [DEBUG] [org.gradle.api.internal.changedetection.state.CacheBackedTaskHistoryRepository] Fingerprinting property $3 (AbsolutePathInput) for task ':mergePythonLib'
18:22:54.163 [DEBUG] [org.gradle.api.internal.changedetection.state.CacheBackedTaskHistoryRepository] Fingerprinting property rootSpec$1 (RelativePathInput) for task ':mergePythonLib'
18:22:54.168 [DEBUG] [org.gradle.api.internal.changedetection.state.CacheBackedTaskHistoryRepository] Fingerprinting property destinationDir (Output) for task ':mergePythonLib'
18:22:54.168 [INFO] [org.gradle.api.internal.tasks.execution.SkipUpToDateTaskExecuter] Task ':mergePythonLib' is not up-to-date because:
  Output property 'destinationDir' file /home/jenkins/.jenkins/jobs/gluu-jython/workspace/build2/python/Lib has been removed.
  Output property 'destinationDir' file /home/jenkins/.jenkins/jobs/gluu-jython/workspace/build2/python/Lib/BaseHTTPServer.py has been removed.
  Output property 'destinationDir' file /home/jenkins/.jenkins/jobs/gluu-jython/workspace/build2/python/Lib/CGIHTTPServer.py has been removed.
18:22:54.168 [DEBUG] [org.gradle.api.internal.tasks.execution.OutputDirectoryCreatingTaskExecuter] Ensuring directory exists for property destinationDir (Output) at /home/jenkins/.jenkins/jobs/gluu-jython/workspace/build2/python/Lib
18:22:54.169 [DEBUG] [org.gradle.api.internal.tasks.execution.ExecuteActionsTaskExecuter] Executing actions for task ':mergePythonLib'.
18:22:54.170 [DEBUG] [org.gradle.internal.operations.DefaultBuildOperationExecutor] Build operation 'Execute doFirst {} action for :mergePythonLib' started
18:22:54.566 [DEBUG] [org.gradle.internal.operations.DefaultBuildOperationExecutor] Completing Build operation 'Execute doFirst {} action for :mergePythonLib'
18:22:54.567 [DEBUG] [org.gradle.internal.operations.DefaultBuildOperationExecutor] Build operation 'Execute doFirst {} action for :mergePythonLib' completed
18:22:54.567 [DEBUG] [org.gradle.internal.operations.DefaultBuildOperationExecutor] Build operation 'Execute copy for :mergePythonLib' started
18:22:54.762 [DEBUG] [org.gradle.internal.operations.DefaultBuildOperationExecutor] Completing Build operation 'Execute copy for :mergePythonLib'
18:22:54.762 [DEBUG] [org.gradle.internal.operations.DefaultBuildOperationExecutor] Build operation 'Execute copy for :mergePythonLib' completed
18:22:54.762 [DEBUG] [org.gradle.api.internal.changedetection.state.CacheBackedTaskHistoryRepository] Fingerprinting property destinationDir (Output) for task ':mergePythonLib'
18:22:55.151 [DEBUG] [org.gradle.api.internal.tasks.execution.ResolveTaskArtifactStateTaskExecuter] Removed task artifact state for {} from context.
18:22:55.151 [DEBUG] [org.gradle.api.internal.tasks.execution.ExecuteAtMostOnceTaskExecuter] Finished executing task ':mergePythonLib'
18:22:55.151 [DEBUG] [org.gradle.internal.operations.DefaultBuildOperationExecutor] Completing Build operation 'Task :mergePythonLib'
18:22:55.151 [DEBUG] [org.gradle.internal.operations.DefaultBuildOperationExecutor] Build operation 'Task :mergePythonLib' completed
18:22:55.151 [INFO] [org.gradle.execution.taskgraph.DefaultTaskPlanExecutor] :mergePythonLib (Thread[Task worker for ':',5,main]) completed. Took 1.207 secs.
18:22:55.151 [DEBUG] [org.gradle.internal.resources.AbstractTrackedResourceLock] Task worker for ':': released lock on :
18:22:55.152 [DEBUG] [org.gradle.internal.work.DefaultWorkerLeaseService] Worker lease root.1.2 completed (1 worker(s) in use)
18:22:55.152 [DEBUG] [org.gradle.internal.resources.AbstractTrackedResourceLock] Task worker for ':': released lock on root.1.2
18:22:55.152 [DEBUG] [org.gradle.internal.resources.AbstractTrackedResourceLock] Task worker for ':': acquired lock on :
18:22:55.152 [DEBUG] [org.gradle.internal.work.DefaultWorkerLeaseService] Worker lease root.1.2 started (1 worker(s) in use).
18:22:55.153 [DEBUG] [org.gradle.internal.resources.AbstractTrackedResourceLock] Task worker for ':': acquired lock on root.1.2
18:22:55.153 [INFO] [org.gradle.execution.taskgraph.DefaultTaskPlanExecutor] :copyLib (Thread[Task worker for ':',5,main]) started.
18:22:55.153 [LIFECYCLE] [class org.gradle.internal.buildevents.TaskExecutionLogger] 
18:22:55.153 [LIFECYCLE] [class org.gradle.internal.buildevents.TaskExecutionLogger] > Task :copyLib
18:22:55.153 [DEBUG] [org.gradle.internal.operations.DefaultBuildOperationExecutor] Build operation 'Task :copyLib' started
18:22:55.153 [DEBUG] [org.gradle.api.internal.tasks.execution.ExecuteAtMostOnceTaskExecuter] Starting to execute task ':copyLib'
18:22:55.153 [DEBUG] [org.gradle.api.internal.tasks.execution.ResolveTaskArtifactStateTaskExecuter] Putting task artifact state for task ':copyLib' into context took 0.0 secs.
18:22:55.154 [DEBUG] [org.gradle.api.internal.tasks.execution.SkipUpToDateTaskExecuter] Determining if task ':copyLib' is up-to-date
18:22:55.159 [DEBUG] [org.gradle.api.internal.changedetection.state.CacheBackedTaskHistoryRepository] Implementation for task ':copyLib': org.gradle.api.tasks.Copy_Decorated@59d5e613deb5bb7f413476642a045e99
18:22:55.159 [DEBUG] [org.gradle.api.internal.changedetection.state.CacheBackedTaskHistoryRepository] Action implementations for task ':copyLib': [org.gradle.api.tasks.Copy_Decorated@59d5e613deb5bb7f413476642a045e99]
18:22:55.160 [DEBUG] [org.gradle.api.internal.changedetection.state.CacheBackedTaskHistoryRepository] Fingerprinting property rootSpec$1 (RelativePathInput) for task ':copyLib'
18:22:55.163 [DEBUG] [org.gradle.api.internal.changedetection.state.CacheBackedTaskHistoryRepository] Fingerprinting property destinationDir (Output) for task ':copyLib'
18:22:55.163 [INFO] [org.gradle.api.internal.tasks.execution.SkipUpToDateTaskExecuter] Task ':copyLib' is not up-to-date because:
  Output property 'destinationDir' file /home/jenkins/.jenkins/jobs/gluu-jython/workspace/build2/resources/main/Lib has been removed.
  Output property 'destinationDir' file /home/jenkins/.jenkins/jobs/gluu-jython/workspace/build2/resources/main/Lib/BaseHTTPServer.py has been removed.
  Output property 'destinationDir' file /home/jenkins/.jenkins/jobs/gluu-jython/workspace/build2/resources/main/Lib/CGIHTTPServer.py has been removed.
18:22:55.163 [DEBUG] [org.gradle.api.internal.tasks.execution.OutputDirectoryCreatingTaskExecuter] Ensuring directory exists for property destinationDir (Output) at /home/jenkins/.jenkins/jobs/gluu-jython/workspace/build2/resources/main/Lib
18:22:55.164 [DEBUG] [org.gradle.api.internal.tasks.execution.ExecuteActionsTaskExecuter] Executing actions for task ':copyLib'.
18:22:55.164 [DEBUG] [org.gradle.internal.operations.DefaultBuildOperationExecutor] Build operation 'Execute copy for :copyLib' started
18:22:55.315 [DEBUG] [org.gradle.internal.operations.DefaultBuildOperationExecutor] Completing Build operation 'Execute copy for :copyLib'
18:22:55.315 [DEBUG] [org.gradle.internal.operations.DefaultBuildOperationExecutor] Build operation 'Execute copy for :copyLib' completed
18:22:55.315 [DEBUG] [org.gradle.api.internal.changedetection.state.CacheBackedTaskHistoryRepository] Fingerprinting property destinationDir (Output) for task ':copyLib'
18:22:55.451 [DEBUG] [org.gradle.api.internal.tasks.execution.ResolveTaskArtifactStateTaskExecuter] Removed task artifact state for {} from context.
18:22:55.451 [DEBUG] [org.gradle.api.internal.tasks.execution.ExecuteAtMostOnceTaskExecuter] Finished executing task ':copyLib'
18:22:55.451 [DEBUG] [org.gradle.internal.operations.DefaultBuildOperationExecutor] Completing Build operation 'Task :copyLib'
18:22:55.451 [DEBUG] [org.gradle.internal.operations.DefaultBuildOperationExecutor] Build operation 'Task :copyLib' completed
18:22:55.451 [INFO] [org.gradle.execution.taskgraph.DefaultTaskPlanExecutor] :copyLib (Thread[Task worker for ':',5,main]) completed. Took 0.298 secs.
18:22:55.451 [DEBUG] [org.gradle.internal.resources.AbstractTrackedResourceLock] Task worker for ':': released lock on :
18:22:55.452 [DEBUG] [org.gradle.internal.work.DefaultWorkerLeaseService] Worker lease root.1.2 completed (1 worker(s) in use)
18:22:55.452 [DEBUG] [org.gradle.internal.resources.AbstractTrackedResourceLock] Task worker for ':': released lock on root.1.2
18:22:55.452 [DEBUG] [org.gradle.internal.resources.AbstractTrackedResourceLock] Task worker for ':': acquired lock on :
18:22:55.453 [DEBUG] [org.gradle.internal.work.DefaultWorkerLeaseService] Worker lease root.1.2 started (1 worker(s) in use).
18:22:55.453 [DEBUG] [org.gradle.internal.resources.AbstractTrackedResourceLock] Task worker for ':': acquired lock on root.1.2
18:22:55.453 [INFO] [org.gradle.execution.taskgraph.DefaultTaskPlanExecutor] :generateVersionInfo (Thread[Task worker for ':',5,main]) started.
18:22:55.453 [LIFECYCLE] [class org.gradle.internal.buildevents.TaskExecutionLogger] 
18:22:55.453 [LIFECYCLE] [class org.gradle.internal.buildevents.TaskExecutionLogger] > Task :generateVersionInfo FAILED
18:22:55.453 [DEBUG] [org.gradle.internal.operations.DefaultBuildOperationExecutor] Build operation 'Task :generateVersionInfo' started
18:22:55.453 [DEBUG] [org.gradle.api.internal.tasks.execution.ExecuteAtMostOnceTaskExecuter] Starting to execute task ':generateVersionInfo'
18:22:55.454 [DEBUG] [org.gradle.api.internal.tasks.execution.ResolveTaskArtifactStateTaskExecuter] Putting task artifact state for task ':generateVersionInfo' into context took 0.0 secs.
18:22:55.456 [DEBUG] [org.gradle.api.internal.tasks.execution.SkipUpToDateTaskExecuter] Determining if task ':generateVersionInfo' is up-to-date
18:22:55.457 [DEBUG] [org.gradle.api.internal.changedetection.state.CacheBackedTaskHistoryRepository] Implementation for task ':generateVersionInfo': org.gradle.api.tasks.WriteProperties_Decorated@59d5e613deb5bb7f413476642a045e99
18:22:55.457 [DEBUG] [org.gradle.api.internal.changedetection.state.CacheBackedTaskHistoryRepository] Action implementations for task ':generateVersionInfo': [_BuildScript_$_run_closure12$_closure46_2b47fa5a465876b5d2202a13cde29ef4@9212f560a9dfc097b0685cecb8daf8b2, org.gradle.api.tasks.WriteProperties_Decorated@59d5e613deb5bb7f413476642a045e99]
18:22:55.457 [DEBUG] [org.gradle.api.internal.changedetection.state.CacheBackedTaskHistoryRepository] Fingerprinting property outputFile (Output) for task ':generateVersionInfo'
18:22:55.457 [INFO] [org.gradle.api.internal.tasks.execution.SkipUpToDateTaskExecuter] Task ':generateVersionInfo' is not up-to-date because:
  Task has failed previously.
18:22:55.458 [DEBUG] [org.gradle.api.internal.tasks.execution.OutputDirectoryCreatingTaskExecuter] Ensuring parent directory exists for property outputFile (Output) at /home/jenkins/.jenkins/jobs/gluu-jython/workspace/build2/resources/main/org/python/version.properties
18:22:55.458 [DEBUG] [org.gradle.api.internal.tasks.execution.ExecuteActionsTaskExecuter] Executing actions for task ':generateVersionInfo'.
18:22:55.458 [DEBUG] [org.gradle.internal.operations.DefaultBuildOperationExecutor] Build operation 'Execute doFirst {} action for :generateVersionInfo' started
18:22:55.530 [DEBUG] [org.gradle.internal.operations.DefaultBuildOperationExecutor] Completing Build operation 'Execute doFirst {} action for :generateVersionInfo'
18:22:55.530 [DEBUG] [org.gradle.internal.operations.DefaultBuildOperationExecutor] Build operation 'Execute doFirst {} action for :generateVersionInfo' completed
18:22:55.530 [DEBUG] [org.gradle.api.internal.changedetection.state.CacheBackedTaskHistoryRepository] Fingerprinting property outputFile (Output) for task ':generateVersionInfo'
18:22:55.530 [DEBUG] [org.gradle.api.internal.tasks.execution.ResolveTaskArtifactStateTaskExecuter] Removed task artifact state for {} from context.
18:22:55.530 [DEBUG] [org.gradle.api.internal.tasks.execution.ExecuteAtMostOnceTaskExecuter] Finished executing task ':generateVersionInfo'
18:22:55.531 [DEBUG] [org.gradle.internal.operations.DefaultBuildOperationExecutor] Completing Build operation 'Task :generateVersionInfo'
18:22:55.531 [DEBUG] [org.gradle.internal.operations.DefaultBuildOperationExecutor] Build operation 'Task :generateVersionInfo' completed
18:22:55.531 [INFO] [org.gradle.execution.taskgraph.DefaultTaskPlanExecutor] :generateVersionInfo (Thread[Task worker for ':',5,main]) completed. Took 0.078 secs.
18:22:55.532 [DEBUG] [org.gradle.internal.resources.AbstractTrackedResourceLock] Task worker for ':': released lock on :
18:22:55.532 [DEBUG] [org.gradle.internal.work.DefaultWorkerLeaseService] Worker lease root.1.2 completed (1 worker(s) in use)
18:22:55.532 [DEBUG] [org.gradle.internal.resources.AbstractTrackedResourceLock] Task worker for ':': released lock on root.1.2
18:22:55.532 [DEBUG] [org.gradle.execution.taskgraph.DefaultTaskPlanExecutor] Task worker [Thread[Task worker for ':',5,main]] finished, busy: 29.733 secs, idle: 0.029 secs
18:22:55.532 [DEBUG] [org.gradle.execution.taskgraph.DefaultTaskPlanExecutor] Task worker [Thread[Task worker for ':' Thread 2,5,main]] finished, busy: 0.0 secs, idle: 29.762 secs
18:22:55.534 [DEBUG] [org.gradle.execution.taskgraph.DefaultTaskPlanExecutor] Task worker [Thread[Daemon worker,5,main]] finished, busy: 0.0 secs, idle: 29.763 secs
18:22:55.535 [DEBUG] [org.gradle.execution.taskgraph.DefaultTaskPlanExecutor] Task worker [Thread[Task worker for ':' Thread 5,5,main]] finished, busy: 0.0 secs, idle: 29.762 secs
18:22:55.536 [DEBUG] [org.gradle.execution.taskgraph.DefaultTaskPlanExecutor] Task worker [Thread[Task worker for ':' Thread 3,5,main]] finished, busy: 0.0 secs, idle: 29.765 secs
18:22:55.537 [DEBUG] [org.gradle.execution.taskgraph.DefaultTaskPlanExecutor] Task worker [Thread[Task worker for ':' Thread 4,5,main]] finished, busy: 0.0 secs, idle: 29.766 secs
18:22:55.537 [DEBUG] [org.gradle.execution.taskgraph.DefaultTaskExecutionGraph] Timing: Executing the DAG took 29.78 secs
18:22:55.539 [DEBUG] [org.gradle.internal.operations.DefaultBuildOperationExecutor] Completing Build operation 'Run tasks'
18:22:55.539 [DEBUG] [org.gradle.internal.operations.DefaultBuildOperationExecutor] Build operation 'Run tasks' completed
18:22:55.550 [ERROR] [org.gradle.internal.buildevents.BuildExceptionReporter] 
18:22:55.550 [ERROR] [org.gradle.internal.buildevents.BuildExceptionReporter] FAILURE: Build failed with an exception.
18:22:55.550 [ERROR] [org.gradle.internal.buildevents.BuildExceptionReporter] 
18:22:55.550 [ERROR] [org.gradle.internal.buildevents.BuildExceptionReporter] * Where:
18:22:55.550 [ERROR] [org.gradle.internal.buildevents.BuildExceptionReporter] Build file '/home/jenkins/.jenkins/jobs/gluu-jython/workspace/build.gradle' line: 323
18:22:55.551 [ERROR] [org.gradle.internal.buildevents.BuildExceptionReporter] 
18:22:55.551 [ERROR] [org.gradle.internal.buildevents.BuildExceptionReporter] * What went wrong:
18:22:55.551 [ERROR] [org.gradle.internal.buildevents.BuildExceptionReporter] Execution failed for task ':generateVersionInfo'.
18:22:55.551 [ERROR] [org.gradle.internal.buildevents.BuildExceptionReporter] > Cannot split Mercurial output '' into 3
18:22:55.551 [ERROR] [org.gradle.internal.buildevents.BuildExceptionReporter] 
18:22:55.551 [ERROR] [org.gradle.internal.buildevents.BuildExceptionReporter] * Try:
18:22:55.551 [ERROR] [org.gradle.internal.buildevents.BuildExceptionReporter] Run with --stacktrace option to get the stack trace.  Run with --scan to get full insights.
18:22:55.552 [ERROR] [org.gradle.internal.buildevents.BuildExceptionReporter] 
18:22:55.552 [ERROR] [org.gradle.internal.buildevents.BuildExceptionReporter] * Get more help at https://help.gradle.org
18:22:55.552 [WARN] [org.gradle.internal.featurelifecycle.LoggingDeprecatedFeatureHandler] 
Deprecated Gradle features were used in this build, making it incompatible with Gradle 5.0.
Use '--warning-mode all' to show the individual deprecation warnings.
See https://docs.gradle.org/4.10.1/userguide/command_line_interface.html#sec:command_line_warnings
18:22:55.553 [ERROR] [org.gradle.internal.buildevents.BuildResultLogger] 
18:22:55.553 [ERROR] [org.gradle.internal.buildevents.BuildResultLogger] BUILD FAILED in 36s
18:22:55.553 [LIFECYCLE] [org.gradle.internal.buildevents.BuildResultLogger] 8 actionable tasks: 8 executed
18:22:55.554 [DEBUG] [org.gradle.internal.work.DefaultWorkerLeaseService] Worker lease root.1 completed (0 worker(s) in use)
18:22:55.554 [DEBUG] [org.gradle.internal.resources.AbstractTrackedResourceLock] Daemon worker: released lock on root.1
18:22:55.554 [DEBUG] [org.gradle.internal.operations.DefaultBuildOperationExecutor] Completing Build operation 'Run build'
18:22:55.554 [DEBUG] [org.gradle.internal.operations.DefaultBuildOperationExecutor] Build operation 'Run build' completed
18:22:55.564 [DEBUG] [org.gradle.cache.internal.LockOnDemandCrossProcessCacheAccess] Releasing file lock for file content cache (/home/jenkins/.jenkins/jobs/gluu-jython/workspace/.gradle/4.10.1/fileContent)
18:22:55.564 [DEBUG] [org.gradle.cache.internal.DefaultFileLockManager] Releasing lock on file content cache (/home/jenkins/.jenkins/jobs/gluu-jython/workspace/.gradle/4.10.1/fileContent).
18:22:55.566 [DEBUG] [org.gradle.cache.internal.LockOnDemandCrossProcessCacheAccess] Releasing file lock for task history cache (/home/jenkins/.jenkins/jobs/gluu-jython/workspace/.gradle/4.10.1/taskHistory)
18:22:55.568 [DEBUG] [org.gradle.cache.internal.btree.BTreePersistentIndexedCache] Closing cache taskHistory.bin (/home/jenkins/.jenkins/jobs/gluu-jython/workspace/.gradle/4.10.1/taskHistory/taskHistory.bin)
18:22:55.568 [DEBUG] [org.gradle.cache.internal.DefaultFileLockManager] Releasing lock on task history cache (/home/jenkins/.jenkins/jobs/gluu-jython/workspace/.gradle/4.10.1/taskHistory).
18:22:55.570 [DEBUG] [org.gradle.cache.internal.LockOnDemandCrossProcessCacheAccess] Releasing file lock for Build Output Cleanup Cache (/home/jenkins/.jenkins/jobs/gluu-jython/workspace/.gradle/buildOutputCleanup)
18:22:55.570 [DEBUG] [org.gradle.cache.internal.btree.BTreePersistentIndexedCache] Closing cache outputFiles.bin (/home/jenkins/.jenkins/jobs/gluu-jython/workspace/.gradle/buildOutputCleanup/outputFiles.bin)
18:22:55.570 [DEBUG] [org.gradle.cache.internal.DefaultFileLockManager] Releasing lock on Build Output Cleanup Cache (/home/jenkins/.jenkins/jobs/gluu-jython/workspace/.gradle/buildOutputCleanup).
18:22:55.572 [DEBUG] [org.gradle.cache.internal.LockOnDemandCrossProcessCacheAccess] Releasing file lock for Java compile cache (/home/jenkins/.jenkins/jobs/gluu-jython/workspace/.gradle/4.10.1/javaCompile)
18:22:55.572 [DEBUG] [org.gradle.cache.internal.btree.BTreePersistentIndexedCache] Closing cache taskHistory.bin (/home/jenkins/.jenkins/jobs/gluu-jython/workspace/.gradle/4.10.1/javaCompile/taskHistory.bin)
18:22:55.572 [DEBUG] [org.gradle.cache.internal.DefaultFileLockManager] Releasing lock on Java compile cache (/home/jenkins/.jenkins/jobs/gluu-jython/workspace/.gradle/4.10.1/javaCompile).
18:22:55.574 [DEBUG] [org.gradle.cache.internal.LockOnDemandCrossProcessCacheAccess] Releasing file lock for cache directory md-supplier (/home/jenkins/.gradle/caches/4.10.1/md-supplier)
18:22:55.575 [DEBUG] [org.gradle.cache.internal.DefaultFileLockManager] Releasing lock on cache directory md-supplier (/home/jenkins/.gradle/caches/4.10.1/md-supplier).
18:22:55.577 [DEBUG] [org.gradle.cache.internal.LockOnDemandCrossProcessCacheAccess] Releasing file lock for cache directory md-rule (/home/jenkins/.gradle/caches/4.10.1/md-rule)
18:22:55.577 [DEBUG] [org.gradle.cache.internal.DefaultFileLockManager] Releasing lock on cache directory md-rule (/home/jenkins/.gradle/caches/4.10.1/md-rule).
18:22:55.579 [DEBUG] [org.gradle.api.internal.artifacts.ivyservice.resolveengine.store.CachedStoreFactory] Resolution result cache closed. Cache reads: 0, disk reads: 0 (avg: 0.0 secs, total: 0.0 secs)
18:22:55.579 [DEBUG] [org.gradle.api.internal.artifacts.ivyservice.resolveengine.store.CachedStoreFactory] Resolution result cache closed. Cache reads: 0, disk reads: 0 (avg: 0.0 secs, total: 0.0 secs)
18:22:55.579 [DEBUG] [org.gradle.api.internal.artifacts.ivyservice.resolveengine.store.ResolutionResultsStoreFactory] Deleted 2 resolution results binary files in 0.001 secs
18:22:55.582 [DEBUG] [org.gradle.deployment.internal.DefaultDeploymentRegistry] Stopping 0 deployment handles
18:22:55.582 [DEBUG] [org.gradle.deployment.internal.DefaultDeploymentRegistry] Stopped deployment handles
18:22:55.583 [DEBUG] [org.gradle.cache.internal.LockOnDemandCrossProcessCacheAccess] Releasing file lock for file hash cache (/home/jenkins/.jenkins/jobs/gluu-jython/workspace/.gradle/4.10.1/fileHashes)
18:22:55.583 [DEBUG] [org.gradle.cache.internal.btree.BTreePersistentIndexedCache] Closing cache fileHashes.bin (/home/jenkins/.jenkins/jobs/gluu-jython/workspace/.gradle/4.10.1/fileHashes/fileHashes.bin)
18:22:55.583 [DEBUG] [org.gradle.cache.internal.DefaultFileLockManager] Releasing lock on file hash cache (/home/jenkins/.jenkins/jobs/gluu-jython/workspace/.gradle/4.10.1/fileHashes).
18:22:55.584 [DEBUG] [org.gradle.cache.internal.DefaultPersistentDirectoryStore] VCS Checkout Cache (/home/jenkins/.jenkins/jobs/gluu-jython/workspace/.gradle/vcs-1) has last been fully cleaned up 0 hours ago
18:22:55.584 [DEBUG] [org.gradle.cache.internal.DefaultCacheAccess] Cache VCS Checkout Cache (/home/jenkins/.jenkins/jobs/gluu-jython/workspace/.gradle/vcs-1) was closed 0 times.
18:22:55.584 [DEBUG] [org.gradle.cache.internal.DefaultCacheAccess] Cache VCS metadata (/home/jenkins/.jenkins/jobs/gluu-jython/workspace/.gradle/4.10.1/vcsMetadata-1) was closed 0 times.
18:22:55.597 [DEBUG] [org.gradle.launcher.daemon.server.exec.ExecuteBuild] The daemon has finished executing the build.
18:22:55.709 [DEBUG] [org.gradle.launcher.daemon.client.DaemonClient] Received result Failure[value=org.gradle.initialization.ReportedException: org.gradle.internal.exceptions.LocationAwareException: Build file '/home/jenkins/.jenkins/jobs/gluu-jython/workspace/build.gradle' line: 323
Execution failed for task ':generateVersionInfo'.] from daemon DaemonInfo{pid=31717, address=[158c7a32-43c4-47fc-b676-09f06429079a port:38317, addresses:[/0:0:0:0:0:0:0:1, /127.0.0.1]], state=Busy, lastBusy=1633112540851, context=DefaultDaemonContext[uid=d06d3762-ec09-4948-b681-0a71547ae967,javaHome=/usr/lib/jvm/java-1.8.0-openjdk-1.8.0.272.b10-1.el7_9.x86_64,daemonRegistryDir=/home/jenkins/.gradle/daemon,pid=31717,idleTimeout=10800000,daemonOpts=-XX:+HeapDumpOnOutOfMemoryError,-Xmx1024m,-Dfile.encoding=UTF-8,-Duser.country=US,-Duser.language=en,-Duser.variant]} (build should be done).
18:22:55.710 [DEBUG] [org.gradle.launcher.daemon.client.DaemonClientConnection] thread 1: dispatching class org.gradle.launcher.daemon.protocol.Finished
18:22:55.710 [DEBUG] [org.gradle.launcher.daemon.client.DaemonClientConnection] thread 1: connection stop
Build step 'Invoke Gradle script' changed build result to FAILURE
Build step 'Invoke Gradle script' marked build as failure
Sending e-mails to: support@gluu.org
ERROR: Couldn't connect to host, port: webmail.gluu.org, 465; timeout 60000
com.sun.mail.util.MailConnectException: Couldn't connect to host, port: webmail.gluu.org, 465; timeout 60000;
  nested exception is:
	java.net.SocketTimeoutException: connect timed out
	at com.sun.mail.smtp.SMTPTransport.openServer(SMTPTransport.java:2210)
	at com.sun.mail.smtp.SMTPTransport.protocolConnect(SMTPTransport.java:722)
	at javax.mail.Service.connect(Service.java:310)
	at javax.mail.Service.connect(Service.java:169)
	at javax.mail.Service.connect(Service.java:118)
	at javax.mail.Transport.send0(Transport.java:188)
	at javax.mail.Transport.send(Transport.java:118)
	at hudson.tasks.MailSender.run(MailSender.java:130)
	at hudson.tasks.Mailer.perform(Mailer.java:176)
	at hudson.tasks.Mailer.perform(Mailer.java:139)
	at hudson.tasks.BuildStepMonitor$1.perform(BuildStepMonitor.java:20)
	at hudson.model.AbstractBuild$AbstractBuildExecution.perform(AbstractBuild.java:741)
	at hudson.model.AbstractBuild$AbstractBuildExecution.performAllBuildSteps(AbstractBuild.java:690)
	at hudson.model.Build$BuildExecution.post2(Build.java:186)
	at hudson.model.AbstractBuild$AbstractBuildExecution.post(AbstractBuild.java:635)
	at hudson.model.Run.execute(Run.java:1905)
	at hudson.model.FreeStyleBuild.run(FreeStyleBuild.java:43)
	at hudson.model.ResourceController.execute(ResourceController.java:97)
	at hudson.model.Executor.run(Executor.java:428)
Caused by: java.net.SocketTimeoutException: connect timed out
	at java.net.PlainSocketImpl.socketConnect(Native Method)
	at java.net.AbstractPlainSocketImpl.doConnect(AbstractPlainSocketImpl.java:350)
	at java.net.AbstractPlainSocketImpl.connectToAddress(AbstractPlainSocketImpl.java:206)
	at java.net.AbstractPlainSocketImpl.connect(AbstractPlainSocketImpl.java:188)
	at java.net.SocksSocketImpl.connect(SocksSocketImpl.java:392)
	at java.net.Socket.connect(Socket.java:589)
	at com.sun.mail.util.SocketFetcher.createSocket(SocketFetcher.java:333)
	at com.sun.mail.util.SocketFetcher.getSocket(SocketFetcher.java:193)
	at com.sun.mail.smtp.SMTPTransport.openServer(SMTPTransport.java:2160)
	... 18 more
Finished: FAILURE