FailedConsole Output

Started by user Yuriy Movchan
Running as SYSTEM
Building on master in workspace /home/jenkins/.jenkins/jobs/gluu-jython/workspace
The recommended git tool is: NONE
No credentials specified
 > git rev-parse --is-inside-work-tree # timeout=10
Fetching changes from the remote Git repository
 > git config remote.origin.url https://github.com/GluuFederation/gluu-jython # timeout=10
Fetching upstream changes from https://github.com/GluuFederation/gluu-jython
 > git --version # timeout=10
 > git --version # 'git version 1.8.3.1'
 > git fetch --tags --progress https://github.com/GluuFederation/gluu-jython +refs/heads/*:refs/remotes/origin/* # timeout=10
 > git rev-parse refs/remotes/origin/v2.7.2.libs-update^{commit} # timeout=10
 > git rev-parse refs/remotes/origin/origin/v2.7.2.libs-update^{commit} # timeout=10
Checking out Revision 833dd1e94b6f9866622da66d243e5ebed5b10af7 (refs/remotes/origin/v2.7.2.libs-update)
 > git config core.sparsecheckout # timeout=10
 > git checkout -f 833dd1e94b6f9866622da66d243e5ebed5b10af7 # timeout=10
Commit message: "release 2.7.3"
 > git rev-list --no-walk 833dd1e94b6f9866622da66d243e5ebed5b10af7 # timeout=10
[Gradle] - Launching build.
[workspace] $ /home/jenkins/.jenkins/tools/hudson.plugins.gradle.GradleInstallation/gradle_4.10.1/bin/gradle clean build publishToMavenLocal
Starting a Gradle Daemon (subsequent builds will be faster)
> Task :clean UP-TO-DATE

> Task :generateGrammarSource
warning(105): Python.g:1287:15: no lexer rule corresponding to token: INDENT
warning(105): Python.g:1294:10: no lexer rule corresponding to token: DEDENT
warning(200): Python.g:2003:62: 
Decision can match input such as "COMMA" using multiple alternatives: 1, 2

As a result, alternative(s) 2 were disabled for that input
warning(200): Python.g:2447:37: 
Decision can match input such as "{'\t', ' '}" using multiple alternatives: 1, 2

As a result, alternative(s) 2 were disabled for that input
Semantic predicates were present but were hidden by actions.
warning(105): PythonPartial.g:577:33: no lexer rule corresponding to token: DEDENT
warning(105): PythonPartial.g:717:7: no lexer rule corresponding to token: TRAILBACKSLASH
warning(105): PythonPartial.g:576:18: no lexer rule corresponding to token: DEDENT
warning(105): PythonPartial.g:577:17: no lexer rule corresponding to token: INDENT
warning(105): PythonPartial.g:755:19: no lexer rule corresponding to token: TRAILBACKSLASH
warning(200): PythonPartial.g:265:7: 
Decision can match input such as "AT" using multiple alternatives: 1, 2

As a result, alternative(s) 2 were disabled for that input
warning(200): PythonPartial.g:830:42: 
Decision can match input such as "COMMA" using multiple alternatives: 1, 2

As a result, alternative(s) 2 were disabled for that input
warning(200): PythonPartial.g:1106:38: 
Decision can match input such as "'\\''\n'{'\t', ' '}'#''\\''\n'" using multiple alternatives: 1, 3

As a result, alternative(s) 3 were disabled for that input
warning(200): PythonPartial.g:1106:38: 
Decision can match input such as "'\\''\n'{'\t', ' '}'#''\\''\r''\n'" using multiple alternatives: 1, 3

As a result, alternative(s) 3 were disabled for that input
warning(200): PythonPartial.g:1107:40: 
Decision can match input such as "'\\''\n'{'\t', ' '}'#''\\''\n'" using multiple alternatives: 1, 3

As a result, alternative(s) 3 were disabled for that input
warning(200): PythonPartial.g:1107:40: 
Decision can match input such as "'\\''\n'{'\t', ' '}'#''\\''\r''\n'" using multiple alternatives: 1, 3

As a result, alternative(s) 3 were disabled for that input
warning(200): PythonPartial.g:1141:37: 
Decision can match input such as "{'\t', ' '}" using multiple alternatives: 1, 2

As a result, alternative(s) 2 were disabled for that input
Semantic predicates were present but were hidden by actions.

> Task :compileJava
warning: [options] bootstrap class path not set in conjunction with -source 1.7
Note: Some input files use unchecked or unsafe operations.
Note: Recompile with -Xlint:unchecked for details.
1 warning

> Task :expose
> Task :mergeExposed
> Task :mergePythonLib
> Task :copyLib
> Task :generateVersionInfo FAILED

FAILURE: Build failed with an exception.

* Where:
Build file '/home/jenkins/.jenkins/jobs/gluu-jython/workspace/build.gradle' line: 317

* What went wrong:
Execution failed for task ':generateVersionInfo'.
> java.io.IOException: Cannot run program "hg": error=2, No such file or directory

* Try:
Run with --stacktrace option to get the stack trace. Run with --info or --debug option to get more log output. Run with --scan to get full insights.

* Get more help at https://help.gradle.org

Deprecated Gradle features were used in this build, making it incompatible with Gradle 5.0.
Use '--warning-mode all' to show the individual deprecation warnings.
See https://docs.gradle.org/4.10.1/userguide/command_line_interface.html#sec:command_line_warnings

BUILD FAILED in 58s
8 actionable tasks: 7 executed, 1 up-to-date
Build step 'Invoke Gradle script' changed build result to FAILURE
Build step 'Invoke Gradle script' marked build as failure
Sending e-mails to: support@gluu.org
ERROR: Couldn't connect to host, port: webmail.gluu.org, 465; timeout 60000
com.sun.mail.util.MailConnectException: Couldn't connect to host, port: webmail.gluu.org, 465; timeout 60000;
  nested exception is:
	java.net.SocketTimeoutException: connect timed out
	at com.sun.mail.smtp.SMTPTransport.openServer(SMTPTransport.java:2210)
	at com.sun.mail.smtp.SMTPTransport.protocolConnect(SMTPTransport.java:722)
	at javax.mail.Service.connect(Service.java:310)
	at javax.mail.Service.connect(Service.java:169)
	at javax.mail.Service.connect(Service.java:118)
	at javax.mail.Transport.send0(Transport.java:188)
	at javax.mail.Transport.send(Transport.java:118)
	at hudson.tasks.MailSender.run(MailSender.java:130)
	at hudson.tasks.Mailer.perform(Mailer.java:176)
	at hudson.tasks.Mailer.perform(Mailer.java:139)
	at hudson.tasks.BuildStepMonitor$1.perform(BuildStepMonitor.java:20)
	at hudson.model.AbstractBuild$AbstractBuildExecution.perform(AbstractBuild.java:741)
	at hudson.model.AbstractBuild$AbstractBuildExecution.performAllBuildSteps(AbstractBuild.java:690)
	at hudson.model.Build$BuildExecution.post2(Build.java:186)
	at hudson.model.AbstractBuild$AbstractBuildExecution.post(AbstractBuild.java:635)
	at hudson.model.Run.execute(Run.java:1905)
	at hudson.model.FreeStyleBuild.run(FreeStyleBuild.java:43)
	at hudson.model.ResourceController.execute(ResourceController.java:97)
	at hudson.model.Executor.run(Executor.java:428)
Caused by: java.net.SocketTimeoutException: connect timed out
	at java.net.PlainSocketImpl.socketConnect(Native Method)
	at java.net.AbstractPlainSocketImpl.doConnect(AbstractPlainSocketImpl.java:350)
	at java.net.AbstractPlainSocketImpl.connectToAddress(AbstractPlainSocketImpl.java:206)
	at java.net.AbstractPlainSocketImpl.connect(AbstractPlainSocketImpl.java:188)
	at java.net.SocksSocketImpl.connect(SocksSocketImpl.java:392)
	at java.net.Socket.connect(Socket.java:589)
	at com.sun.mail.util.SocketFetcher.createSocket(SocketFetcher.java:333)
	at com.sun.mail.util.SocketFetcher.getSocket(SocketFetcher.java:193)
	at com.sun.mail.smtp.SMTPTransport.openServer(SMTPTransport.java:2160)
	... 18 more
Finished: FAILURE