FailedConsole Output

Started by user Yuriy Zabrovarnyy
Running as SYSTEM
Building on master in workspace /home/jenkins/.jenkins/jobs/_jans-orm_master/workspace
The recommended git tool is: NONE
No credentials specified
 > git rev-parse --is-inside-work-tree # timeout=10
Fetching changes from the remote Git repository
 > git config remote.origin.url https://github.com/JanssenProject/jans-orm # timeout=10
Fetching upstream changes from https://github.com/JanssenProject/jans-orm
 > git --version # timeout=10
 > git --version # 'git version 1.8.3.1'
 > git fetch --tags --progress https://github.com/JanssenProject/jans-orm +refs/heads/*:refs/remotes/origin/* # timeout=10
 > git rev-parse refs/remotes/origin/master^{commit} # timeout=10
 > git rev-parse refs/remotes/origin/origin/master^{commit} # timeout=10
Checking out Revision f6389d8574febf9ba36b04f9707a0a7e86870d6a (refs/remotes/origin/master)
 > git config core.sparsecheckout # timeout=10
 > git checkout -f f6389d8574febf9ba36b04f9707a0a7e86870d6a # timeout=10
Commit message: "Removed unused code."
 > git rev-list --no-walk bcd5b5fd82178a2d2789146b0ace4e1953eb8519 # timeout=10
[workspace] $ /home/jenkins/.jenkins/tools/hudson.tasks.Maven_MavenInstallation/maven_3.3.9/bin/mvn -DVERSION_NAME=master -DMAVEN_SKIP_TESTS=false -Dmaven.test.skip=false clean compile install
[INFO] Scanning for projects...
[INFO] ------------------------------------------------------------------------
[INFO] Reactor Build Order:
[INFO] 
[INFO] orm
[INFO] jans-orm-annotation
[INFO] jans-orm-util
[INFO] jans-orm-filter
[INFO] jans-orm-model
[INFO] jans-orm-core
[INFO] jans-orm-ldap
[INFO] jans-orm-couchbase
[INFO] Persistence CDI services
[INFO] jans-orm-hybrid
[INFO] Persistence standalone services
[INFO] jans-orm-ldapSample
[INFO] Persistence Couchbase sample
[INFO]                                                                         
[INFO] ------------------------------------------------------------------------
[INFO] Building orm 5.0.0-SNAPSHOT
[INFO] ------------------------------------------------------------------------
[INFO] 
[INFO] --- maven-clean-plugin:2.4.1:clean (default-clean) @ jans-orm-parent ---
[INFO] 
[INFO] --- maven-install-plugin:2.3.1:install (default-install) @ jans-orm-parent ---
[INFO] Installing /home/jenkins/.jenkins/jobs/_jans-orm_master/workspace/pom.xml to /var/www/html/maven/io/jans/jans-orm-parent/5.0.0-SNAPSHOT/jans-orm-parent-5.0.0-SNAPSHOT.pom
[INFO]                                                                         
[INFO] ------------------------------------------------------------------------
[INFO] Building jans-orm-annotation 5.0.0-SNAPSHOT
[INFO] ------------------------------------------------------------------------
[INFO] 
[INFO] --- maven-clean-plugin:2.4.1:clean (default-clean) @ jans-orm-annotation ---
[INFO] Deleting /home/jenkins/.jenkins/jobs/_jans-orm_master/workspace/annotation/target
[INFO] 
[INFO] --- maven-resources-plugin:2.4:resources (default-resources) @ jans-orm-annotation ---
[INFO] Using 'UTF-8' encoding to copy filtered resources.
[INFO] skip non existing resourceDirectory /home/jenkins/.jenkins/jobs/_jans-orm_master/workspace/annotation/src/main/resources
[INFO] 
[INFO] --- maven-compiler-plugin:2.3.2:compile (default-compile) @ jans-orm-annotation ---
[INFO] Compiling 11 source files to /home/jenkins/.jenkins/jobs/_jans-orm_master/workspace/annotation/target/classes
[INFO] 
[INFO] --- maven-resources-plugin:2.4:resources (default-resources) @ jans-orm-annotation ---
[INFO] Using 'UTF-8' encoding to copy filtered resources.
[INFO] skip non existing resourceDirectory /home/jenkins/.jenkins/jobs/_jans-orm_master/workspace/annotation/src/main/resources
[INFO] 
[INFO] --- maven-compiler-plugin:2.3.2:compile (default-compile) @ jans-orm-annotation ---
[INFO] Nothing to compile - all classes are up to date
[INFO] 
[INFO] --- maven-resources-plugin:2.4:testResources (default-testResources) @ jans-orm-annotation ---
[INFO] Using 'UTF-8' encoding to copy filtered resources.
[INFO] skip non existing resourceDirectory /home/jenkins/.jenkins/jobs/_jans-orm_master/workspace/annotation/src/test/resources
[INFO] 
[INFO] --- maven-compiler-plugin:2.3.2:testCompile (default-testCompile) @ jans-orm-annotation ---
[INFO] No sources to compile
[INFO] 
[INFO] --- maven-surefire-plugin:2.7.2:test (default-test) @ jans-orm-annotation ---
[INFO] No tests to run.
[INFO] Surefire report directory: /home/jenkins/.jenkins/jobs/_jans-orm_master/workspace/annotation/target/surefire-reports

-------------------------------------------------------
 T E S T S
-------------------------------------------------------
There are no tests to run.

Results :

Tests run: 0, Failures: 0, Errors: 0, Skipped: 0

[INFO] 
[INFO] --- maven-jar-plugin:2.4:jar (default-jar) @ jans-orm-annotation ---
[INFO] Building jar: /home/jenkins/.jenkins/jobs/_jans-orm_master/workspace/annotation/target/jans-orm-annotation-5.0.0-SNAPSHOT.jar
[INFO] 
[INFO] --- maven-install-plugin:2.3.1:install (default-install) @ jans-orm-annotation ---
[INFO] Installing /home/jenkins/.jenkins/jobs/_jans-orm_master/workspace/annotation/target/jans-orm-annotation-5.0.0-SNAPSHOT.jar to /var/www/html/maven/io/jans/jans-orm-annotation/5.0.0-SNAPSHOT/jans-orm-annotation-5.0.0-SNAPSHOT.jar
[INFO] Installing /home/jenkins/.jenkins/jobs/_jans-orm_master/workspace/annotation/pom.xml to /var/www/html/maven/io/jans/jans-orm-annotation/5.0.0-SNAPSHOT/jans-orm-annotation-5.0.0-SNAPSHOT.pom
[INFO]                                                                         
[INFO] ------------------------------------------------------------------------
[INFO] Building jans-orm-util 5.0.0-SNAPSHOT
[INFO] ------------------------------------------------------------------------
[INFO] 
[INFO] --- maven-clean-plugin:2.4.1:clean (default-clean) @ jans-orm-util ---
[INFO] Deleting /home/jenkins/.jenkins/jobs/_jans-orm_master/workspace/util/target
[INFO] 
[INFO] --- maven-resources-plugin:2.4:resources (default-resources) @ jans-orm-util ---
[INFO] Using 'UTF-8' encoding to copy filtered resources.
[INFO] skip non existing resourceDirectory /home/jenkins/.jenkins/jobs/_jans-orm_master/workspace/util/src/main/resources
[INFO] 
[INFO] --- maven-compiler-plugin:2.3.2:compile (default-compile) @ jans-orm-util ---
[INFO] Compiling 34 source files to /home/jenkins/.jenkins/jobs/_jans-orm_master/workspace/util/target/classes
[INFO] -------------------------------------------------------------
[ERROR] COMPILATION ERROR : 
[INFO] -------------------------------------------------------------
[ERROR] /home/jenkins/.jenkins/jobs/_jans-orm_master/workspace/util/src/main/java/io/jans/util/SelectableEntityHelper.java:[9,20] error: package io.jans.model does not exist
[ERROR] /home/jenkins/.jenkins/jobs/_jans-orm_master/workspace/util/src/main/java/io/jans/util/SelectableEntityHelper.java:[23,27] error: cannot find symbol
[ERROR]  class SelectableEntityHelper
/home/jenkins/.jenkins/jobs/_jans-orm_master/workspace/util/src/main/java/io/jans/util/SelectableEntityHelper.java:[33,53] error: cannot find symbol
[ERROR]  class SelectableEntityHelper
/home/jenkins/.jenkins/jobs/_jans-orm_master/workspace/util/src/main/java/io/jans/util/SelectableEntityHelper.java:[43,39] error: cannot find symbol
[INFO] 4 errors 
[INFO] -------------------------------------------------------------
[INFO] ------------------------------------------------------------------------
[INFO] Reactor Summary:
[INFO] 
[INFO] orm ................................................ SUCCESS [  0.270 s]
[INFO] jans-orm-annotation ................................ SUCCESS [  1.744 s]
[INFO] jans-orm-util ...................................... FAILURE [  1.260 s]
[INFO] jans-orm-filter .................................... SKIPPED
[INFO] jans-orm-model ..................................... SKIPPED
[INFO] jans-orm-core ...................................... SKIPPED
[INFO] jans-orm-ldap ...................................... SKIPPED
[INFO] jans-orm-couchbase ................................. SKIPPED
[INFO] Persistence CDI services ........................... SKIPPED
[INFO] jans-orm-hybrid .................................... SKIPPED
[INFO] Persistence standalone services .................... SKIPPED
[INFO] jans-orm-ldapSample ................................ SKIPPED
[INFO] Persistence Couchbase sample ....................... SKIPPED
[INFO] ------------------------------------------------------------------------
[INFO] BUILD FAILURE
[INFO] ------------------------------------------------------------------------
[INFO] Total time: 4.072 s
[INFO] Finished at: 2020-10-08T12:03:57+00:00
[INFO] Final Memory: 29M/311M
[INFO] ------------------------------------------------------------------------
[ERROR] Failed to execute goal org.apache.maven.plugins:maven-compiler-plugin:2.3.2:compile (default-compile) on project jans-orm-util: Compilation failure: Compilation failure:
[ERROR] /home/jenkins/.jenkins/jobs/_jans-orm_master/workspace/util/src/main/java/io/jans/util/SelectableEntityHelper.java:[9,20] error: package io.jans.model does not exist
[ERROR] /home/jenkins/.jenkins/jobs/_jans-orm_master/workspace/util/src/main/java/io/jans/util/SelectableEntityHelper.java:[23,27] error: cannot find symbol
[ERROR] class SelectableEntityHelper
[ERROR] /home/jenkins/.jenkins/jobs/_jans-orm_master/workspace/util/src/main/java/io/jans/util/SelectableEntityHelper.java:[33,53] error: cannot find symbol
[ERROR] class SelectableEntityHelper
[ERROR] /home/jenkins/.jenkins/jobs/_jans-orm_master/workspace/util/src/main/java/io/jans/util/SelectableEntityHelper.java:[43,39] error: cannot find symbol
[ERROR] -> [Help 1]
[ERROR] 
[ERROR] To see the full stack trace of the errors, re-run Maven with the -e switch.
[ERROR] Re-run Maven using the -X switch to enable full debug logging.
[ERROR] 
[ERROR] For more information about the errors and possible solutions, please read the following articles:
[ERROR] [Help 1] http://cwiki.apache.org/confluence/display/MAVEN/MojoFailureException
[ERROR] 
[ERROR] After correcting the problems, you can resume the build with the command
[ERROR]   mvn <goals> -rf :jans-orm-util
Build step 'Invoke top-level Maven targets' marked build as failure
[FINDBUGS] Skipping publisher since build result is FAILURE
TestNG Reports Processing: START
Looking for TestNG results report in workspace using pattern: **/testng-results.xml
testng-results.xml was last modified before this build started. Ignoring it.
testng-results.xml was last modified before this build started. Ignoring it.
testng-results.xml was last modified before this build started. Ignoring it.
testng-results.xml was last modified before this build started. Ignoring it.
testng-results.xml was last modified before this build started. Ignoring it.
testng-results.xml was last modified before this build started. Ignoring it.
Saving reports...
Found matching files but did not find any TestNG results.
Not sending mail to unregistered user yzabrovarniy@gmail.com
Sending e-mails to: support@gluu.org
Finished: FAILURE