FailedConsole Output

Started by an SCM change
Started by an SCM change
Running as SYSTEM
Building on master in workspace /home/jenkins/.jenkins/jobs/uma-rs/workspace
No JDK named ‘jdk_1.8.0_121’ found
No credentials specified
No JDK named ‘jdk_1.8.0_121’ found
 > git rev-parse --is-inside-work-tree # timeout=10
Fetching changes from the remote Git repository
 > git config remote.origin.url https://github.com/GluuFederation/uma-rs # timeout=10
Fetching upstream changes from https://github.com/GluuFederation/uma-rs
 > git --version # timeout=10
 > git fetch --tags --progress https://github.com/GluuFederation/uma-rs +refs/heads/*:refs/remotes/origin/* # timeout=10
 > git rev-parse refs/remotes/origin/master^{commit} # timeout=10
 > git rev-parse refs/remotes/origin/origin/master^{commit} # timeout=10
No JDK named ‘jdk_1.8.0_121’ found
Checking out Revision 47581bfe752a030ccfd872c672ff549c10a2035f (refs/remotes/origin/master)
 > git config core.sparsecheckout # timeout=10
 > git checkout -f 47581bfe752a030ccfd872c672ff549c10a2035f # timeout=10
Commit message: "Branch for version 4.3"
 > git rev-list --no-walk 9f27cd805204d8d3b5e42c9ed1be086aea189bbd # timeout=10
No JDK named ‘jdk_1.8.0_121’ found
[workspace] $ /home/jenkins/.jenkins/tools/hudson.tasks.Maven_MavenInstallation/maven_3.3.9/bin/mvn -DVERSION_NAME=master -DMAVEN_SKIP_TESTS=false -Dmaven.test.skip=false clean compile install
[INFO] Scanning for projects...
[WARNING] 
[WARNING] Some problems were encountered while building the effective model for org.gluu:uma-rs-core:jar:4.3.0-SNAPSHOT
[WARNING] 'build.plugins.plugin.(groupId:artifactId)' must be unique but found duplicate declaration of plugin org.apache.maven.plugins:maven-source-plugin @ line 89, column 21
[WARNING] 'repositories.repository.id' must not be 'local', this identifier is reserved for the local repository, using it for other repositories will corrupt your repository metadata. @ org.gluu:uma-rs:4.3.0-SNAPSHOT, /home/jenkins/.jenkins/jobs/uma-rs/workspace/pom.xml, line 167, column 17
[WARNING] 
[WARNING] Some problems were encountered while building the effective model for org.gluu:uma-rs-resteasy:jar:4.3.0-SNAPSHOT
[WARNING] 'build.plugins.plugin.(groupId:artifactId)' must be unique but found duplicate declaration of plugin org.apache.maven.plugins:maven-source-plugin @ line 64, column 21
[WARNING] 'repositories.repository.id' must not be 'local', this identifier is reserved for the local repository, using it for other repositories will corrupt your repository metadata. @ org.gluu:uma-rs:4.3.0-SNAPSHOT, /home/jenkins/.jenkins/jobs/uma-rs/workspace/pom.xml, line 167, column 17
[WARNING] 
[WARNING] Some problems were encountered while building the effective model for org.gluu:uma-rs:pom:4.3.0-SNAPSHOT
[WARNING] 'repositories.repository.id' must not be 'local', this identifier is reserved for the local repository, using it for other repositories will corrupt your repository metadata. @ line 167, column 17
[WARNING] 
[WARNING] It is highly recommended to fix these problems because they threaten the stability of your build.
[WARNING] 
[WARNING] For this reason, future Maven versions might no longer support building such malformed projects.
[WARNING] 
[INFO] ------------------------------------------------------------------------
[INFO] Reactor Build Order:
[INFO] 
[INFO] UMA RS
[INFO] UMA RS Core
[INFO] UMA RS Resteasy
[INFO]                                                                         
[INFO] ------------------------------------------------------------------------
[INFO] Building UMA RS 4.3.0-SNAPSHOT
[INFO] ------------------------------------------------------------------------
[INFO] 
[INFO] --- maven-clean-plugin:2.5:clean (default-clean) @ uma-rs ---
[INFO] 
[INFO] --- maven-jar-plugin:2.4:test-jar (default) @ uma-rs ---
[WARNING] JAR will be empty - no content was marked for inclusion!
[INFO] Building jar: /home/jenkins/.jenkins/jobs/uma-rs/workspace/target/uma-rs-4.3.0-SNAPSHOT-tests.jar
[INFO] 
[INFO] --- maven-install-plugin:2.3.1:install (default-install) @ uma-rs ---
[INFO] Installing /home/jenkins/.jenkins/jobs/uma-rs/workspace/pom.xml to /var/www/html/maven/org/gluu/uma-rs/4.3.0-SNAPSHOT/uma-rs-4.3.0-SNAPSHOT.pom
[INFO] Installing /home/jenkins/.jenkins/jobs/uma-rs/workspace/target/uma-rs-4.3.0-SNAPSHOT-tests.jar to /var/www/html/maven/org/gluu/uma-rs/4.3.0-SNAPSHOT/uma-rs-4.3.0-SNAPSHOT-tests.jar
[INFO]                                                                         
[INFO] ------------------------------------------------------------------------
[INFO] Building UMA RS Core 4.3.0-SNAPSHOT
[INFO] ------------------------------------------------------------------------
Downloading: http://repo2.maven.org/maven2/org/bouncycastle/org/gluu/oxauth-model/4.3.0-SNAPSHOT/maven-metadata.xml
Downloading: http://repo1.maven.org/maven2/org/gluu/oxauth-model/4.3.0-SNAPSHOT/maven-metadata.xml


[WARNING] Could not transfer metadata org.gluu:oxauth-model:4.3.0-SNAPSHOT/maven-metadata.xml from/to central (http://repo1.maven.org/maven2): Failed to transfer file: http://repo1.maven.org/maven2/org/gluu/oxauth-model/4.3.0-SNAPSHOT/maven-metadata.xml. Return code is: 501 , ReasonPhrase:HTTPS Required.
[WARNING] Could not transfer metadata org.gluu:oxauth-model:4.3.0-SNAPSHOT/maven-metadata.xml from/to bouncycastle (http://repo2.maven.org/maven2/org/bouncycastle): repo2.maven.org: Name or service not known
[WARNING] Failure to transfer org.gluu:oxauth-model:4.3.0-SNAPSHOT/maven-metadata.xml from http://repo1.maven.org/maven2 was cached in the local repository, resolution will not be reattempted until the update interval of central has elapsed or updates are forced. Original error: Could not transfer metadata org.gluu:oxauth-model:4.3.0-SNAPSHOT/maven-metadata.xml from/to central (http://repo1.maven.org/maven2): Failed to transfer file: http://repo1.maven.org/maven2/org/gluu/oxauth-model/4.3.0-SNAPSHOT/maven-metadata.xml. Return code is: 501 , ReasonPhrase:HTTPS Required.
[WARNING] Failure to transfer org.gluu:oxauth-model:4.3.0-SNAPSHOT/maven-metadata.xml from http://repo2.maven.org/maven2/org/bouncycastle was cached in the local repository, resolution will not be reattempted until the update interval of bouncycastle has elapsed or updates are forced. Original error: Could not transfer metadata org.gluu:oxauth-model:4.3.0-SNAPSHOT/maven-metadata.xml from/to bouncycastle (http://repo2.maven.org/maven2/org/bouncycastle): repo2.maven.org: Name or service not known
Downloading: http://repo1.maven.org/maven2/org/gluu/oxauth-model/4.3.0-SNAPSHOT/oxauth-model-4.3.0-SNAPSHOT.pom

Downloading: http://repo2.maven.org/maven2/org/bouncycastle/org/gluu/oxauth-model/4.3.0-SNAPSHOT/oxauth-model-4.3.0-SNAPSHOT.pom

Downloading: file:///home/jenkins/.jenkins/jobs/uma-rs/workspace/uma-rs-core/../oxd-repo/org/gluu/oxauth-model/4.3.0-SNAPSHOT/oxauth-model-4.3.0-SNAPSHOT.pom

[INFO] ------------------------------------------------------------------------
[INFO] Reactor Summary:
[INFO] 
[INFO] UMA RS ............................................. SUCCESS [  0.897 s]
[INFO] UMA RS Core ........................................ FAILURE [  1.254 s]
[INFO] UMA RS Resteasy .................................... SKIPPED
[INFO] ------------------------------------------------------------------------
[INFO] BUILD FAILURE
[INFO] ------------------------------------------------------------------------
[INFO] Total time: 2.742 s
[INFO] Finished at: 2020-07-13T18:27:24+00:00
[INFO] Final Memory: 13M/299M
[INFO] ------------------------------------------------------------------------
[ERROR] Failed to execute goal on project uma-rs-core: Could not resolve dependencies for project org.gluu:uma-rs-core:jar:4.3.0-SNAPSHOT: Failed to collect dependencies at org.gluu:oxauth-model:jar:4.3.0-SNAPSHOT: Failed to read artifact descriptor for org.gluu:oxauth-model:jar:4.3.0-SNAPSHOT: Could not transfer artifact org.gluu:oxauth-model:pom:4.3.0-SNAPSHOT from/to central (http://repo1.maven.org/maven2): Failed to transfer file: http://repo1.maven.org/maven2/org/gluu/oxauth-model/4.3.0-SNAPSHOT/oxauth-model-4.3.0-SNAPSHOT.pom. Return code is: 501 , ReasonPhrase:HTTPS Required. -> [Help 1]
[ERROR] 
[ERROR] To see the full stack trace of the errors, re-run Maven with the -e switch.
[ERROR] Re-run Maven using the -X switch to enable full debug logging.
[ERROR] 
[ERROR] For more information about the errors and possible solutions, please read the following articles:
[ERROR] [Help 1] http://cwiki.apache.org/confluence/display/MAVEN/DependencyResolutionException
[ERROR] 
[ERROR] After correcting the problems, you can resume the build with the command
[ERROR]   mvn <goals> -rf :uma-rs-core
Build step 'Invoke top-level Maven targets' marked build as failure
[FINDBUGS] Skipping publisher since build result is FAILURE
No JDK named ‘jdk_1.8.0_121’ found
TestNG Reports Processing: START
Looking for TestNG results report in workspace using pattern: **/testng-results.xml
Did not find any matching files.
No JDK named ‘jdk_1.8.0_121’ found
Not sending mail to unregistered user Yuriy.Movchan@gmail.com
Sending e-mails to: support@gluu.org
Finished: FAILURE