FailedConsole Output

Started by an SCM change
Running as SYSTEM
Building on master in workspace /home/jenkins/.jenkins/jobs/shib-oxauth-authn3/workspace
The recommended git tool is: NONE
No credentials specified
 > git rev-parse --is-inside-work-tree # timeout=10
Fetching changes from the remote Git repository
 > git config remote.origin.url https://github.com/GluuFederation/shib-oxauth-authn3 # timeout=10
Fetching upstream changes from https://github.com/GluuFederation/shib-oxauth-authn3
 > git --version # timeout=10
 > git --version # 'git version 1.8.3.1'
 > git fetch --tags --progress https://github.com/GluuFederation/shib-oxauth-authn3 +refs/heads/*:refs/remotes/origin/* # timeout=10
 > git rev-parse refs/remotes/origin/master^{commit} # timeout=10
 > git rev-parse refs/remotes/origin/origin/master^{commit} # timeout=10
Checking out Revision 91e7592a3fd41ebe069a6f9cd81e1355df6f23bf (refs/remotes/origin/master)
 > git config core.sparsecheckout # timeout=10
 > git checkout -f 91e7592a3fd41ebe069a6f9cd81e1355df6f23bf # timeout=10
Commit message: "Version 4.3.0 (#11)"
 > git rev-list --no-walk bcd2ab99b07ff3f7353fdc2429e4437d1a71787e # timeout=10
[Gradle] - Launching build.
[workspace] $ /home/jenkins/.jenkins/tools/hudson.plugins.gradle.GradleInstallation/gradle_4.10.1/bin/gradle clean build install publishToMavenLocal
Starting a Gradle Daemon (subsequent builds will be faster)
> Task :clean
> Task :compileJava FAILED

FAILURE: Build failed with an exception.

* What went wrong:
Could not resolve all files for configuration ':compileClasspath'.
> Could not find org.gluu:oxauth-client:4.3.1-SNAPSHOT.
  Searched in the following locations:
    - file:/var/www/html/maven/org/gluu/oxauth-client/4.3.1-SNAPSHOT/maven-metadata.xml
    - file:/var/www/html/maven/org/gluu/oxauth-client/4.3.1-SNAPSHOT/oxauth-client-4.3.1-SNAPSHOT.pom
    - file:/var/www/html/maven/org/gluu/oxauth-client/4.3.1-SNAPSHOT/oxauth-client-4.3.1-SNAPSHOT.jar
    - https://repo.maven.apache.org/maven2/org/gluu/oxauth-client/4.3.1-SNAPSHOT/maven-metadata.xml
    - https://repo.maven.apache.org/maven2/org/gluu/oxauth-client/4.3.1-SNAPSHOT/oxauth-client-4.3.1-SNAPSHOT.pom
    - https://repo.maven.apache.org/maven2/org/gluu/oxauth-client/4.3.1-SNAPSHOT/oxauth-client-4.3.1-SNAPSHOT.jar
    - https://build.shibboleth.net/nexus/content/repositories/releases/org/gluu/oxauth-client/4.3.1-SNAPSHOT/maven-metadata.xml
    - https://build.shibboleth.net/nexus/content/repositories/releases/org/gluu/oxauth-client/4.3.1-SNAPSHOT/oxauth-client-4.3.1-SNAPSHOT.pom
    - https://build.shibboleth.net/nexus/content/repositories/releases/org/gluu/oxauth-client/4.3.1-SNAPSHOT/oxauth-client-4.3.1-SNAPSHOT.jar
    - https://build.shibboleth.net/nexus/content/repositories/thirdparty/org/gluu/oxauth-client/4.3.1-SNAPSHOT/maven-metadata.xml
    - https://build.shibboleth.net/nexus/content/repositories/thirdparty/org/gluu/oxauth-client/4.3.1-SNAPSHOT/oxauth-client-4.3.1-SNAPSHOT.pom
    - https://build.shibboleth.net/nexus/content/repositories/thirdparty/org/gluu/oxauth-client/4.3.1-SNAPSHOT/oxauth-client-4.3.1-SNAPSHOT.jar
    - https://ox.gluu.org/maven/org/gluu/oxauth-client/4.3.1-SNAPSHOT/maven-metadata.xml
    - https://ox.gluu.org/maven/org/gluu/oxauth-client/4.3.1-SNAPSHOT/oxauth-client-4.3.1-SNAPSHOT.pom
    - https://ox.gluu.org/maven/org/gluu/oxauth-client/4.3.1-SNAPSHOT/oxauth-client-4.3.1-SNAPSHOT.jar
  Required by:
      project :
> Could not find org.gluu:oxtrust-openid-auth-client:4.3.1-SNAPSHOT.
  Searched in the following locations:
    - file:/var/www/html/maven/org/gluu/oxtrust-openid-auth-client/4.3.1-SNAPSHOT/maven-metadata.xml
    - file:/var/www/html/maven/org/gluu/oxtrust-openid-auth-client/4.3.1-SNAPSHOT/oxtrust-openid-auth-client-4.3.1-SNAPSHOT.pom
    - file:/var/www/html/maven/org/gluu/oxtrust-openid-auth-client/4.3.1-SNAPSHOT/oxtrust-openid-auth-client-4.3.1-SNAPSHOT.jar
    - https://repo.maven.apache.org/maven2/org/gluu/oxtrust-openid-auth-client/4.3.1-SNAPSHOT/maven-metadata.xml
    - https://repo.maven.apache.org/maven2/org/gluu/oxtrust-openid-auth-client/4.3.1-SNAPSHOT/oxtrust-openid-auth-client-4.3.1-SNAPSHOT.pom
    - https://repo.maven.apache.org/maven2/org/gluu/oxtrust-openid-auth-client/4.3.1-SNAPSHOT/oxtrust-openid-auth-client-4.3.1-SNAPSHOT.jar
    - https://build.shibboleth.net/nexus/content/repositories/releases/org/gluu/oxtrust-openid-auth-client/4.3.1-SNAPSHOT/maven-metadata.xml
    - https://build.shibboleth.net/nexus/content/repositories/releases/org/gluu/oxtrust-openid-auth-client/4.3.1-SNAPSHOT/oxtrust-openid-auth-client-4.3.1-SNAPSHOT.pom
    - https://build.shibboleth.net/nexus/content/repositories/releases/org/gluu/oxtrust-openid-auth-client/4.3.1-SNAPSHOT/oxtrust-openid-auth-client-4.3.1-SNAPSHOT.jar
    - https://build.shibboleth.net/nexus/content/repositories/thirdparty/org/gluu/oxtrust-openid-auth-client/4.3.1-SNAPSHOT/maven-metadata.xml
    - https://build.shibboleth.net/nexus/content/repositories/thirdparty/org/gluu/oxtrust-openid-auth-client/4.3.1-SNAPSHOT/oxtrust-openid-auth-client-4.3.1-SNAPSHOT.pom
    - https://build.shibboleth.net/nexus/content/repositories/thirdparty/org/gluu/oxtrust-openid-auth-client/4.3.1-SNAPSHOT/oxtrust-openid-auth-client-4.3.1-SNAPSHOT.jar
    - https://ox.gluu.org/maven/org/gluu/oxtrust-openid-auth-client/4.3.1-SNAPSHOT/maven-metadata.xml
    - https://ox.gluu.org/maven/org/gluu/oxtrust-openid-auth-client/4.3.1-SNAPSHOT/oxtrust-openid-auth-client-4.3.1-SNAPSHOT.pom
    - https://ox.gluu.org/maven/org/gluu/oxtrust-openid-auth-client/4.3.1-SNAPSHOT/oxtrust-openid-auth-client-4.3.1-SNAPSHOT.jar
  Required by:
      project :
> Could not find org.gluu:oxcore-util:4.3.1-SNAPSHOT.
  Searched in the following locations:
    - file:/var/www/html/maven/org/gluu/oxcore-util/4.3.1-SNAPSHOT/maven-metadata.xml
    - file:/var/www/html/maven/org/gluu/oxcore-util/4.3.1-SNAPSHOT/oxcore-util-4.3.1-SNAPSHOT.pom
    - file:/var/www/html/maven/org/gluu/oxcore-util/4.3.1-SNAPSHOT/oxcore-util-4.3.1-SNAPSHOT.jar
    - https://repo.maven.apache.org/maven2/org/gluu/oxcore-util/4.3.1-SNAPSHOT/maven-metadata.xml
    - https://repo.maven.apache.org/maven2/org/gluu/oxcore-util/4.3.1-SNAPSHOT/oxcore-util-4.3.1-SNAPSHOT.pom
    - https://repo.maven.apache.org/maven2/org/gluu/oxcore-util/4.3.1-SNAPSHOT/oxcore-util-4.3.1-SNAPSHOT.jar
    - https://build.shibboleth.net/nexus/content/repositories/releases/org/gluu/oxcore-util/4.3.1-SNAPSHOT/maven-metadata.xml
    - https://build.shibboleth.net/nexus/content/repositories/releases/org/gluu/oxcore-util/4.3.1-SNAPSHOT/oxcore-util-4.3.1-SNAPSHOT.pom
    - https://build.shibboleth.net/nexus/content/repositories/releases/org/gluu/oxcore-util/4.3.1-SNAPSHOT/oxcore-util-4.3.1-SNAPSHOT.jar
    - https://build.shibboleth.net/nexus/content/repositories/thirdparty/org/gluu/oxcore-util/4.3.1-SNAPSHOT/maven-metadata.xml
    - https://build.shibboleth.net/nexus/content/repositories/thirdparty/org/gluu/oxcore-util/4.3.1-SNAPSHOT/oxcore-util-4.3.1-SNAPSHOT.pom
    - https://build.shibboleth.net/nexus/content/repositories/thirdparty/org/gluu/oxcore-util/4.3.1-SNAPSHOT/oxcore-util-4.3.1-SNAPSHOT.jar
    - https://ox.gluu.org/maven/org/gluu/oxcore-util/4.3.1-SNAPSHOT/maven-metadata.xml
    - https://ox.gluu.org/maven/org/gluu/oxcore-util/4.3.1-SNAPSHOT/oxcore-util-4.3.1-SNAPSHOT.pom
    - https://ox.gluu.org/maven/org/gluu/oxcore-util/4.3.1-SNAPSHOT/oxcore-util-4.3.1-SNAPSHOT.jar
  Required by:
      project :
> Could not find org.gluu:gluu-orm-ldap:4.3.1-SNAPSHOT.
  Searched in the following locations:
    - file:/var/www/html/maven/org/gluu/gluu-orm-ldap/4.3.1-SNAPSHOT/maven-metadata.xml
    - file:/var/www/html/maven/org/gluu/gluu-orm-ldap/4.3.1-SNAPSHOT/gluu-orm-ldap-4.3.1-SNAPSHOT.pom
    - file:/var/www/html/maven/org/gluu/gluu-orm-ldap/4.3.1-SNAPSHOT/gluu-orm-ldap-4.3.1-SNAPSHOT.jar
    - https://repo.maven.apache.org/maven2/org/gluu/gluu-orm-ldap/4.3.1-SNAPSHOT/maven-metadata.xml
    - https://repo.maven.apache.org/maven2/org/gluu/gluu-orm-ldap/4.3.1-SNAPSHOT/gluu-orm-ldap-4.3.1-SNAPSHOT.pom
    - https://repo.maven.apache.org/maven2/org/gluu/gluu-orm-ldap/4.3.1-SNAPSHOT/gluu-orm-ldap-4.3.1-SNAPSHOT.jar
    - https://build.shibboleth.net/nexus/content/repositories/releases/org/gluu/gluu-orm-ldap/4.3.1-SNAPSHOT/maven-metadata.xml
    - https://build.shibboleth.net/nexus/content/repositories/releases/org/gluu/gluu-orm-ldap/4.3.1-SNAPSHOT/gluu-orm-ldap-4.3.1-SNAPSHOT.pom
    - https://build.shibboleth.net/nexus/content/repositories/releases/org/gluu/gluu-orm-ldap/4.3.1-SNAPSHOT/gluu-orm-ldap-4.3.1-SNAPSHOT.jar
    - https://build.shibboleth.net/nexus/content/repositories/thirdparty/org/gluu/gluu-orm-ldap/4.3.1-SNAPSHOT/maven-metadata.xml
    - https://build.shibboleth.net/nexus/content/repositories/thirdparty/org/gluu/gluu-orm-ldap/4.3.1-SNAPSHOT/gluu-orm-ldap-4.3.1-SNAPSHOT.pom
    - https://build.shibboleth.net/nexus/content/repositories/thirdparty/org/gluu/gluu-orm-ldap/4.3.1-SNAPSHOT/gluu-orm-ldap-4.3.1-SNAPSHOT.jar
    - https://ox.gluu.org/maven/org/gluu/gluu-orm-ldap/4.3.1-SNAPSHOT/maven-metadata.xml
    - https://ox.gluu.org/maven/org/gluu/gluu-orm-ldap/4.3.1-SNAPSHOT/gluu-orm-ldap-4.3.1-SNAPSHOT.pom
    - https://ox.gluu.org/maven/org/gluu/gluu-orm-ldap/4.3.1-SNAPSHOT/gluu-orm-ldap-4.3.1-SNAPSHOT.jar
  Required by:
      project :
> Could not find org.gluu:oxcore-standalone:4.3.1-SNAPSHOT.
  Searched in the following locations:
    - file:/var/www/html/maven/org/gluu/oxcore-standalone/4.3.1-SNAPSHOT/maven-metadata.xml
    - file:/var/www/html/maven/org/gluu/oxcore-standalone/4.3.1-SNAPSHOT/oxcore-standalone-4.3.1-SNAPSHOT.pom
    - file:/var/www/html/maven/org/gluu/oxcore-standalone/4.3.1-SNAPSHOT/oxcore-standalone-4.3.1-SNAPSHOT.jar
    - https://repo.maven.apache.org/maven2/org/gluu/oxcore-standalone/4.3.1-SNAPSHOT/maven-metadata.xml
    - https://repo.maven.apache.org/maven2/org/gluu/oxcore-standalone/4.3.1-SNAPSHOT/oxcore-standalone-4.3.1-SNAPSHOT.pom
    - https://repo.maven.apache.org/maven2/org/gluu/oxcore-standalone/4.3.1-SNAPSHOT/oxcore-standalone-4.3.1-SNAPSHOT.jar
    - https://build.shibboleth.net/nexus/content/repositories/releases/org/gluu/oxcore-standalone/4.3.1-SNAPSHOT/maven-metadata.xml
    - https://build.shibboleth.net/nexus/content/repositories/releases/org/gluu/oxcore-standalone/4.3.1-SNAPSHOT/oxcore-standalone-4.3.1-SNAPSHOT.pom
    - https://build.shibboleth.net/nexus/content/repositories/releases/org/gluu/oxcore-standalone/4.3.1-SNAPSHOT/oxcore-standalone-4.3.1-SNAPSHOT.jar
    - https://build.shibboleth.net/nexus/content/repositories/thirdparty/org/gluu/oxcore-standalone/4.3.1-SNAPSHOT/maven-metadata.xml
    - https://build.shibboleth.net/nexus/content/repositories/thirdparty/org/gluu/oxcore-standalone/4.3.1-SNAPSHOT/oxcore-standalone-4.3.1-SNAPSHOT.pom
    - https://build.shibboleth.net/nexus/content/repositories/thirdparty/org/gluu/oxcore-standalone/4.3.1-SNAPSHOT/oxcore-standalone-4.3.1-SNAPSHOT.jar
    - https://ox.gluu.org/maven/org/gluu/oxcore-standalone/4.3.1-SNAPSHOT/maven-metadata.xml
    - https://ox.gluu.org/maven/org/gluu/oxcore-standalone/4.3.1-SNAPSHOT/oxcore-standalone-4.3.1-SNAPSHOT.pom
    - https://ox.gluu.org/maven/org/gluu/oxcore-standalone/4.3.1-SNAPSHOT/oxcore-standalone-4.3.1-SNAPSHOT.jar
  Required by:
      project :
> Could not find org.gluu:oxcore-cache:4.3.1-SNAPSHOT.
  Searched in the following locations:
    - file:/var/www/html/maven/org/gluu/oxcore-cache/4.3.1-SNAPSHOT/maven-metadata.xml
    - file:/var/www/html/maven/org/gluu/oxcore-cache/4.3.1-SNAPSHOT/oxcore-cache-4.3.1-SNAPSHOT.pom
    - file:/var/www/html/maven/org/gluu/oxcore-cache/4.3.1-SNAPSHOT/oxcore-cache-4.3.1-SNAPSHOT.jar
    - https://repo.maven.apache.org/maven2/org/gluu/oxcore-cache/4.3.1-SNAPSHOT/maven-metadata.xml
    - https://repo.maven.apache.org/maven2/org/gluu/oxcore-cache/4.3.1-SNAPSHOT/oxcore-cache-4.3.1-SNAPSHOT.pom
    - https://repo.maven.apache.org/maven2/org/gluu/oxcore-cache/4.3.1-SNAPSHOT/oxcore-cache-4.3.1-SNAPSHOT.jar
    - https://build.shibboleth.net/nexus/content/repositories/releases/org/gluu/oxcore-cache/4.3.1-SNAPSHOT/maven-metadata.xml
    - https://build.shibboleth.net/nexus/content/repositories/releases/org/gluu/oxcore-cache/4.3.1-SNAPSHOT/oxcore-cache-4.3.1-SNAPSHOT.pom
    - https://build.shibboleth.net/nexus/content/repositories/releases/org/gluu/oxcore-cache/4.3.1-SNAPSHOT/oxcore-cache-4.3.1-SNAPSHOT.jar
    - https://build.shibboleth.net/nexus/content/repositories/thirdparty/org/gluu/oxcore-cache/4.3.1-SNAPSHOT/maven-metadata.xml
    - https://build.shibboleth.net/nexus/content/repositories/thirdparty/org/gluu/oxcore-cache/4.3.1-SNAPSHOT/oxcore-cache-4.3.1-SNAPSHOT.pom
    - https://build.shibboleth.net/nexus/content/repositories/thirdparty/org/gluu/oxcore-cache/4.3.1-SNAPSHOT/oxcore-cache-4.3.1-SNAPSHOT.jar
    - https://ox.gluu.org/maven/org/gluu/oxcore-cache/4.3.1-SNAPSHOT/maven-metadata.xml
    - https://ox.gluu.org/maven/org/gluu/oxcore-cache/4.3.1-SNAPSHOT/oxcore-cache-4.3.1-SNAPSHOT.pom
    - https://ox.gluu.org/maven/org/gluu/oxcore-cache/4.3.1-SNAPSHOT/oxcore-cache-4.3.1-SNAPSHOT.jar
  Required by:
      project :
> Could not find org.gluu:oxcore-script:4.3.1-SNAPSHOT.
  Searched in the following locations:
    - file:/var/www/html/maven/org/gluu/oxcore-script/4.3.1-SNAPSHOT/maven-metadata.xml
    - file:/var/www/html/maven/org/gluu/oxcore-script/4.3.1-SNAPSHOT/oxcore-script-4.3.1-SNAPSHOT.pom
    - file:/var/www/html/maven/org/gluu/oxcore-script/4.3.1-SNAPSHOT/oxcore-script-4.3.1-SNAPSHOT.jar
    - https://repo.maven.apache.org/maven2/org/gluu/oxcore-script/4.3.1-SNAPSHOT/maven-metadata.xml
    - https://repo.maven.apache.org/maven2/org/gluu/oxcore-script/4.3.1-SNAPSHOT/oxcore-script-4.3.1-SNAPSHOT.pom
    - https://repo.maven.apache.org/maven2/org/gluu/oxcore-script/4.3.1-SNAPSHOT/oxcore-script-4.3.1-SNAPSHOT.jar
    - https://build.shibboleth.net/nexus/content/repositories/releases/org/gluu/oxcore-script/4.3.1-SNAPSHOT/maven-metadata.xml
    - https://build.shibboleth.net/nexus/content/repositories/releases/org/gluu/oxcore-script/4.3.1-SNAPSHOT/oxcore-script-4.3.1-SNAPSHOT.pom
    - https://build.shibboleth.net/nexus/content/repositories/releases/org/gluu/oxcore-script/4.3.1-SNAPSHOT/oxcore-script-4.3.1-SNAPSHOT.jar
    - https://build.shibboleth.net/nexus/content/repositories/thirdparty/org/gluu/oxcore-script/4.3.1-SNAPSHOT/maven-metadata.xml
    - https://build.shibboleth.net/nexus/content/repositories/thirdparty/org/gluu/oxcore-script/4.3.1-SNAPSHOT/oxcore-script-4.3.1-SNAPSHOT.pom
    - https://build.shibboleth.net/nexus/content/repositories/thirdparty/org/gluu/oxcore-script/4.3.1-SNAPSHOT/oxcore-script-4.3.1-SNAPSHOT.jar
    - https://ox.gluu.org/maven/org/gluu/oxcore-script/4.3.1-SNAPSHOT/maven-metadata.xml
    - https://ox.gluu.org/maven/org/gluu/oxcore-script/4.3.1-SNAPSHOT/oxcore-script-4.3.1-SNAPSHOT.pom
    - https://ox.gluu.org/maven/org/gluu/oxcore-script/4.3.1-SNAPSHOT/oxcore-script-4.3.1-SNAPSHOT.jar
  Required by:
      project :
> Could not find org.gluu:gluu-orm-annotation:4.3.1-SNAPSHOT.
  Searched in the following locations:
    - file:/var/www/html/maven/org/gluu/gluu-orm-annotation/4.3.1-SNAPSHOT/maven-metadata.xml
    - file:/var/www/html/maven/org/gluu/gluu-orm-annotation/4.3.1-SNAPSHOT/gluu-orm-annotation-4.3.1-SNAPSHOT.pom
    - file:/var/www/html/maven/org/gluu/gluu-orm-annotation/4.3.1-SNAPSHOT/gluu-orm-annotation-4.3.1-SNAPSHOT.jar
    - https://repo.maven.apache.org/maven2/org/gluu/gluu-orm-annotation/4.3.1-SNAPSHOT/maven-metadata.xml
    - https://repo.maven.apache.org/maven2/org/gluu/gluu-orm-annotation/4.3.1-SNAPSHOT/gluu-orm-annotation-4.3.1-SNAPSHOT.pom
    - https://repo.maven.apache.org/maven2/org/gluu/gluu-orm-annotation/4.3.1-SNAPSHOT/gluu-orm-annotation-4.3.1-SNAPSHOT.jar
    - https://build.shibboleth.net/nexus/content/repositories/releases/org/gluu/gluu-orm-annotation/4.3.1-SNAPSHOT/maven-metadata.xml
    - https://build.shibboleth.net/nexus/content/repositories/releases/org/gluu/gluu-orm-annotation/4.3.1-SNAPSHOT/gluu-orm-annotation-4.3.1-SNAPSHOT.pom
    - https://build.shibboleth.net/nexus/content/repositories/releases/org/gluu/gluu-orm-annotation/4.3.1-SNAPSHOT/gluu-orm-annotation-4.3.1-SNAPSHOT.jar
    - https://build.shibboleth.net/nexus/content/repositories/thirdparty/org/gluu/gluu-orm-annotation/4.3.1-SNAPSHOT/maven-metadata.xml
    - https://build.shibboleth.net/nexus/content/repositories/thirdparty/org/gluu/gluu-orm-annotation/4.3.1-SNAPSHOT/gluu-orm-annotation-4.3.1-SNAPSHOT.pom
    - https://build.shibboleth.net/nexus/content/repositories/thirdparty/org/gluu/gluu-orm-annotation/4.3.1-SNAPSHOT/gluu-orm-annotation-4.3.1-SNAPSHOT.jar
    - https://ox.gluu.org/maven/org/gluu/gluu-orm-annotation/4.3.1-SNAPSHOT/maven-metadata.xml
    - https://ox.gluu.org/maven/org/gluu/gluu-orm-annotation/4.3.1-SNAPSHOT/gluu-orm-annotation-4.3.1-SNAPSHOT.pom
    - https://ox.gluu.org/maven/org/gluu/gluu-orm-annotation/4.3.1-SNAPSHOT/gluu-orm-annotation-4.3.1-SNAPSHOT.jar
  Required by:
      project :
> Could not find org.gluu:gluu-orm-filter:4.3.1-SNAPSHOT.
  Searched in the following locations:
    - file:/var/www/html/maven/org/gluu/gluu-orm-filter/4.3.1-SNAPSHOT/maven-metadata.xml
    - file:/var/www/html/maven/org/gluu/gluu-orm-filter/4.3.1-SNAPSHOT/gluu-orm-filter-4.3.1-SNAPSHOT.pom
    - file:/var/www/html/maven/org/gluu/gluu-orm-filter/4.3.1-SNAPSHOT/gluu-orm-filter-4.3.1-SNAPSHOT.jar
    - https://repo.maven.apache.org/maven2/org/gluu/gluu-orm-filter/4.3.1-SNAPSHOT/maven-metadata.xml
    - https://repo.maven.apache.org/maven2/org/gluu/gluu-orm-filter/4.3.1-SNAPSHOT/gluu-orm-filter-4.3.1-SNAPSHOT.pom
    - https://repo.maven.apache.org/maven2/org/gluu/gluu-orm-filter/4.3.1-SNAPSHOT/gluu-orm-filter-4.3.1-SNAPSHOT.jar
    - https://build.shibboleth.net/nexus/content/repositories/releases/org/gluu/gluu-orm-filter/4.3.1-SNAPSHOT/maven-metadata.xml
    - https://build.shibboleth.net/nexus/content/repositories/releases/org/gluu/gluu-orm-filter/4.3.1-SNAPSHOT/gluu-orm-filter-4.3.1-SNAPSHOT.pom
    - https://build.shibboleth.net/nexus/content/repositories/releases/org/gluu/gluu-orm-filter/4.3.1-SNAPSHOT/gluu-orm-filter-4.3.1-SNAPSHOT.jar
    - https://build.shibboleth.net/nexus/content/repositories/thirdparty/org/gluu/gluu-orm-filter/4.3.1-SNAPSHOT/maven-metadata.xml
    - https://build.shibboleth.net/nexus/content/repositories/thirdparty/org/gluu/gluu-orm-filter/4.3.1-SNAPSHOT/gluu-orm-filter-4.3.1-SNAPSHOT.pom
    - https://build.shibboleth.net/nexus/content/repositories/thirdparty/org/gluu/gluu-orm-filter/4.3.1-SNAPSHOT/gluu-orm-filter-4.3.1-SNAPSHOT.jar
    - https://ox.gluu.org/maven/org/gluu/gluu-orm-filter/4.3.1-SNAPSHOT/maven-metadata.xml
    - https://ox.gluu.org/maven/org/gluu/gluu-orm-filter/4.3.1-SNAPSHOT/gluu-orm-filter-4.3.1-SNAPSHOT.pom
    - https://ox.gluu.org/maven/org/gluu/gluu-orm-filter/4.3.1-SNAPSHOT/gluu-orm-filter-4.3.1-SNAPSHOT.jar
  Required by:
      project :

* Try:
Run with --stacktrace option to get the stack trace. Run with --info or --debug option to get more log output. Run with --scan to get full insights.

* Get more help at https://help.gradle.org

Deprecated Gradle features were used in this build, making it incompatible with Gradle 5.0.
Use '--warning-mode all' to show the individual deprecation warnings.
See https://docs.gradle.org/4.10.1/userguide/command_line_interface.html#sec:command_line_warnings

BUILD FAILED in 12s
2 actionable tasks: 2 executed
Build step 'Invoke Gradle script' changed build result to FAILURE
Build step 'Invoke Gradle script' marked build as failure
Not sending mail to unregistered user noreply@github.com
Sending e-mails to: support@gluu.org
ERROR: Couldn't connect to host, port: webmail.gluu.org, 465; timeout 60000
com.sun.mail.util.MailConnectException: Couldn't connect to host, port: webmail.gluu.org, 465; timeout 60000;
  nested exception is:
	java.net.SocketTimeoutException: connect timed out
	at com.sun.mail.smtp.SMTPTransport.openServer(SMTPTransport.java:2210)
	at com.sun.mail.smtp.SMTPTransport.protocolConnect(SMTPTransport.java:722)
	at javax.mail.Service.connect(Service.java:310)
	at javax.mail.Service.connect(Service.java:169)
	at javax.mail.Service.connect(Service.java:118)
	at javax.mail.Transport.send0(Transport.java:188)
	at javax.mail.Transport.send(Transport.java:118)
	at hudson.tasks.MailSender.run(MailSender.java:130)
	at hudson.tasks.Mailer.perform(Mailer.java:176)
	at hudson.tasks.Mailer.perform(Mailer.java:139)
	at hudson.tasks.BuildStepMonitor$1.perform(BuildStepMonitor.java:20)
	at hudson.model.AbstractBuild$AbstractBuildExecution.perform(AbstractBuild.java:741)
	at hudson.model.AbstractBuild$AbstractBuildExecution.performAllBuildSteps(AbstractBuild.java:690)
	at hudson.model.Build$BuildExecution.post2(Build.java:186)
	at hudson.model.AbstractBuild$AbstractBuildExecution.post(AbstractBuild.java:635)
	at hudson.model.Run.execute(Run.java:1905)
	at hudson.model.FreeStyleBuild.run(FreeStyleBuild.java:43)
	at hudson.model.ResourceController.execute(ResourceController.java:97)
	at hudson.model.Executor.run(Executor.java:428)
Caused by: java.net.SocketTimeoutException: connect timed out
	at java.net.PlainSocketImpl.socketConnect(Native Method)
	at java.net.AbstractPlainSocketImpl.doConnect(AbstractPlainSocketImpl.java:350)
	at java.net.AbstractPlainSocketImpl.connectToAddress(AbstractPlainSocketImpl.java:206)
	at java.net.AbstractPlainSocketImpl.connect(AbstractPlainSocketImpl.java:188)
	at java.net.SocksSocketImpl.connect(SocksSocketImpl.java:392)
	at java.net.Socket.connect(Socket.java:589)
	at com.sun.mail.util.SocketFetcher.createSocket(SocketFetcher.java:333)
	at com.sun.mail.util.SocketFetcher.getSocket(SocketFetcher.java:193)
	at com.sun.mail.smtp.SMTPTransport.openServer(SMTPTransport.java:2160)
	... 18 more
Finished: FAILURE