FailedConsole Output

Started by an SCM change
Building in workspace /home/tomcat/.jenkins/jobs/oxd-play/workspace
 > git rev-parse --is-inside-work-tree # timeout=10
Fetching changes from the remote Git repository
 > git config remote.origin.url https://github.com/GluuFederation/oxd-play # timeout=10
Fetching upstream changes from https://github.com/GluuFederation/oxd-play
 > git --version # timeout=10
using .gitcredentials to set credentials
 > git config --local credential.username ldeveloperl1985@gmail.com # timeout=10
 > git config --local credential.helper store --file=/opt/tomcat/temp/git9049117056218189366.credentials # timeout=10
 > git -c core.askpass=true fetch --tags --progress https://github.com/GluuFederation/oxd-play +refs/heads/*:refs/remotes/origin/*
 > git config --local --remove-section credential # timeout=10
 > git rev-parse refs/remotes/origin/master^{commit} # timeout=10
 > git rev-parse refs/remotes/origin/origin/master^{commit} # timeout=10
Checking out Revision ab1bbe9b54164c5cd78f2ef6308efcf6336b1f2a (refs/remotes/origin/master)
 > git config core.sparsecheckout # timeout=10
 > git checkout -f ab1bbe9b54164c5cd78f2ef6308efcf6336b1f2a
 > git rev-list f1e086ce9945ff3b1e9366b42c569b99c4268bab # timeout=10
[workspace] $ /home/tomcat/.jenkins/tools/hudson.tasks.Maven_MavenInstallation/maven_3.3.9/bin/mvn -DVERSION_NAME=version_2.4.4 -DMAVEN_SKIP_TESTS=false -Doxd.server.config=$OXD_CONF -Dmaven.test.skip=false clean compile install findbugs:findbugs
[INFO] Scanning for projects...
[INFO]                                                                         
[INFO] ------------------------------------------------------------------------
[INFO] Building oxD Java Client for play 2.4.4
[INFO] ------------------------------------------------------------------------
[INFO] 
[INFO] --- maven-clean-plugin:2.5:clean (default-clean) @ oxd-play ---
[INFO] Deleting /home/tomcat/.jenkins/jobs/oxd-play/workspace/target
[INFO] 
[INFO] --- maven-resources-plugin:2.4:resources (default-resources) @ oxd-play ---
[INFO] Using 'UTF-8' encoding to copy filtered resources.
[INFO] Copying 1 resource
[INFO] 
[INFO] --- maven-compiler-plugin:2.3.2:compile (default-compile) @ oxd-play ---
[INFO] Compiling 13 source files to /home/tomcat/.jenkins/jobs/oxd-play/workspace/target/classes
[INFO] -------------------------------------------------------------
[ERROR] COMPILATION ERROR : 
[INFO] -------------------------------------------------------------
[ERROR] /home/tomcat/.jenkins/jobs/oxd-play/workspace/src/main/java/org/xdi/oxd/client/oxdCommands.java:[21,29] error: package junit.framework does not exist
[ERROR] /home/tomcat/.jenkins/jobs/oxd-play/workspace/src/main/java/org/xdi/oxd/client/oxdCommands.java:[21,0] error: static import only from classes and interfaces
[INFO] 2 errors 
[INFO] -------------------------------------------------------------
[INFO] ------------------------------------------------------------------------
[INFO] BUILD FAILURE
[INFO] ------------------------------------------------------------------------
[INFO] Total time: 5.583 s
[INFO] Finished at: 2016-11-15T06:39:17-05:00
[INFO] Final Memory: 19M/177M
[INFO] ------------------------------------------------------------------------
[ERROR] Failed to execute goal org.apache.maven.plugins:maven-compiler-plugin:2.3.2:compile (default-compile) on project oxd-play: Compilation failure: Compilation failure:
[ERROR] /home/tomcat/.jenkins/jobs/oxd-play/workspace/src/main/java/org/xdi/oxd/client/oxdCommands.java:[21,29] error: package junit.framework does not exist
[ERROR] /home/tomcat/.jenkins/jobs/oxd-play/workspace/src/main/java/org/xdi/oxd/client/oxdCommands.java:[21,0] error: static import only from classes and interfaces
[ERROR] -> [Help 1]
[ERROR] 
[ERROR] To see the full stack trace of the errors, re-run Maven with the -e switch.
[ERROR] Re-run Maven using the -X switch to enable full debug logging.
[ERROR] 
[ERROR] For more information about the errors and possible solutions, please read the following articles:
[ERROR] [Help 1] http://cwiki.apache.org/confluence/display/MAVEN/MojoFailureException
Build step 'Invoke top-level Maven targets' marked build as failure
[FINDBUGS] Skipping publisher since build result is FAILURE
Finished: FAILURE