FailedConsole Output

Started by an SCM change
Building in workspace /home/tomcat/.jenkins/jobs/oxd-play/workspace
 > git rev-parse --is-inside-work-tree # timeout=10
Fetching changes from the remote Git repository
 > git config remote.origin.url https://github.com/ldeveloperl1985/oxd-play.git # timeout=10
Fetching upstream changes from https://github.com/ldeveloperl1985/oxd-play.git
 > git --version # timeout=10
using .gitcredentials to set credentials
 > git config --local credential.username ldeveloperl1985@gmail.com # timeout=10
 > git config --local credential.helper store --file=/opt/tomcat/temp/git5801165649285905533.credentials # timeout=10
 > git -c core.askpass=true fetch --tags --progress https://github.com/ldeveloperl1985/oxd-play.git +refs/heads/*:refs/remotes/origin/*
 > git config --local --remove-section credential # timeout=10
 > git rev-parse refs/remotes/origin/master^{commit} # timeout=10
 > git rev-parse refs/remotes/origin/origin/master^{commit} # timeout=10
Checking out Revision cbad8c09632791e3d42befc616b87ff65e222c5f (refs/remotes/origin/master)
 > git config core.sparsecheckout # timeout=10
 > git checkout -f cbad8c09632791e3d42befc616b87ff65e222c5f
 > git rev-list a0b120fb88980f3c02457243c7e7652b159996c6 # timeout=10
[workspace] $ /home/tomcat/.jenkins/tools/hudson.tasks.Maven_MavenInstallation/maven_3.3.9/bin/mvn -DVERSION_NAME=version_2.4.3 -DMAVEN_SKIP_TESTS=false -Doxd.server.config=$OXD_CONF -Dmaven.test.skip=false clean compile install findbugs:findbugs
[INFO] Scanning for projects...
[INFO]                                                                         
[INFO] ------------------------------------------------------------------------
[INFO] Building oxD Java Client for play 1.0-FINAL
[INFO] ------------------------------------------------------------------------
Downloading: http://ox.gluu.org/maven/org/xdi/oxd-common/2.4.4.Final/oxd-common-2.4.4.Final.pom

Downloading: http://repo1.maven.org/maven2/org/xdi/oxd-common/2.4.4.Final/oxd-common-2.4.4.Final.pom

Downloading: http://repository.jboss.org/nexus/content/groups/public-jboss/org/xdi/oxd-common/2.4.4.Final/oxd-common-2.4.4.Final.pom

Downloading: http://repo2.maven.org/maven2/org/bouncycastle/org/xdi/oxd-common/2.4.4.Final/oxd-common-2.4.4.Final.pom

[WARNING] The POM for org.xdi:oxd-common:jar:2.4.4.Final is missing, no dependency information available
Downloading: http://ox.gluu.org/maven/org/xdi/oxauth-client/2.4.4.Final/oxauth-client-2.4.4.Final.pom

Downloading: http://repo1.maven.org/maven2/org/xdi/oxauth-client/2.4.4.Final/oxauth-client-2.4.4.Final.pom

Downloading: http://repository.jboss.org/nexus/content/groups/public-jboss/org/xdi/oxauth-client/2.4.4.Final/oxauth-client-2.4.4.Final.pom

Downloading: http://repo2.maven.org/maven2/org/bouncycastle/org/xdi/oxauth-client/2.4.4.Final/oxauth-client-2.4.4.Final.pom

[WARNING] The POM for org.xdi:oxauth-client:jar:2.4.4.Final is missing, no dependency information available
Downloading: http://ox.gluu.org/maven/org/xdi/oxd-server/2.4.4.Final/oxd-server-2.4.4.Final.pom

Downloading: http://repo1.maven.org/maven2/org/xdi/oxd-server/2.4.4.Final/oxd-server-2.4.4.Final.pom

Downloading: http://repository.jboss.org/nexus/content/groups/public-jboss/org/xdi/oxd-server/2.4.4.Final/oxd-server-2.4.4.Final.pom

Downloading: http://repo2.maven.org/maven2/org/bouncycastle/org/xdi/oxd-server/2.4.4.Final/oxd-server-2.4.4.Final.pom

[WARNING] The POM for org.xdi:oxd-server:jar:2.4.4.Final is missing, no dependency information available
Downloading: http://ox.gluu.org/maven/org/xdi/oxd-common/2.4.4.Final/oxd-common-2.4.4.Final.jar
Downloading: http://ox.gluu.org/maven/org/xdi/oxd-server/2.4.4.Final/oxd-server-2.4.4.Final.jar
Downloading: http://ox.gluu.org/maven/org/xdi/oxauth-client/2.4.4.Final/oxauth-client-2.4.4.Final.jar



Downloading: http://repo1.maven.org/maven2/org/xdi/oxd-common/2.4.4.Final/oxd-common-2.4.4.Final.jar
Downloading: http://repo1.maven.org/maven2/org/xdi/oxauth-client/2.4.4.Final/oxauth-client-2.4.4.Final.jar
Downloading: http://repo1.maven.org/maven2/org/xdi/oxd-server/2.4.4.Final/oxd-server-2.4.4.Final.jar



Downloading: http://repository.jboss.org/nexus/content/groups/public-jboss/org/xdi/oxd-common/2.4.4.Final/oxd-common-2.4.4.Final.jar
Downloading: http://repository.jboss.org/nexus/content/groups/public-jboss/org/xdi/oxauth-client/2.4.4.Final/oxauth-client-2.4.4.Final.jar
Downloading: http://repository.jboss.org/nexus/content/groups/public-jboss/org/xdi/oxd-server/2.4.4.Final/oxd-server-2.4.4.Final.jar



Downloading: http://repo2.maven.org/maven2/org/bouncycastle/org/xdi/oxd-common/2.4.4.Final/oxd-common-2.4.4.Final.jar
Downloading: http://repo2.maven.org/maven2/org/bouncycastle/org/xdi/oxauth-client/2.4.4.Final/oxauth-client-2.4.4.Final.jar
Downloading: http://repo2.maven.org/maven2/org/bouncycastle/org/xdi/oxd-server/2.4.4.Final/oxd-server-2.4.4.Final.jar



[INFO] ------------------------------------------------------------------------
[INFO] BUILD FAILURE
[INFO] ------------------------------------------------------------------------
[INFO] Total time: 4.533 s
[INFO] Finished at: 2016-08-12T02:45:16-04:00
[INFO] Final Memory: 10M/107M
[INFO] ------------------------------------------------------------------------
[ERROR] Failed to execute goal on project oxd-play: Could not resolve dependencies for project oxd.play.java:oxd-play:jar:1.0-FINAL: The following artifacts could not be resolved: org.xdi:oxd-common:jar:2.4.4.Final, org.xdi:oxauth-client:jar:2.4.4.Final, org.xdi:oxd-server:jar:2.4.4.Final: Could not find artifact org.xdi:oxd-common:jar:2.4.4.Final in gluu (http://ox.gluu.org/maven) -> [Help 1]
[ERROR] 
[ERROR] To see the full stack trace of the errors, re-run Maven with the -e switch.
[ERROR] Re-run Maven using the -X switch to enable full debug logging.
[ERROR] 
[ERROR] For more information about the errors and possible solutions, please read the following articles:
[ERROR] [Help 1] http://cwiki.apache.org/confluence/display/MAVEN/DependencyResolutionException
Build step 'Invoke top-level Maven targets' marked build as failure
[FINDBUGS] Skipping publisher since build result is FAILURE
Finished: FAILURE