FailedConsole Output

Started by an SCM change
Building in workspace /home/tomcat/.jenkins/jobs/oxUmaDemo/workspace
 > git rev-parse --is-inside-work-tree # timeout=10
Fetching changes from the remote Git repository
 > git config remote.origin.url https://github.com/GluuFederation/oxUmaDemo # timeout=10
Fetching upstream changes from https://github.com/GluuFederation/oxUmaDemo
 > git --version # timeout=10
 > git -c core.askpass=true fetch --tags --progress https://github.com/GluuFederation/oxUmaDemo +refs/heads/*:refs/remotes/origin/*
 > git rev-parse refs/remotes/origin/master^{commit} # timeout=10
 > git rev-parse refs/remotes/origin/origin/master^{commit} # timeout=10
Checking out Revision e81b98ef0d0cfd6c5f3a982f71d08382a1ca0d4c (refs/remotes/origin/master)
 > git config core.sparsecheckout # timeout=10
 > git checkout -f e81b98ef0d0cfd6c5f3a982f71d08382a1ca0d4c
 > git rev-list c5a17dab64fe782023b1e60fe6203cf64813ac6c # timeout=10
[workspace] $ /home/tomcat/.jenkins/tools/hudson.tasks.Maven_MavenInstallation/maven_3.3.9/bin/mvn -DVERSION_NAME=master -DMAVEN_SKIP_TESTS=false -Dmaven.test.skip=false clean compile install
[INFO] Scanning for projects...
[INFO] ------------------------------------------------------------------------
[INFO] Reactor Build Order:
[INFO] 
[INFO] oxUma Demo
[INFO] oxUma Demo Common
[INFO] oxUma Demo Resource Server
[INFO] oxUma Demo Requesting Party
[INFO]                                                                         
[INFO] ------------------------------------------------------------------------
[INFO] Building oxUma Demo 1.0-SNAPSHOT
[INFO] ------------------------------------------------------------------------
[INFO] 
[INFO] --- maven-clean-plugin:2.5:clean (default-clean) @ oxuma-demo ---
[INFO] 
[INFO] --- maven-install-plugin:2.3.1:install (default-install) @ oxuma-demo ---
[INFO] Installing /home/tomcat/.jenkins/jobs/oxUmaDemo/workspace/pom.xml to /var/www/html/maven/org/xdi/oxuma-demo/1.0-SNAPSHOT/oxuma-demo-1.0-SNAPSHOT.pom
[INFO]                                                                         
[INFO] ------------------------------------------------------------------------
[INFO] Building oxUma Demo Common 1.0-SNAPSHOT
[INFO] ------------------------------------------------------------------------
[INFO] 
[INFO] --- maven-clean-plugin:2.5:clean (default-clean) @ oxuma-demo-common ---
[INFO] Deleting /home/tomcat/.jenkins/jobs/oxUmaDemo/workspace/Common/target
[INFO] 
[INFO] --- maven-resources-plugin:2.4:resources (default-resources) @ oxuma-demo-common ---
[INFO] Using 'UTF-8' encoding to copy filtered resources.
[INFO] skip non existing resourceDirectory /home/tomcat/.jenkins/jobs/oxUmaDemo/workspace/Common/src/main/resources
[INFO] 
[INFO] --- gwt-maven-plugin:2.5.0:resources (default) @ oxuma-demo-common ---
[INFO] auto discovered modules [org.xdi.uma.demo.common.UmaDemoCommon]
[INFO] 7 source files from GWT module org.xdi.uma.demo.common.UmaDemoCommon
[INFO] 
[INFO] --- maven-compiler-plugin:2.3.2:compile (default-compile) @ oxuma-demo-common ---
[INFO] Compiling 10 source files to /home/tomcat/.jenkins/jobs/oxUmaDemo/workspace/Common/target/classes
[INFO] 
[INFO] --- maven-resources-plugin:2.4:resources (default-resources) @ oxuma-demo-common ---
[INFO] Using 'UTF-8' encoding to copy filtered resources.
[INFO] skip non existing resourceDirectory /home/tomcat/.jenkins/jobs/oxUmaDemo/workspace/Common/src/main/resources
[INFO] 
[INFO] --- gwt-maven-plugin:2.5.0:resources (default) @ oxuma-demo-common ---
[INFO] auto discovered modules [org.xdi.uma.demo.common.UmaDemoCommon]
[INFO] 7 source files from GWT module org.xdi.uma.demo.common.UmaDemoCommon
[INFO] 
[INFO] --- maven-compiler-plugin:2.3.2:compile (default-compile) @ oxuma-demo-common ---
[INFO] Nothing to compile - all classes are up to date
[INFO] 
[INFO] --- maven-resources-plugin:2.4:testResources (default-testResources) @ oxuma-demo-common ---
[INFO] Using 'UTF-8' encoding to copy filtered resources.
[INFO] skip non existing resourceDirectory /home/tomcat/.jenkins/jobs/oxUmaDemo/workspace/Common/src/test/resources
[INFO] 
[INFO] --- maven-compiler-plugin:2.3.2:testCompile (default-testCompile) @ oxuma-demo-common ---
[INFO] No sources to compile
[INFO] 
[INFO] --- maven-surefire-plugin:2.12:test (default-test) @ oxuma-demo-common ---
[INFO] Tests are skipped.
[INFO] 
[INFO] --- gwt-maven-plugin:2.5.0:compile (default) @ oxuma-demo-common ---
[INFO] auto discovered modules [org.xdi.uma.demo.common.UmaDemoCommon]
[WARNING] Declared compileSourcesArtifact was not found in project dependencies org.codehaus.mojo:oxUmaCommon:jar
[INFO] org.xdi.uma.demo.common.UmaDemoCommon has no EntryPoint - compilation skipped
[INFO] 
[INFO] --- maven-jar-plugin:2.4:jar (default-jar) @ oxuma-demo-common ---
[INFO] Building jar: /home/tomcat/.jenkins/jobs/oxUmaDemo/workspace/Common/target/oxuma-demo-common-1.0-SNAPSHOT.jar
[INFO] 
[INFO] --- maven-jar-plugin:2.4:test-jar (default) @ oxuma-demo-common ---
[WARNING] JAR will be empty - no content was marked for inclusion!
[INFO] Building jar: /home/tomcat/.jenkins/jobs/oxUmaDemo/workspace/Common/target/oxuma-demo-common-1.0-SNAPSHOT-tests.jar
[INFO] 
[INFO] >>> maven-source-plugin:2.1.2:jar (attach-sources) > generate-sources @ oxuma-demo-common >>>
[INFO] 
[INFO] <<< maven-source-plugin:2.1.2:jar (attach-sources) < generate-sources @ oxuma-demo-common <<<
[INFO] 
[INFO] --- maven-source-plugin:2.1.2:jar (attach-sources) @ oxuma-demo-common ---
[INFO] Building jar: /home/tomcat/.jenkins/jobs/oxUmaDemo/workspace/Common/target/oxuma-demo-common-1.0-SNAPSHOT-sources.jar
[INFO] 
[INFO] --- gwt-maven-plugin:2.5.0:test (default) @ oxuma-demo-common ---
[INFO] 
[INFO] --- maven-install-plugin:2.3.1:install (default-install) @ oxuma-demo-common ---
[INFO] Installing /home/tomcat/.jenkins/jobs/oxUmaDemo/workspace/Common/target/oxuma-demo-common-1.0-SNAPSHOT.jar to /var/www/html/maven/org/xdi/oxuma-demo-common/1.0-SNAPSHOT/oxuma-demo-common-1.0-SNAPSHOT.jar
[INFO] Installing /home/tomcat/.jenkins/jobs/oxUmaDemo/workspace/Common/pom.xml to /var/www/html/maven/org/xdi/oxuma-demo-common/1.0-SNAPSHOT/oxuma-demo-common-1.0-SNAPSHOT.pom
[INFO] Installing /home/tomcat/.jenkins/jobs/oxUmaDemo/workspace/Common/target/oxuma-demo-common-1.0-SNAPSHOT-tests.jar to /var/www/html/maven/org/xdi/oxuma-demo-common/1.0-SNAPSHOT/oxuma-demo-common-1.0-SNAPSHOT-tests.jar
[INFO] Installing /home/tomcat/.jenkins/jobs/oxUmaDemo/workspace/Common/target/oxuma-demo-common-1.0-SNAPSHOT-sources.jar to /var/www/html/maven/org/xdi/oxuma-demo-common/1.0-SNAPSHOT/oxuma-demo-common-1.0-SNAPSHOT-sources.jar
[INFO]                                                                         
[INFO] ------------------------------------------------------------------------
[INFO] Building oxUma Demo Resource Server 1.0-SNAPSHOT
[INFO] ------------------------------------------------------------------------
[INFO] 
[INFO] --- maven-clean-plugin:2.5:clean (default-clean) @ oxuma-demo-rs ---
[INFO] Deleting /home/tomcat/.jenkins/jobs/oxUmaDemo/workspace/RS/target
[INFO] 
[INFO] --- maven-resources-plugin:2.4:resources (default-resources) @ oxuma-demo-rs ---
[INFO] Using 'UTF-8' encoding to copy filtered resources.
[INFO] Copying 3 resources
[INFO] 
[INFO] --- maven-compiler-plugin:2.3.2:compile (default-compile) @ oxuma-demo-rs ---
[INFO] Compiling 12 source files to /home/tomcat/.jenkins/jobs/oxUmaDemo/workspace/RS/target/classes
[INFO] 
[INFO] --- maven-resources-plugin:2.4:resources (default-resources) @ oxuma-demo-rs ---
[INFO] Using 'UTF-8' encoding to copy filtered resources.
[INFO] Copying 3 resources
[INFO] 
[INFO] --- maven-compiler-plugin:2.3.2:compile (default-compile) @ oxuma-demo-rs ---
[INFO] Nothing to compile - all classes are up to date
[INFO] 
[INFO] --- maven-resources-plugin:2.4:testResources (default-testResources) @ oxuma-demo-rs ---
[INFO] Using 'UTF-8' encoding to copy filtered resources.
[INFO] Copying 1 resource
[INFO] 
[INFO] --- maven-compiler-plugin:2.3.2:testCompile (default-testCompile) @ oxuma-demo-rs ---
[INFO] Compiling 1 source file to /home/tomcat/.jenkins/jobs/oxUmaDemo/workspace/RS/target/test-classes
[INFO] 
[INFO] --- maven-surefire-plugin:2.12:test (default-test) @ oxuma-demo-rs ---
[INFO] Tests are skipped.
[INFO] 
[INFO] --- gwt-maven-plugin:2.5.0:compile (default) @ oxuma-demo-rs ---
[INFO] auto discovered modules [org.xdi.uma.demo.rs.RS]
[INFO] Compiling module org.xdi.uma.demo.rs.RS
[INFO]    Compiling 12 permutations
[INFO]       Compiling permutation 0...
[INFO]       Process output
[INFO]          Compiling
[INFO]             Compiling permutation 1...
[INFO]       Compiling permutation 2...
[INFO]       Compiling permutation 3...
[INFO]          Compiling
[INFO]             Compiling permutation 4...
[INFO]       Compiling permutation 5...
[INFO]          Compiling
[INFO]             Compiling permutation 6...
[INFO]       Compiling permutation 7...
[INFO]          Compiling
[INFO]             Compiling permutation 8...
[INFO]       Compiling permutation 9...
[INFO]          Compiling
[INFO]             Compiling permutation 10...
[INFO]       Compiling permutation 11...
[INFO]    Compile of permutations succeeded
[INFO] Linking into /home/tomcat/.jenkins/jobs/oxUmaDemo/workspace/RS/target/oxuma-rs/rs
[INFO]    Link succeeded
[INFO]    Compilation succeeded -- 139.070s
[INFO] 
[INFO] --- maven-war-plugin:2.3:war (default-war) @ oxuma-demo-rs ---
[INFO] Packaging webapp
[INFO] Assembling webapp [oxuma-demo-rs] in [/home/tomcat/.jenkins/jobs/oxUmaDemo/workspace/RS/target/oxuma-rs]
[INFO] Processing war project
[INFO] Copying webapp resources [/home/tomcat/.jenkins/jobs/oxUmaDemo/workspace/RS/src/main/webapp]
[INFO] Webapp assembled in [327 msecs]
[INFO] Building war: /home/tomcat/.jenkins/jobs/oxUmaDemo/workspace/RS/target/oxuma-rs.war
[INFO] 
[INFO] --- maven-jar-plugin:2.4:test-jar (default) @ oxuma-demo-rs ---
[INFO] Building jar: /home/tomcat/.jenkins/jobs/oxUmaDemo/workspace/RS/target/oxuma-rs-tests.jar
[INFO] 
[INFO] >>> maven-source-plugin:2.1.2:jar (attach-sources) > generate-sources @ oxuma-demo-rs >>>
[INFO] 
[INFO] <<< maven-source-plugin:2.1.2:jar (attach-sources) < generate-sources @ oxuma-demo-rs <<<
[INFO] 
[INFO] --- maven-source-plugin:2.1.2:jar (attach-sources) @ oxuma-demo-rs ---
[INFO] Building jar: /home/tomcat/.jenkins/jobs/oxUmaDemo/workspace/RS/target/oxuma-rs-sources.jar
[INFO] 
[INFO] --- gwt-maven-plugin:2.5.0:test (default) @ oxuma-demo-rs ---
[INFO] 
[INFO] --- maven-install-plugin:2.3.1:install (default-install) @ oxuma-demo-rs ---
[INFO] Installing /home/tomcat/.jenkins/jobs/oxUmaDemo/workspace/RS/target/oxuma-rs.war to /var/www/html/maven/org/xdi/oxuma-demo-rs/1.0-SNAPSHOT/oxuma-demo-rs-1.0-SNAPSHOT.war
[INFO] Installing /home/tomcat/.jenkins/jobs/oxUmaDemo/workspace/RS/pom.xml to /var/www/html/maven/org/xdi/oxuma-demo-rs/1.0-SNAPSHOT/oxuma-demo-rs-1.0-SNAPSHOT.pom
[INFO] Installing /home/tomcat/.jenkins/jobs/oxUmaDemo/workspace/RS/target/oxuma-rs-tests.jar to /var/www/html/maven/org/xdi/oxuma-demo-rs/1.0-SNAPSHOT/oxuma-demo-rs-1.0-SNAPSHOT-tests.jar
[INFO] Installing /home/tomcat/.jenkins/jobs/oxUmaDemo/workspace/RS/target/oxuma-rs-sources.jar to /var/www/html/maven/org/xdi/oxuma-demo-rs/1.0-SNAPSHOT/oxuma-demo-rs-1.0-SNAPSHOT-sources.jar
[INFO]                                                                         
[INFO] ------------------------------------------------------------------------
[INFO] Building oxUma Demo Requesting Party 1.0-SNAPSHOT
[INFO] ------------------------------------------------------------------------
[INFO] 
[INFO] --- maven-clean-plugin:2.5:clean (default-clean) @ oxuma-demo-rp ---
[INFO] Deleting /home/tomcat/.jenkins/jobs/oxUmaDemo/workspace/RP/target
[INFO] 
[INFO] --- maven-resources-plugin:2.4:resources (default-resources) @ oxuma-demo-rp ---
[INFO] Using 'UTF-8' encoding to copy filtered resources.
[INFO] Copying 3 resources
[INFO] 
[INFO] --- maven-compiler-plugin:2.3.2:compile (default-compile) @ oxuma-demo-rp ---
[INFO] Compiling 15 source files to /home/tomcat/.jenkins/jobs/oxUmaDemo/workspace/RP/target/classes
[INFO] -------------------------------------------------------------
[ERROR] COMPILATION ERROR : 
[INFO] -------------------------------------------------------------
[ERROR] /home/tomcat/.jenkins/jobs/oxUmaDemo/workspace/RP/src/main/java/org/xdi/uma/demo/rp/client/LoginController.java:[30,26] error: cannot find symbol
[ERROR]  class LoginController
/home/tomcat/.jenkins/jobs/oxUmaDemo/workspace/RP/src/main/java/org/xdi/uma/demo/rp/client/LoginController.java:[90,33] error: cannot find symbol
[ERROR]  class LoginController
/home/tomcat/.jenkins/jobs/oxUmaDemo/workspace/RP/src/main/java/org/xdi/uma/demo/rp/client/LoginController.java:[99,47] error: cannot find symbol
[ERROR]  class LoginController
/home/tomcat/.jenkins/jobs/oxUmaDemo/workspace/RP/src/main/java/org/xdi/uma/demo/rp/client/LoginController.java:[104,29] error: cannot find symbol
[INFO] 4 errors 
[INFO] -------------------------------------------------------------
[INFO] ------------------------------------------------------------------------
[INFO] Reactor Summary:
[INFO] 
[INFO] oxUma Demo ......................................... SUCCESS [  0.613 s]
[INFO] oxUma Demo Common .................................. SUCCESS [  6.425 s]
[INFO] oxUma Demo Resource Server ......................... SUCCESS [02:27 min]
[INFO] oxUma Demo Requesting Party ........................ FAILURE [  2.253 s]
[INFO] ------------------------------------------------------------------------
[INFO] BUILD FAILURE
[INFO] ------------------------------------------------------------------------
[INFO] Total time: 02:37 min
[INFO] Finished at: 2016-05-16T03:07:28-04:00
[INFO] Final Memory: 62M/355M
[INFO] ------------------------------------------------------------------------
[ERROR] Failed to execute goal org.apache.maven.plugins:maven-compiler-plugin:2.3.2:compile (default-compile) on project oxuma-demo-rp: Compilation failure: Compilation failure:
[ERROR] /home/tomcat/.jenkins/jobs/oxUmaDemo/workspace/RP/src/main/java/org/xdi/uma/demo/rp/client/LoginController.java:[30,26] error: cannot find symbol
[ERROR] class LoginController
[ERROR] /home/tomcat/.jenkins/jobs/oxUmaDemo/workspace/RP/src/main/java/org/xdi/uma/demo/rp/client/LoginController.java:[90,33] error: cannot find symbol
[ERROR] class LoginController
[ERROR] /home/tomcat/.jenkins/jobs/oxUmaDemo/workspace/RP/src/main/java/org/xdi/uma/demo/rp/client/LoginController.java:[99,47] error: cannot find symbol
[ERROR] class LoginController
[ERROR] /home/tomcat/.jenkins/jobs/oxUmaDemo/workspace/RP/src/main/java/org/xdi/uma/demo/rp/client/LoginController.java:[104,29] error: cannot find symbol
[ERROR] -> [Help 1]
[ERROR] 
[ERROR] To see the full stack trace of the errors, re-run Maven with the -e switch.
[ERROR] Re-run Maven using the -X switch to enable full debug logging.
[ERROR] 
[ERROR] For more information about the errors and possible solutions, please read the following articles:
[ERROR] [Help 1] http://cwiki.apache.org/confluence/display/MAVEN/MojoFailureException
[ERROR] 
[ERROR] After correcting the problems, you can resume the build with the command
[ERROR]   mvn <goals> -rf :oxuma-demo-rp
Build step 'Invoke top-level Maven targets' marked build as failure
[FINDBUGS] Skipping publisher since build result is FAILURE
Recording test results
TestNG Reports Processing: START
Looking for TestNG results report in workspace using pattern: **/testng-results.xml
Did not find any matching files.
Sending e-mails to: support@gluu.org yuriy@gluu.org yzabrovarniy@gmail.com
Finished: FAILURE