FailedConsole Output

Skipping 110 KB.. Full Log
Generating /home/jenkins/.jenkins/jobs/oxTrust_4.2.1/workspace/service/target/site/apidocs/org/gluu/service/config/class-use/ConfigurationFactory.html...
Generating /home/jenkins/.jenkins/jobs/oxTrust_4.2.1/workspace/service/target/site/apidocs/org/gluu/oxtrust/auth/uma/package-use.html...
Generating /home/jenkins/.jenkins/jobs/oxTrust_4.2.1/workspace/service/target/site/apidocs/org/gluu/oxtrust/exception/package-use.html...
Generating /home/jenkins/.jenkins/jobs/oxTrust_4.2.1/workspace/service/target/site/apidocs/org/gluu/oxtrust/model/package-use.html...
Generating /home/jenkins/.jenkins/jobs/oxTrust_4.2.1/workspace/service/target/site/apidocs/org/gluu/oxtrust/security/package-use.html...
Generating /home/jenkins/.jenkins/jobs/oxTrust_4.2.1/workspace/service/target/site/apidocs/org/gluu/oxtrust/service/package-use.html...
Generating /home/jenkins/.jenkins/jobs/oxTrust_4.2.1/workspace/service/target/site/apidocs/org/gluu/oxtrust/service/cdi/event/package-use.html...
Generating /home/jenkins/.jenkins/jobs/oxTrust_4.2.1/workspace/service/target/site/apidocs/org/gluu/oxtrust/service/external/package-use.html...
Generating /home/jenkins/.jenkins/jobs/oxTrust_4.2.1/workspace/service/target/site/apidocs/org/gluu/oxtrust/service/filter/package-use.html...
Generating /home/jenkins/.jenkins/jobs/oxTrust_4.2.1/workspace/service/target/site/apidocs/org/gluu/oxtrust/service/radius/package-use.html...
Generating /home/jenkins/.jenkins/jobs/oxTrust_4.2.1/workspace/service/target/site/apidocs/org/gluu/oxtrust/service/uma/package-use.html...
Generating /home/jenkins/.jenkins/jobs/oxTrust_4.2.1/workspace/service/target/site/apidocs/org/gluu/oxtrust/util/package-use.html...
Generating /home/jenkins/.jenkins/jobs/oxTrust_4.2.1/workspace/service/target/site/apidocs/org/gluu/service/config/package-use.html...
Building index for all the packages and classes...
Generating /home/jenkins/.jenkins/jobs/oxTrust_4.2.1/workspace/service/target/site/apidocs/overview-tree.html...
Generating /home/jenkins/.jenkins/jobs/oxTrust_4.2.1/workspace/service/target/site/apidocs/index-all.html...
Generating /home/jenkins/.jenkins/jobs/oxTrust_4.2.1/workspace/service/target/site/apidocs/deprecated-list.html...
Building index for all classes...
Generating /home/jenkins/.jenkins/jobs/oxTrust_4.2.1/workspace/service/target/site/apidocs/allclasses-frame.html...
Generating /home/jenkins/.jenkins/jobs/oxTrust_4.2.1/workspace/service/target/site/apidocs/allclasses-noframe.html...
Generating /home/jenkins/.jenkins/jobs/oxTrust_4.2.1/workspace/service/target/site/apidocs/index.html...
Generating /home/jenkins/.jenkins/jobs/oxTrust_4.2.1/workspace/service/target/site/apidocs/overview-summary.html...
Generating /home/jenkins/.jenkins/jobs/oxTrust_4.2.1/workspace/service/target/site/apidocs/help-doc.html...
28 errors
100 warnings
[ERROR] Error while creating javadoc report: 
Exit code: 1 - javadoc: warning - Multiple sources of package comments found for package "javax.interceptor"
/home/jenkins/.jenkins/jobs/oxTrust_4.2.1/workspace/service/src/main/java/org/gluu/oxtrust/auth/uma/ScimUmaProtectionService.java:92: error: @param name not found
     * @param uriInfo An object that allows access to request URI information
              ^
/home/jenkins/.jenkins/jobs/oxTrust_4.2.1/workspace/service/src/main/java/org/gluu/oxtrust/service/AttributeService.java:153: warning: no @param for gluuUserRole
	public List<GluuAttribute> getAllContactAttributes(GluuUserRole gluuUserRole) {
	                           ^
/home/jenkins/.jenkins/jobs/oxTrust_4.2.1/workspace/service/src/main/java/org/gluu/oxtrust/service/AttributeService.java:234: error: @param name not found
	 * @param attributes
	          ^
/home/jenkins/.jenkins/jobs/oxTrust_4.2.1/workspace/service/src/main/java/org/gluu/oxtrust/service/AttributeService.java:242: warning: no @param for attributeOriginList
	public Map<String, String> getAllAttributeOriginDisplayNames(List<String> attributeOriginList,
	                           ^
/home/jenkins/.jenkins/jobs/oxTrust_4.2.1/workspace/service/src/main/java/org/gluu/oxtrust/service/AttributeService.java:305: warning: no @throws for java.lang.Exception
	public List<GluuAttribute> getSCIMRelatedAttributes() throws Exception {
	                           ^
/home/jenkins/.jenkins/jobs/oxTrust_4.2.1/workspace/service/src/main/java/org/gluu/oxtrust/service/AttributeService.java:316: warning: no @throws for java.lang.Exception
	public List<GluuAttribute> getSCIMRelatedAttributesImpl(List<GluuAttribute> attributes) throws Exception {
	                           ^
/home/jenkins/.jenkins/jobs/oxTrust_4.2.1/workspace/service/src/main/java/org/gluu/oxtrust/service/AttributeService.java:349: error: @param name not found
	 * @param inum
	          ^
/home/jenkins/.jenkins/jobs/oxTrust_4.2.1/workspace/service/src/main/java/org/gluu/oxtrust/service/AttributeService.java:352: warning: no @param for attribute
	public void removeAttribute(GluuAttribute attribute) {
	            ^
/home/jenkins/.jenkins/jobs/oxTrust_4.2.1/workspace/service/src/main/java/org/gluu/oxtrust/service/AttributeService.java:372: warning: no @param for event
	public void clearAttributesCache(@Observes @EventType(Events.EVENT_CLEAR_ATTRIBUTES) Events event) {
	            ^
/home/jenkins/.jenkins/jobs/oxTrust_4.2.1/workspace/service/src/main/java/org/gluu/oxtrust/service/AttributeService.java:478: error: @param name not found
	 * @param customAttributes
	          ^
/home/jenkins/.jenkins/jobs/oxTrust_4.2.1/workspace/service/src/main/java/org/gluu/oxtrust/service/AttributeService.java:480: error: @param name not found
	 * @param attributes
	          ^
/home/jenkins/.jenkins/jobs/oxTrust_4.2.1/workspace/service/src/main/java/org/gluu/oxtrust/service/AttributeService.java:483: warning: no @param for attributeDNs
	public List<GluuCustomAttribute> getCustomAttributesByAttributeDNs(List<String> attributeDNs,
	                                 ^
/home/jenkins/.jenkins/jobs/oxTrust_4.2.1/workspace/service/src/main/java/org/gluu/oxtrust/service/AttributeService.java:483: warning: no @param for attributesByDNs
	public List<GluuCustomAttribute> getCustomAttributesByAttributeDNs(List<String> attributeDNs,
	                                 ^
/home/jenkins/.jenkins/jobs/oxTrust_4.2.1/workspace/service/src/main/java/org/gluu/oxtrust/service/AttributeService.java:483: warning: no @return
	public List<GluuCustomAttribute> getCustomAttributesByAttributeDNs(List<String> attributeDNs,
	                                 ^
/home/jenkins/.jenkins/jobs/oxTrust_4.2.1/workspace/service/src/main/java/org/gluu/oxtrust/service/AttributeService.java:519: warning: no @throws for java.lang.Exception
	public String getDnForGroup(String inum) throws Exception {
	              ^
/home/jenkins/.jenkins/jobs/oxTrust_4.2.1/workspace/service/src/main/java/org/gluu/oxtrust/service/AttributeService.java:529: warning: no description for @param
	 * @param admin
	   ^
/home/jenkins/.jenkins/jobs/oxTrust_4.2.1/workspace/service/src/main/java/org/gluu/oxtrust/service/AttributeService.java:530: warning: no description for @return
	 * @return
	   ^
/home/jenkins/.jenkins/jobs/oxTrust_4.2.1/workspace/service/src/main/java/org/gluu/oxtrust/service/AttributeService.java:581: warning: no description for @throws
	 * @throws Exception
	   ^
/home/jenkins/.jenkins/jobs/oxTrust_4.2.1/workspace/service/src/main/java/org/gluu/oxtrust/service/ClientService.java:67: warning: no description for @param
	 * @param client
	   ^
/home/jenkins/.jenkins/jobs/oxTrust_4.2.1/workspace/service/src/main/java/org/gluu/oxtrust/service/ClientService.java:76: warning: no description for @param
	 * @param client
	   ^
/home/jenkins/.jenkins/jobs/oxTrust_4.2.1/workspace/service/src/main/java/org/gluu/oxtrust/service/ClientService.java:89: warning: no @param for ldapReturnAttributes
	public OxAuthClient getClientByInum(String inum, String... ldapReturnAttributes) {
	                    ^
/home/jenkins/.jenkins/jobs/oxTrust_4.2.1/workspace/service/src/main/java/org/gluu/oxtrust/service/ClientService.java:204: warning: no @param for Dn
	public OxAuthClient getClientByDn(String Dn) {
	                    ^
/home/jenkins/.jenkins/jobs/oxTrust_4.2.1/workspace/service/src/main/java/org/gluu/oxtrust/service/ClientService.java:220: warning: no @param for Dn
	public OxAuthCustomClient getClientByDnCustom(String Dn) {
	                          ^
/home/jenkins/.jenkins/jobs/oxTrust_4.2.1/workspace/service/src/main/java/org/gluu/oxtrust/service/ClientService.java:233: warning: no description for @param
	 * @param DisplayName
	   ^
/home/jenkins/.jenkins/jobs/oxTrust_4.2.1/workspace/service/src/main/java/org/gluu/oxtrust/service/ClientService.java:235: error: exception not thrown: java.lang.Exception
	 * @throws Exception
	           ^
/home/jenkins/.jenkins/jobs/oxTrust_4.2.1/workspace/service/src/main/java/org/gluu/oxtrust/service/ClientService.java:235: warning: no description for @throws
	 * @throws Exception
	   ^
/home/jenkins/.jenkins/jobs/oxTrust_4.2.1/workspace/service/src/main/java/org/gluu/oxtrust/service/ClientService.java:252: warning: no description for @param
	 * @param name
	   ^
/home/jenkins/.jenkins/jobs/oxTrust_4.2.1/workspace/service/src/main/java/org/gluu/oxtrust/service/ClientService.java:253: warning: no description for @param
	 * @param value
	   ^
/home/jenkins/.jenkins/jobs/oxTrust_4.2.1/workspace/service/src/main/java/org/gluu/oxtrust/service/ConfigurationService.java:101: warning: no @param for dn
	public boolean containsConfiguration(String dn) {
	               ^
/home/jenkins/.jenkins/jobs/oxTrust_4.2.1/workspace/service/src/main/java/org/gluu/oxtrust/service/ConfigurationService.java:111: error: exception not thrown: java.lang.Exception
	 * @throws Exception
	           ^
/home/jenkins/.jenkins/jobs/oxTrust_4.2.1/workspace/service/src/main/java/org/gluu/oxtrust/service/ConfigurationService.java:111: warning: no description for @throws
	 * @throws Exception
	   ^
/home/jenkins/.jenkins/jobs/oxTrust_4.2.1/workspace/service/src/main/java/org/gluu/oxtrust/service/ConfigurationService.java:121: error: exception not thrown: java.lang.Exception
	 * @throws Exception
	           ^
/home/jenkins/.jenkins/jobs/oxTrust_4.2.1/workspace/service/src/main/java/org/gluu/oxtrust/service/ConfigurationService.java:121: warning: no description for @throws
	 * @throws Exception
	   ^
/home/jenkins/.jenkins/jobs/oxTrust_4.2.1/workspace/service/src/main/java/org/gluu/oxtrust/service/ConfigurationService.java:123: warning: no @param for returnAttributes
	public GluuConfiguration getConfiguration(String[] returnAttributes) {
	                         ^
/home/jenkins/.jenkins/jobs/oxTrust_4.2.1/workspace/service/src/main/java/org/gluu/oxtrust/service/ConfigurationService.java:145: error: exception not thrown: java.lang.Exception
	 * @throws Exception
	           ^
/home/jenkins/.jenkins/jobs/oxTrust_4.2.1/workspace/service/src/main/java/org/gluu/oxtrust/service/ConfigurationService.java:145: warning: no description for @throws
	 * @throws Exception
	   ^
/home/jenkins/.jenkins/jobs/oxTrust_4.2.1/workspace/service/src/main/java/org/gluu/oxtrust/service/ConfigurationService.java:159: error: exception not thrown: java.lang.Exception
	 * @throws Exception
	           ^
/home/jenkins/.jenkins/jobs/oxTrust_4.2.1/workspace/service/src/main/java/org/gluu/oxtrust/service/ConfigurationService.java:159: warning: no description for @throws
	 * @throws Exception
	   ^
/home/jenkins/.jenkins/jobs/oxTrust_4.2.1/workspace/service/src/main/java/org/gluu/oxtrust/service/ConfigurationService.java:170: error: exception not thrown: java.lang.Exception
	 * @throws Exception
	           ^
/home/jenkins/.jenkins/jobs/oxTrust_4.2.1/workspace/service/src/main/java/org/gluu/oxtrust/service/ConfigurationService.java:170: warning: no description for @throws
	 * @throws Exception
	   ^
/home/jenkins/.jenkins/jobs/oxTrust_4.2.1/workspace/service/src/main/java/org/gluu/oxtrust/service/FederationService.java:72: warning: no @param for dn
	public boolean containsFederationProposal(String dn) {
	               ^
/home/jenkins/.jenkins/jobs/oxTrust_4.2.1/workspace/service/src/main/java/org/gluu/oxtrust/service/FederationService.java:100: warning: no @return
	public List<GluuSAMLFederationProposal> getAllFederationProposals() {
	                                        ^
/home/jenkins/.jenkins/jobs/oxTrust_4.2.1/workspace/service/src/main/java/org/gluu/oxtrust/service/GroupService.java:297: warning: no description for @param
	 * @param group
	   ^
/home/jenkins/.jenkins/jobs/oxTrust_4.2.1/workspace/service/src/main/java/org/gluu/oxtrust/service/GroupService.java:298: warning: no description for @param
	 * @param sizeLimit
	   ^
/home/jenkins/.jenkins/jobs/oxTrust_4.2.1/workspace/service/src/main/java/org/gluu/oxtrust/service/GroupService.java:299: warning: no description for @return
	 * @return
	   ^
/home/jenkins/.jenkins/jobs/oxTrust_4.2.1/workspace/service/src/main/java/org/gluu/oxtrust/service/IGroupService.java:21: warning: no @throws for java.lang.Exception
	public abstract void addGroup(GluuGroup group) throws Exception;
	                     ^
/home/jenkins/.jenkins/jobs/oxTrust_4.2.1/workspace/service/src/main/java/org/gluu/oxtrust/service/IGroupService.java:65: error: exception not thrown: java.lang.Exception
	 * @throws Exception
	           ^
/home/jenkins/.jenkins/jobs/oxTrust_4.2.1/workspace/service/src/main/java/org/gluu/oxtrust/service/IGroupService.java:65: warning: no description for @throws
	 * @throws Exception
	   ^
/home/jenkins/.jenkins/jobs/oxTrust_4.2.1/workspace/service/src/main/java/org/gluu/oxtrust/service/IGroupService.java:75: warning: no @throws for java.lang.Exception
	public abstract void updateGroup(GluuGroup group) throws Exception;
	                     ^
/home/jenkins/.jenkins/jobs/oxTrust_4.2.1/workspace/service/src/main/java/org/gluu/oxtrust/service/IGroupService.java:83: warning: no description for @throws
	 * @throws Exception
	   ^
/home/jenkins/.jenkins/jobs/oxTrust_4.2.1/workspace/service/src/main/java/org/gluu/oxtrust/service/IGroupService.java:96: warning: no @throws for java.lang.Exception
	public abstract List<GluuGroup> searchGroups(String pattern, int sizeLimit) throws Exception;
	                                ^
/home/jenkins/.jenkins/jobs/oxTrust_4.2.1/workspace/service/src/main/java/org/gluu/oxtrust/service/IGroupService.java:103: warning: no @throws for java.lang.Exception
	public abstract GluuGroupVisibility[] getVisibilityTypes() throws Exception;
	                                      ^
/home/jenkins/.jenkins/jobs/oxTrust_4.2.1/workspace/service/src/main/java/org/gluu/oxtrust/service/IGroupService.java:111: warning: no @param for Dn
	public abstract GluuGroup getGroupByDn(String Dn);
	                          ^
/home/jenkins/.jenkins/jobs/oxTrust_4.2.1/workspace/service/src/main/java/org/gluu/oxtrust/service/IGroupService.java:116: warning: no description for @param
	 * @param DisplayName
	   ^
/home/jenkins/.jenkins/jobs/oxTrust_4.2.1/workspace/service/src/main/java/org/gluu/oxtrust/service/IGroupService.java:119: warning: no @throws for java.lang.Exception
	public abstract GluuGroup getGroupByDisplayName(String DisplayName) throws Exception;
	                          ^
/home/jenkins/.jenkins/jobs/oxTrust_4.2.1/workspace/service/src/main/java/org/gluu/oxtrust/service/IGroupService.java:124: warning: no description for @param
	 * @param group
	   ^
/home/jenkins/.jenkins/jobs/oxTrust_4.2.1/workspace/service/src/main/java/org/gluu/oxtrust/service/IGroupService.java:125: warning: no description for @param
	 * @param sizeLimit
	   ^
/home/jenkins/.jenkins/jobs/oxTrust_4.2.1/workspace/service/src/main/java/org/gluu/oxtrust/service/IGroupService.java:126: warning: no description for @return
	 * @return
	   ^
/home/jenkins/.jenkins/jobs/oxTrust_4.2.1/workspace/service/src/main/java/org/gluu/oxtrust/service/IPersonService.java:26: warning: no description for @throws
	 * @throws DuplicateEntryException
	   ^
/home/jenkins/.jenkins/jobs/oxTrust_4.2.1/workspace/service/src/main/java/org/gluu/oxtrust/service/IPersonService.java:37: warning: no description for @throws
	 * @throws Exception 
	   ^
/home/jenkins/.jenkins/jobs/oxTrust_4.2.1/workspace/service/src/main/java/org/gluu/oxtrust/service/IPersonService.java:92: warning: no @throws for java.lang.Exception
	public abstract List<GluuCustomPerson> searchPersons(String pattern, int sizeLimit,
	                                       ^
/home/jenkins/.jenkins/jobs/oxTrust_4.2.1/workspace/service/src/main/java/org/gluu/oxtrust/service/IPersonService.java:107: warning: no @param for person
	public abstract boolean containsPerson(GluuCustomPerson person);
	                        ^
/home/jenkins/.jenkins/jobs/oxTrust_4.2.1/workspace/service/src/main/java/org/gluu/oxtrust/service/IPersonService.java:123: error: @param name not found
	 * @param returnClass
	          ^
/home/jenkins/.jenkins/jobs/oxTrust_4.2.1/workspace/service/src/main/java/org/gluu/oxtrust/service/IPersonService.java:138: warning: no @param for returnAttributes
	public abstract GluuCustomPerson getPersonByUid(String uid, String... returnAttributes);
	                                 ^
/home/jenkins/.jenkins/jobs/oxTrust_4.2.1/workspace/service/src/main/java/org/gluu/oxtrust/service/IPersonService.java:156: error: exception not thrown: java.lang.Exception
	 * @throws Exception
	           ^
/home/jenkins/.jenkins/jobs/oxTrust_4.2.1/workspace/service/src/main/java/org/gluu/oxtrust/service/IPersonService.java:156: warning: no description for @throws
	 * @throws Exception
	   ^
/home/jenkins/.jenkins/jobs/oxTrust_4.2.1/workspace/service/src/main/java/org/gluu/oxtrust/service/IPersonService.java:167: warning: no description for @return
	 * @return
	   ^
/home/jenkins/.jenkins/jobs/oxTrust_4.2.1/workspace/service/src/main/java/org/gluu/oxtrust/service/IPersonService.java:179: error: @param name not found
	 * @param email
	          ^
/home/jenkins/.jenkins/jobs/oxTrust_4.2.1/workspace/service/src/main/java/org/gluu/oxtrust/service/IPersonService.java:183: warning: no @param for mail
	public abstract GluuCustomPerson getPersonByEmail(String mail, String... returnAttributes);
	                                 ^
/home/jenkins/.jenkins/jobs/oxTrust_4.2.1/workspace/service/src/main/java/org/gluu/oxtrust/service/IPersonService.java:183: warning: no @param for returnAttributes
	public abstract GluuCustomPerson getPersonByEmail(String mail, String... returnAttributes);
	                                 ^
/home/jenkins/.jenkins/jobs/oxTrust_4.2.1/workspace/service/src/main/java/org/gluu/oxtrust/service/IPersonService.java:194: warning: no @throws for java.lang.Exception
	public abstract GluuCustomPerson getPersonByAttribute(String attribute, String value) throws Exception;
	                                 ^
/home/jenkins/.jenkins/jobs/oxTrust_4.2.1/workspace/service/src/main/java/org/gluu/oxtrust/service/IPersonService.java:212: error: unknown tag: Person
	 * @return List <Person>
	                ^
/home/jenkins/.jenkins/jobs/oxTrust_4.2.1/workspace/service/src/main/java/org/gluu/oxtrust/service/IPersonService.java:214: warning: no @throws for java.lang.Exception
	public List<GluuCustomPerson> getPersonsByAttribute(String attribute, String value) throws Exception;
	                              ^
/home/jenkins/.jenkins/jobs/oxTrust_4.2.1/workspace/service/src/main/java/org/gluu/oxtrust/service/OrganizationService.java:78: warning: no @param for dn
	public boolean containsOrganization(String dn) {
	               ^
/home/jenkins/.jenkins/jobs/oxTrust_4.2.1/workspace/service/src/main/java/org/gluu/oxtrust/service/PassportService.java:73: error: @param name not found
	 * @param LdapOxPassportConfiguration
	          ^
/home/jenkins/.jenkins/jobs/oxTrust_4.2.1/workspace/service/src/main/java/org/gluu/oxtrust/service/PassportService.java:76: warning: no @param for ldapOxPassportConfiguration
	public void updateLdapOxPassportConfiguration(LdapOxPassportConfiguration ldapOxPassportConfiguration) {
	            ^
/home/jenkins/.jenkins/jobs/oxTrust_4.2.1/workspace/service/src/main/java/org/gluu/oxtrust/service/PersonService.java:624: error: unknown tag: Person
	 * @return List <Person>
	                ^
/home/jenkins/.jenkins/jobs/oxTrust_4.2.1/workspace/service/src/main/java/org/gluu/oxtrust/service/ScopeService.java:51: warning: no @throws for java.lang.Exception
	public void addScope(Scope scope) throws Exception {
	            ^
/home/jenkins/.jenkins/jobs/oxTrust_4.2.1/workspace/service/src/main/java/org/gluu/oxtrust/service/ScopeService.java:61: warning: no @throws for java.lang.Exception
	public void removeScope(Scope scope) throws Exception {
	            ^
/home/jenkins/.jenkins/jobs/oxTrust_4.2.1/workspace/service/src/main/java/org/gluu/oxtrust/service/ScopeService.java:73: warning: no @throws for java.lang.Exception
	public Scope getScopeByInum(String inum) throws Exception {
	             ^
/home/jenkins/.jenkins/jobs/oxTrust_4.2.1/workspace/service/src/main/java/org/gluu/oxtrust/service/ScopeService.java:89: warning: no description for @throws
	 * @throws Exception
	   ^
/home/jenkins/.jenkins/jobs/oxTrust_4.2.1/workspace/service/src/main/java/org/gluu/oxtrust/service/ScopeService.java:105: warning: no @throws for java.lang.Exception
	public void updateScope(Scope scope) throws Exception {
	            ^
/home/jenkins/.jenkins/jobs/oxTrust_4.2.1/workspace/service/src/main/java/org/gluu/oxtrust/service/ScopeService.java:114: warning: no @throws for java.lang.Exception
	public String generateInumForNewScope() throws Exception {
	              ^
/home/jenkins/.jenkins/jobs/oxTrust_4.2.1/workspace/service/src/main/java/org/gluu/oxtrust/service/ScopeService.java:134: error: exception not thrown: java.lang.Exception
	 * @throws Exception
	           ^
/home/jenkins/.jenkins/jobs/oxTrust_4.2.1/workspace/service/src/main/java/org/gluu/oxtrust/service/ScopeService.java:134: warning: no description for @throws
	 * @throws Exception
	   ^
/home/jenkins/.jenkins/jobs/oxTrust_4.2.1/workspace/service/src/main/java/org/gluu/oxtrust/service/ScopeService.java:182: warning: no @param for Dn
	public Scope getScopeByDn(String Dn) throws Exception {
	             ^
/home/jenkins/.jenkins/jobs/oxTrust_4.2.1/workspace/service/src/main/java/org/gluu/oxtrust/service/ScopeService.java:182: warning: no @throws for java.lang.Exception
	public Scope getScopeByDn(String Dn) throws Exception {
	             ^
/home/jenkins/.jenkins/jobs/oxTrust_4.2.1/workspace/service/src/main/java/org/gluu/oxtrust/service/ScopeService.java:201: warning: no description for @param
	 * @param DisplayName
	   ^
/home/jenkins/.jenkins/jobs/oxTrust_4.2.1/workspace/service/src/main/java/org/gluu/oxtrust/service/ScopeService.java:204: warning: no @throws for java.lang.Exception
	public Scope getScopeByDisplayName(String DisplayName) throws Exception {
	             ^
/home/jenkins/.jenkins/jobs/oxTrust_4.2.1/workspace/service/src/main/java/org/gluu/oxtrust/service/SectorIdentifierService.java:48: error: exception not thrown: java.lang.Exception
	 * @throws Exception
	           ^
/home/jenkins/.jenkins/jobs/oxTrust_4.2.1/workspace/service/src/main/java/org/gluu/oxtrust/service/SectorIdentifierService.java:48: warning: no description for @throws
	 * @throws Exception
	   ^
/home/jenkins/.jenkins/jobs/oxTrust_4.2.1/workspace/service/src/main/java/org/gluu/oxtrust/service/SectorIdentifierService.java:102: error: exception not thrown: java.lang.Exception
	 * @throws Exception
	           ^
/home/jenkins/.jenkins/jobs/oxTrust_4.2.1/workspace/service/src/main/java/org/gluu/oxtrust/service/SectorIdentifierService.java:102: warning: no description for @throws
	 * @throws Exception
	   ^
/home/jenkins/.jenkins/jobs/oxTrust_4.2.1/workspace/service/src/main/java/org/gluu/oxtrust/service/Shibboleth3ConfService.java:1151: warning: no @return
    public boolean generateMetadataFiles() {
                   ^
/home/jenkins/.jenkins/jobs/oxTrust_4.2.1/workspace/service/src/main/java/org/gluu/oxtrust/service/Shibboleth3ConfService.java:1232: error: @param name not found
     * @param stream
              ^
/home/jenkins/.jenkins/jobs/oxTrust_4.2.1/workspace/service/src/main/java/org/gluu/oxtrust/service/Shibboleth3ConfService.java:1232: warning: no description for @param
     * @param stream
       ^
/home/jenkins/.jenkins/jobs/oxTrust_4.2.1/workspace/service/src/main/java/org/gluu/oxtrust/service/Shibboleth3ConfService.java:1233: warning: no description for @throws
     * @throws IOException
       ^
/home/jenkins/.jenkins/jobs/oxTrust_4.2.1/workspace/service/src/main/java/org/gluu/oxtrust/service/Shibboleth3ConfService.java:1234: warning: no description for @throws
     * @throws SAXException
       ^
/home/jenkins/.jenkins/jobs/oxTrust_4.2.1/workspace/service/src/main/java/org/gluu/oxtrust/service/Shibboleth3ConfService.java:1235: warning: no description for @throws
     * @throws ParserConfigurationException
       ^
/home/jenkins/.jenkins/jobs/oxTrust_4.2.1/workspace/service/src/main/java/org/gluu/oxtrust/service/Shibboleth3ConfService.java:1237: warning: no description for @throws
     * @throws XMLParserException
       ^
/home/jenkins/.jenkins/jobs/oxTrust_4.2.1/workspace/service/src/main/java/org/gluu/oxtrust/service/Shibboleth3ConfService.java:1239: warning: no @param for metadataPath
    public GluuErrorHandler validateMetadata(String metadataPath)
                            ^
/home/jenkins/.jenkins/jobs/oxTrust_4.2.1/workspace/service/src/main/java/org/gluu/oxtrust/service/Shibboleth3ConfService.java:1280: warning: no description for @param
     * @param trustRelationship
       ^
/home/jenkins/.jenkins/jobs/oxTrust_4.2.1/workspace/service/src/main/java/org/gluu/oxtrust/service/Shibboleth3ConfService.java:1281: warning: no description for @return
     * @return
       ^
/home/jenkins/.jenkins/jobs/oxTrust_4.2.1/workspace/service/src/main/java/org/gluu/oxtrust/service/Shibboleth3ConfService.java:1306: warning: no description for @param
     * @param trustRelationship
       ^
/home/jenkins/.jenkins/jobs/oxTrust_4.2.1/workspace/service/src/main/java/org/gluu/oxtrust/service/Shibboleth3ConfService.java:1307: warning: no description for @param
     * @param certificate
       ^
/home/jenkins/.jenkins/jobs/oxTrust_4.2.1/workspace/service/src/main/java/org/gluu/oxtrust/service/Shibboleth3ConfService.java:1308: warning: no description for @throws
     * @throws IOException
       ^
/home/jenkins/.jenkins/jobs/oxTrust_4.2.1/workspace/service/src/main/java/org/gluu/oxtrust/service/Shibboleth3ConfService.java:1328: warning: no description for @param
     * @param trustRelationship
       ^
/home/jenkins/.jenkins/jobs/oxTrust_4.2.1/workspace/service/src/main/java/org/gluu/oxtrust/service/Shibboleth3ConfService.java:1329: warning: no description for @param
     * @param key
       ^
/home/jenkins/.jenkins/jobs/oxTrust_4.2.1/workspace/service/src/main/java/org/gluu/oxtrust/service/Shibboleth3ConfService.java:1330: warning: no description for @throws
     * @throws IOException
       ^
/home/jenkins/.jenkins/jobs/oxTrust_4.2.1/workspace/service/src/main/java/org/gluu/oxtrust/service/SSLService.java:63: warning: no description for @param
	 * @param fileName
	   ^
/home/jenkins/.jenkins/jobs/oxTrust_4.2.1/workspace/service/src/main/java/org/gluu/oxtrust/service/SSLService.java:64: warning: no description for @return
	 * @return
	   ^
/home/jenkins/.jenkins/jobs/oxTrust_4.2.1/workspace/service/src/main/java/org/gluu/oxtrust/service/SSLService.java:79: error: @param name not found
	 * @param certStream
	          ^
/home/jenkins/.jenkins/jobs/oxTrust_4.2.1/workspace/service/src/main/java/org/gluu/oxtrust/service/SSLService.java:79: warning: no description for @param
	 * @param certStream
	   ^
/home/jenkins/.jenkins/jobs/oxTrust_4.2.1/workspace/service/src/main/java/org/gluu/oxtrust/service/SSLService.java:80: warning: no description for @return
	 * @return
	   ^
/home/jenkins/.jenkins/jobs/oxTrust_4.2.1/workspace/service/src/main/java/org/gluu/oxtrust/service/SSLService.java:82: warning: no @param for cert
	public X509Certificate getPEMCertificate(byte[] cert) {
	                       ^
/home/jenkins/.jenkins/jobs/oxTrust_4.2.1/workspace/service/src/main/java/org/gluu/oxtrust/service/SSLService.java:93: warning: no description for @param
	 * @param certStream
	   ^
/home/jenkins/.jenkins/jobs/oxTrust_4.2.1/workspace/service/src/main/java/org/gluu/oxtrust/service/SSLService.java:94: warning: no description for @return
	 * @return
	   ^
/home/jenkins/.jenkins/jobs/oxTrust_4.2.1/workspace/service/src/main/java/org/gluu/oxtrust/service/SSLService.java:108: warning: no description for @param
	 * @param certStream
	   ^
/home/jenkins/.jenkins/jobs/oxTrust_4.2.1/workspace/service/src/main/java/org/gluu/oxtrust/service/SSLService.java:109: warning: no description for @return
	 * @return
	   ^
/home/jenkins/.jenkins/jobs/oxTrust_4.2.1/workspace/service/src/main/java/org/gluu/oxtrust/service/SSLService.java:111: warning: no @throws for java.lang.Exception
	public static X509Certificate getPEMCertificateStatic(InputStream certStream) throws Exception {
	                              ^
/home/jenkins/.jenkins/jobs/oxTrust_4.2.1/workspace/service/src/main/java/org/gluu/oxtrust/service/SSLService.java:138: warning: no @throws for java.lang.Exception
	public static X509Certificate[] loadCertificates(InputStream is) throws Exception {
	                                ^
/home/jenkins/.jenkins/jobs/oxTrust_4.2.1/workspace/service/src/main/java/org/gluu/oxtrust/service/SSLService.java:151: warning: no @throws for java.lang.Exception
	public static X509Certificate[] loadCertificates(byte[] certsBytes) throws Exception {
	                                ^
/home/jenkins/.jenkins/jobs/oxTrust_4.2.1/workspace/service/src/main/java/org/gluu/oxtrust/service/uma/ResourceSetService.java:209: error: @param name not found
	 * @param id
	          ^
/home/jenkins/.jenkins/jobs/oxTrust_4.2.1/workspace/service/src/main/java/org/gluu/oxtrust/service/uma/UmaScopeService.java:79: error: @param name not found
	 * @param scopeDescription
	          ^
/home/jenkins/.jenkins/jobs/oxTrust_4.2.1/workspace/service/src/main/java/org/gluu/oxtrust/util/ServiceUtil.java:63: error: invalid use of @return
	 * @return void
	   ^
/home/jenkins/.jenkins/jobs/oxTrust_4.2.1/workspace/service/src/main/java/org/gluu/oxtrust/util/ServiceUtil.java:117: error: invalid use of @return
	 * @return void
	   ^
/home/jenkins/.jenkins/jobs/oxTrust_4.2.1/workspace/service/src/main/java/org/gluu/oxtrust/util/ServiceUtil.java:161: error: invalid use of @return
	 * @return void
	   ^

Command line was: /usr/lib/jvm/java-1.8.0-openjdk-1.8.0.312.b07-1.el7_9.x86_64/jre/../bin/javadoc @options @packages

Refer to the generated Javadoc files in '/home/jenkins/.jenkins/jobs/oxTrust_4.2.1/workspace/service/target/site/apidocs' dir.

org.apache.maven.reporting.MavenReportException: 
Exit code: 1 - javadoc: warning - Multiple sources of package comments found for package "javax.interceptor"
/home/jenkins/.jenkins/jobs/oxTrust_4.2.1/workspace/service/src/main/java/org/gluu/oxtrust/auth/uma/ScimUmaProtectionService.java:92: error: @param name not found
     * @param uriInfo An object that allows access to request URI information
              ^
/home/jenkins/.jenkins/jobs/oxTrust_4.2.1/workspace/service/src/main/java/org/gluu/oxtrust/service/AttributeService.java:153: warning: no @param for gluuUserRole
	public List<GluuAttribute> getAllContactAttributes(GluuUserRole gluuUserRole) {
	                           ^
/home/jenkins/.jenkins/jobs/oxTrust_4.2.1/workspace/service/src/main/java/org/gluu/oxtrust/service/AttributeService.java:234: error: @param name not found
	 * @param attributes
	          ^
/home/jenkins/.jenkins/jobs/oxTrust_4.2.1/workspace/service/src/main/java/org/gluu/oxtrust/service/AttributeService.java:242: warning: no @param for attributeOriginList
	public Map<String, String> getAllAttributeOriginDisplayNames(List<String> attributeOriginList,
	                           ^
/home/jenkins/.jenkins/jobs/oxTrust_4.2.1/workspace/service/src/main/java/org/gluu/oxtrust/service/AttributeService.java:305: warning: no @throws for java.lang.Exception
	public List<GluuAttribute> getSCIMRelatedAttributes() throws Exception {
	                           ^
/home/jenkins/.jenkins/jobs/oxTrust_4.2.1/workspace/service/src/main/java/org/gluu/oxtrust/service/AttributeService.java:316: warning: no @throws for java.lang.Exception
	public List<GluuAttribute> getSCIMRelatedAttributesImpl(List<GluuAttribute> attributes) throws Exception {
	                           ^
/home/jenkins/.jenkins/jobs/oxTrust_4.2.1/workspace/service/src/main/java/org/gluu/oxtrust/service/AttributeService.java:349: error: @param name not found
	 * @param inum
	          ^
/home/jenkins/.jenkins/jobs/oxTrust_4.2.1/workspace/service/src/main/java/org/gluu/oxtrust/service/AttributeService.java:352: warning: no @param for attribute
	public void removeAttribute(GluuAttribute attribute) {
	            ^
/home/jenkins/.jenkins/jobs/oxTrust_4.2.1/workspace/service/src/main/java/org/gluu/oxtrust/service/AttributeService.java:372: warning: no @param for event
	public void clearAttributesCache(@Observes @EventType(Events.EVENT_CLEAR_ATTRIBUTES) Events event) {
	            ^
/home/jenkins/.jenkins/jobs/oxTrust_4.2.1/workspace/service/src/main/java/org/gluu/oxtrust/service/AttributeService.java:478: error: @param name not found
	 * @param customAttributes
	          ^
/home/jenkins/.jenkins/jobs/oxTrust_4.2.1/workspace/service/src/main/java/org/gluu/oxtrust/service/AttributeService.java:480: error: @param name not found
	 * @param attributes
	          ^
/home/jenkins/.jenkins/jobs/oxTrust_4.2.1/workspace/service/src/main/java/org/gluu/oxtrust/service/AttributeService.java:483: warning: no @param for attributeDNs
	public List<GluuCustomAttribute> getCustomAttributesByAttributeDNs(List<String> attributeDNs,
	                                 ^
/home/jenkins/.jenkins/jobs/oxTrust_4.2.1/workspace/service/src/main/java/org/gluu/oxtrust/service/AttributeService.java:483: warning: no @param for attributesByDNs
	public List<GluuCustomAttribute> getCustomAttributesByAttributeDNs(List<String> attributeDNs,
	                                 ^
/home/jenkins/.jenkins/jobs/oxTrust_4.2.1/workspace/service/src/main/java/org/gluu/oxtrust/service/AttributeService.java:483: warning: no @return
	public List<GluuCustomAttribute> getCustomAttributesByAttributeDNs(List<String> attributeDNs,
	                                 ^
/home/jenkins/.jenkins/jobs/oxTrust_4.2.1/workspace/service/src/main/java/org/gluu/oxtrust/service/AttributeService.java:519: warning: no @throws for java.lang.Exception
	public String getDnForGroup(String inum) throws Exception {
	              ^
/home/jenkins/.jenkins/jobs/oxTrust_4.2.1/workspace/service/src/main/java/org/gluu/oxtrust/service/AttributeService.java:529: warning: no description for @param
	 * @param admin
	   ^
/home/jenkins/.jenkins/jobs/oxTrust_4.2.1/workspace/service/src/main/java/org/gluu/oxtrust/service/AttributeService.java:530: warning: no description for @return
	 * @return
	   ^
/home/jenkins/.jenkins/jobs/oxTrust_4.2.1/workspace/service/src/main/java/org/gluu/oxtrust/service/AttributeService.java:581: warning: no description for @throws
	 * @throws Exception
	   ^
/home/jenkins/.jenkins/jobs/oxTrust_4.2.1/workspace/service/src/main/java/org/gluu/oxtrust/service/ClientService.java:67: warning: no description for @param
	 * @param client
	   ^
/home/jenkins/.jenkins/jobs/oxTrust_4.2.1/workspace/service/src/main/java/org/gluu/oxtrust/service/ClientService.java:76: warning: no description for @param
	 * @param client
	   ^
/home/jenkins/.jenkins/jobs/oxTrust_4.2.1/workspace/service/src/main/java/org/gluu/oxtrust/service/ClientService.java:89: warning: no @param for ldapReturnAttributes
	public OxAuthClient getClientByInum(String inum, String... ldapReturnAttributes) {
	                    ^
/home/jenkins/.jenkins/jobs/oxTrust_4.2.1/workspace/service/src/main/java/org/gluu/oxtrust/service/ClientService.java:204: warning: no @param for Dn
	public OxAuthClient getClientByDn(String Dn) {
	                    ^
/home/jenkins/.jenkins/jobs/oxTrust_4.2.1/workspace/service/src/main/java/org/gluu/oxtrust/service/ClientService.java:220: warning: no @param for Dn
	public OxAuthCustomClient getClientByDnCustom(String Dn) {
	                          ^
/home/jenkins/.jenkins/jobs/oxTrust_4.2.1/workspace/service/src/main/java/org/gluu/oxtrust/service/ClientService.java:233: warning: no description for @param
	 * @param DisplayName
	   ^
/home/jenkins/.jenkins/jobs/oxTrust_4.2.1/workspace/service/src/main/java/org/gluu/oxtrust/service/ClientService.java:235: error: exception not thrown: java.lang.Exception
	 * @throws Exception
	           ^
/home/jenkins/.jenkins/jobs/oxTrust_4.2.1/workspace/service/src/main/java/org/gluu/oxtrust/service/ClientService.java:235: warning: no description for @throws
	 * @throws Exception
	   ^
/home/jenkins/.jenkins/jobs/oxTrust_4.2.1/workspace/service/src/main/java/org/gluu/oxtrust/service/ClientService.java:252: warning: no description for @param
	 * @param name
	   ^
/home/jenkins/.jenkins/jobs/oxTrust_4.2.1/workspace/service/src/main/java/org/gluu/oxtrust/service/ClientService.java:253: warning: no description for @param
	 * @param value
	   ^
/home/jenkins/.jenkins/jobs/oxTrust_4.2.1/workspace/service/src/main/java/org/gluu/oxtrust/service/ConfigurationService.java:101: warning: no @param for dn
	public boolean containsConfiguration(String dn) {
	               ^
/home/jenkins/.jenkins/jobs/oxTrust_4.2.1/workspace/service/src/main/java/org/gluu/oxtrust/service/ConfigurationService.java:111: error: exception not thrown: java.lang.Exception
	 * @throws Exception
	           ^
/home/jenkins/.jenkins/jobs/oxTrust_4.2.1/workspace/service/src/main/java/org/gluu/oxtrust/service/ConfigurationService.java:111: warning: no description for @throws
	 * @throws Exception
	   ^
/home/jenkins/.jenkins/jobs/oxTrust_4.2.1/workspace/service/src/main/java/org/gluu/oxtrust/service/ConfigurationService.java:121: error: exception not thrown: java.lang.Exception
	 * @throws Exception
	           ^
/home/jenkins/.jenkins/jobs/oxTrust_4.2.1/workspace/service/src/main/java/org/gluu/oxtrust/service/ConfigurationService.java:121: warning: no description for @throws
	 * @throws Exception
	   ^
/home/jenkins/.jenkins/jobs/oxTrust_4.2.1/workspace/service/src/main/java/org/gluu/oxtrust/service/ConfigurationService.java:123: warning: no @param for returnAttributes
	public GluuConfiguration getConfiguration(String[] returnAttributes) {
	                         ^
/home/jenkins/.jenkins/jobs/oxTrust_4.2.1/workspace/service/src/main/java/org/gluu/oxtrust/service/ConfigurationService.java:145: error: exception not thrown: java.lang.Exception
	 * @throws Exception
	           ^
/home/jenkins/.jenkins/jobs/oxTrust_4.2.1/workspace/service/src/main/java/org/gluu/oxtrust/service/ConfigurationService.java:145: warning: no description for @throws
	 * @throws Exception
	   ^
/home/jenkins/.jenkins/jobs/oxTrust_4.2.1/workspace/service/src/main/java/org/gluu/oxtrust/service/ConfigurationService.java:159: error: exception not thrown: java.lang.Exception
	 * @throws Exception
	           ^
/home/jenkins/.jenkins/jobs/oxTrust_4.2.1/workspace/service/src/main/java/org/gluu/oxtrust/service/ConfigurationService.java:159: warning: no description for @throws
	 * @throws Exception
	   ^
/home/jenkins/.jenkins/jobs/oxTrust_4.2.1/workspace/service/src/main/java/org/gluu/oxtrust/service/ConfigurationService.java:170: error: exception not thrown: java.lang.Exception
	 * @throws Exception
	           ^
/home/jenkins/.jenkins/jobs/oxTrust_4.2.1/workspace/service/src/main/java/org/gluu/oxtrust/service/ConfigurationService.java:170: warning: no description for @throws
	 * @throws Exception
	   ^
/home/jenkins/.jenkins/jobs/oxTrust_4.2.1/workspace/service/src/main/java/org/gluu/oxtrust/service/FederationService.java:72: warning: no @param for dn
	public boolean containsFederationProposal(String dn) {
	               ^
/home/jenkins/.jenkins/jobs/oxTrust_4.2.1/workspace/service/src/main/java/org/gluu/oxtrust/service/FederationService.java:100: warning: no @return
	public List<GluuSAMLFederationProposal> getAllFederationProposals() {
	                                        ^
/home/jenkins/.jenkins/jobs/oxTrust_4.2.1/workspace/service/src/main/java/org/gluu/oxtrust/service/GroupService.java:297: warning: no description for @param
	 * @param group
	   ^
/home/jenkins/.jenkins/jobs/oxTrust_4.2.1/workspace/service/src/main/java/org/gluu/oxtrust/service/GroupService.java:298: warning: no description for @param
	 * @param sizeLimit
	   ^
/home/jenkins/.jenkins/jobs/oxTrust_4.2.1/workspace/service/src/main/java/org/gluu/oxtrust/service/GroupService.java:299: warning: no description for @return
	 * @return
	   ^
/home/jenkins/.jenkins/jobs/oxTrust_4.2.1/workspace/service/src/main/java/org/gluu/oxtrust/service/IGroupService.java:21: warning: no @throws for java.lang.Exception
	public abstract void addGroup(GluuGroup group) throws Exception;
	                     ^
/home/jenkins/.jenkins/jobs/oxTrust_4.2.1/workspace/service/src/main/java/org/gluu/oxtrust/service/IGroupService.java:65: error: exception not thrown: java.lang.Exception
	 * @throws Exception
	           ^
/home/jenkins/.jenkins/jobs/oxTrust_4.2.1/workspace/service/src/main/java/org/gluu/oxtrust/service/IGroupService.java:65: warning: no description for @throws
	 * @throws Exception
	   ^
/home/jenkins/.jenkins/jobs/oxTrust_4.2.1/workspace/service/src/main/java/org/gluu/oxtrust/service/IGroupService.java:75: warning: no @throws for java.lang.Exception
	public abstract void updateGroup(GluuGroup group) throws Exception;
	                     ^
/home/jenkins/.jenkins/jobs/oxTrust_4.2.1/workspace/service/src/main/java/org/gluu/oxtrust/service/IGroupService.java:83: warning: no description for @throws
	 * @throws Exception
	   ^
/home/jenkins/.jenkins/jobs/oxTrust_4.2.1/workspace/service/src/main/java/org/gluu/oxtrust/service/IGroupService.java:96: warning: no @throws for java.lang.Exception
	public abstract List<GluuGroup> searchGroups(String pattern, int sizeLimit) throws Exception;
	                                ^
/home/jenkins/.jenkins/jobs/oxTrust_4.2.1/workspace/service/src/main/java/org/gluu/oxtrust/service/IGroupService.java:103: warning: no @throws for java.lang.Exception
	public abstract GluuGroupVisibility[] getVisibilityTypes() throws Exception;
	                                      ^
/home/jenkins/.jenkins/jobs/oxTrust_4.2.1/workspace/service/src/main/java/org/gluu/oxtrust/service/IGroupService.java:111: warning: no @param for Dn
	public abstract GluuGroup getGroupByDn(String Dn);
	                          ^
/home/jenkins/.jenkins/jobs/oxTrust_4.2.1/workspace/service/src/main/java/org/gluu/oxtrust/service/IGroupService.java:116: warning: no description for @param
	 * @param DisplayName
	   ^
/home/jenkins/.jenkins/jobs/oxTrust_4.2.1/workspace/service/src/main/java/org/gluu/oxtrust/service/IGroupService.java:119: warning: no @throws for java.lang.Exception
	public abstract GluuGroup getGroupByDisplayName(String DisplayName) throws Exception;
	                          ^
/home/jenkins/.jenkins/jobs/oxTrust_4.2.1/workspace/service/src/main/java/org/gluu/oxtrust/service/IGroupService.java:124: warning: no description for @param
	 * @param group
	   ^
/home/jenkins/.jenkins/jobs/oxTrust_4.2.1/workspace/service/src/main/java/org/gluu/oxtrust/service/IGroupService.java:125: warning: no description for @param
	 * @param sizeLimit
	   ^
/home/jenkins/.jenkins/jobs/oxTrust_4.2.1/workspace/service/src/main/java/org/gluu/oxtrust/service/IGroupService.java:126: warning: no description for @return
	 * @return
	   ^
/home/jenkins/.jenkins/jobs/oxTrust_4.2.1/workspace/service/src/main/java/org/gluu/oxtrust/service/IPersonService.java:26: warning: no description for @throws
	 * @throws DuplicateEntryException
	   ^
/home/jenkins/.jenkins/jobs/oxTrust_4.2.1/workspace/service/src/main/java/org/gluu/oxtrust/service/IPersonService.java:37: warning: no description for @throws
	 * @throws Exception 
	   ^
/home/jenkins/.jenkins/jobs/oxTrust_4.2.1/workspace/service/src/main/java/org/gluu/oxtrust/service/IPersonService.java:92: warning: no @throws for java.lang.Exception
	public abstract List<GluuCustomPerson> searchPersons(String pattern, int sizeLimit,
	                                       ^
/home/jenkins/.jenkins/jobs/oxTrust_4.2.1/workspace/service/src/main/java/org/gluu/oxtrust/service/IPersonService.java:107: warning: no @param for person
	public abstract boolean containsPerson(GluuCustomPerson person);
	                        ^
/home/jenkins/.jenkins/jobs/oxTrust_4.2.1/workspace/service/src/main/java/org/gluu/oxtrust/service/IPersonService.java:123: error: @param name not found
	 * @param returnClass
	          ^
/home/jenkins/.jenkins/jobs/oxTrust_4.2.1/workspace/service/src/main/java/org/gluu/oxtrust/service/IPersonService.java:138: warning: no @param for returnAttributes
	public abstract GluuCustomPerson getPersonByUid(String uid, String... returnAttributes);
	                                 ^
/home/jenkins/.jenkins/jobs/oxTrust_4.2.1/workspace/service/src/main/java/org/gluu/oxtrust/service/IPersonService.java:156: error: exception not thrown: java.lang.Exception
	 * @throws Exception
	           ^
/home/jenkins/.jenkins/jobs/oxTrust_4.2.1/workspace/service/src/main/java/org/gluu/oxtrust/service/IPersonService.java:156: warning: no description for @throws
	 * @throws Exception
	   ^
/home/jenkins/.jenkins/jobs/oxTrust_4.2.1/workspace/service/src/main/java/org/gluu/oxtrust/service/IPersonService.java:167: warning: no description for @return
	 * @return
	   ^
/home/jenkins/.jenkins/jobs/oxTrust_4.2.1/workspace/service/src/main/java/org/gluu/oxtrust/service/IPersonService.java:179: error: @param name not found
	 * @param email
	          ^
/home/jenkins/.jenkins/jobs/oxTrust_4.2.1/workspace/service/src/main/java/org/gluu/oxtrust/service/IPersonService.java:183: warning: no @param for mail
	public abstract GluuCustomPerson getPersonByEmail(String mail, String... returnAttributes);
	                                 ^
/home/jenkins/.jenkins/jobs/oxTrust_4.2.1/workspace/service/src/main/java/org/gluu/oxtrust/service/IPersonService.java:183: warning: no @param for returnAttributes
	public abstract GluuCustomPerson getPersonByEmail(String mail, String... returnAttributes);
	                                 ^
/home/jenkins/.jenkins/jobs/oxTrust_4.2.1/workspace/service/src/main/java/org/gluu/oxtrust/service/IPersonService.java:194: warning: no @throws for java.lang.Exception
	public abstract GluuCustomPerson getPersonByAttribute(String attribute, String value) throws Exception;
	                                 ^
/home/jenkins/.jenkins/jobs/oxTrust_4.2.1/workspace/service/src/main/java/org/gluu/oxtrust/service/IPersonService.java:212: error: unknown tag: Person
	 * @return List <Person>
	                ^
/home/jenkins/.jenkins/jobs/oxTrust_4.2.1/workspace/service/src/main/java/org/gluu/oxtrust/service/IPersonService.java:214: warning: no @throws for java.lang.Exception
	public List<GluuCustomPerson> getPersonsByAttribute(String attribute, String value) throws Exception;
	                              ^
/home/jenkins/.jenkins/jobs/oxTrust_4.2.1/workspace/service/src/main/java/org/gluu/oxtrust/service/OrganizationService.java:78: warning: no @param for dn
	public boolean containsOrganization(String dn) {
	               ^
/home/jenkins/.jenkins/jobs/oxTrust_4.2.1/workspace/service/src/main/java/org/gluu/oxtrust/service/PassportService.java:73: error: @param name not found
	 * @param LdapOxPassportConfiguration
	          ^
/home/jenkins/.jenkins/jobs/oxTrust_4.2.1/workspace/service/src/main/java/org/gluu/oxtrust/service/PassportService.java:76: warning: no @param for ldapOxPassportConfiguration
	public void updateLdapOxPassportConfiguration(LdapOxPassportConfiguration ldapOxPassportConfiguration) {
	            ^
/home/jenkins/.jenkins/jobs/oxTrust_4.2.1/workspace/service/src/main/java/org/gluu/oxtrust/service/PersonService.java:624: error: unknown tag: Person
	 * @return List <Person>
	                ^
/home/jenkins/.jenkins/jobs/oxTrust_4.2.1/workspace/service/src/main/java/org/gluu/oxtrust/service/ScopeService.java:51: warning: no @throws for java.lang.Exception
	public void addScope(Scope scope) throws Exception {
	            ^
/home/jenkins/.jenkins/jobs/oxTrust_4.2.1/workspace/service/src/main/java/org/gluu/oxtrust/service/ScopeService.java:61: warning: no @throws for java.lang.Exception
	public void removeScope(Scope scope) throws Exception {
	            ^
/home/jenkins/.jenkins/jobs/oxTrust_4.2.1/workspace/service/src/main/java/org/gluu/oxtrust/service/ScopeService.java:73: warning: no @throws for java.lang.Exception
	public Scope getScopeByInum(String inum) throws Exception {
	             ^
/home/jenkins/.jenkins/jobs/oxTrust_4.2.1/workspace/service/src/main/java/org/gluu/oxtrust/service/ScopeService.java:89: warning: no description for @throws
	 * @throws Exception
	   ^
/home/jenkins/.jenkins/jobs/oxTrust_4.2.1/workspace/service/src/main/java/org/gluu/oxtrust/service/ScopeService.java:105: warning: no @throws for java.lang.Exception
	public void updateScope(Scope scope) throws Exception {
	            ^
/home/jenkins/.jenkins/jobs/oxTrust_4.2.1/workspace/service/src/main/java/org/gluu/oxtrust/service/ScopeService.java:114: warning: no @throws for java.lang.Exception
	public String generateInumForNewScope() throws Exception {
	              ^
/home/jenkins/.jenkins/jobs/oxTrust_4.2.1/workspace/service/src/main/java/org/gluu/oxtrust/service/ScopeService.java:134: error: exception not thrown: java.lang.Exception
	 * @throws Exception
	           ^
/home/jenkins/.jenkins/jobs/oxTrust_4.2.1/workspace/service/src/main/java/org/gluu/oxtrust/service/ScopeService.java:134: warning: no description for @throws
	 * @throws Exception
	   ^
/home/jenkins/.jenkins/jobs/oxTrust_4.2.1/workspace/service/src/main/java/org/gluu/oxtrust/service/ScopeService.java:182: warning: no @param for Dn
	public Scope getScopeByDn(String Dn) throws Exception {
	             ^
/home/jenkins/.jenkins/jobs/oxTrust_4.2.1/workspace/service/src/main/java/org/gluu/oxtrust/service/ScopeService.java:182: warning: no @throws for java.lang.Exception
	public Scope getScopeByDn(String Dn) throws Exception {
	             ^
/home/jenkins/.jenkins/jobs/oxTrust_4.2.1/workspace/service/src/main/java/org/gluu/oxtrust/service/ScopeService.java:201: warning: no description for @param
	 * @param DisplayName
	   ^
/home/jenkins/.jenkins/jobs/oxTrust_4.2.1/workspace/service/src/main/java/org/gluu/oxtrust/service/ScopeService.java:204: warning: no @throws for java.lang.Exception
	public Scope getScopeByDisplayName(String DisplayName) throws Exception {
	             ^
/home/jenkins/.jenkins/jobs/oxTrust_4.2.1/workspace/service/src/main/java/org/gluu/oxtrust/service/SectorIdentifierService.java:48: error: exception not thrown: java.lang.Exception
	 * @throws Exception
	           ^
/home/jenkins/.jenkins/jobs/oxTrust_4.2.1/workspace/service/src/main/java/org/gluu/oxtrust/service/SectorIdentifierService.java:48: warning: no description for @throws
	 * @throws Exception
	   ^
/home/jenkins/.jenkins/jobs/oxTrust_4.2.1/workspace/service/src/main/java/org/gluu/oxtrust/service/SectorIdentifierService.java:102: error: exception not thrown: java.lang.Exception
	 * @throws Exception
	           ^
/home/jenkins/.jenkins/jobs/oxTrust_4.2.1/workspace/service/src/main/java/org/gluu/oxtrust/service/SectorIdentifierService.java:102: warning: no description for @throws
	 * @throws Exception
	   ^
/home/jenkins/.jenkins/jobs/oxTrust_4.2.1/workspace/service/src/main/java/org/gluu/oxtrust/service/Shibboleth3ConfService.java:1151: warning: no @return
    public boolean generateMetadataFiles() {
                   ^
/home/jenkins/.jenkins/jobs/oxTrust_4.2.1/workspace/service/src/main/java/org/gluu/oxtrust/service/Shibboleth3ConfService.java:1232: error: @param name not found
     * @param stream
              ^
/home/jenkins/.jenkins/jobs/oxTrust_4.2.1/workspace/service/src/main/java/org/gluu/oxtrust/service/Shibboleth3ConfService.java:1232: warning: no description for @param
     * @param stream
       ^
/home/jenkins/.jenkins/jobs/oxTrust_4.2.1/workspace/service/src/main/java/org/gluu/oxtrust/service/Shibboleth3ConfService.java:1233: warning: no description for @throws
     * @throws IOException
       ^
/home/jenkins/.jenkins/jobs/oxTrust_4.2.1/workspace/service/src/main/java/org/gluu/oxtrust/service/Shibboleth3ConfService.java:1234: warning: no description for @throws
     * @throws SAXException
       ^
/home/jenkins/.jenkins/jobs/oxTrust_4.2.1/workspace/service/src/main/java/org/gluu/oxtrust/service/Shibboleth3ConfService.java:1235: warning: no description for @throws
     * @throws ParserConfigurationException
       ^
/home/jenkins/.jenkins/jobs/oxTrust_4.2.1/workspace/service/src/main/java/org/gluu/oxtrust/service/Shibboleth3ConfService.java:1237: warning: no description for @throws
     * @throws XMLParserException
       ^
/home/jenkins/.jenkins/jobs/oxTrust_4.2.1/workspace/service/src/main/java/org/gluu/oxtrust/service/Shibboleth3ConfService.java:1239: warning: no @param for metadataPath
    public GluuErrorHandler validateMetadata(String metadataPath)
                            ^
/home/jenkins/.jenkins/jobs/oxTrust_4.2.1/workspace/service/src/main/java/org/gluu/oxtrust/service/Shibboleth3ConfService.java:1280: warning: no description for @param
     * @param trustRelationship
       ^
/home/jenkins/.jenkins/jobs/oxTrust_4.2.1/workspace/service/src/main/java/org/gluu/oxtrust/service/Shibboleth3ConfService.java:1281: warning: no description for @return
     * @return
       ^
/home/jenkins/.jenkins/jobs/oxTrust_4.2.1/workspace/service/src/main/java/org/gluu/oxtrust/service/Shibboleth3ConfService.java:1306: warning: no description for @param
     * @param trustRelationship
       ^
/home/jenkins/.jenkins/jobs/oxTrust_4.2.1/workspace/service/src/main/java/org/gluu/oxtrust/service/Shibboleth3ConfService.java:1307: warning: no description for @param
     * @param certificate
       ^
/home/jenkins/.jenkins/jobs/oxTrust_4.2.1/workspace/service/src/main/java/org/gluu/oxtrust/service/Shibboleth3ConfService.java:1308: warning: no description for @throws
     * @throws IOException
       ^
/home/jenkins/.jenkins/jobs/oxTrust_4.2.1/workspace/service/src/main/java/org/gluu/oxtrust/service/Shibboleth3ConfService.java:1328: warning: no description for @param
     * @param trustRelationship
       ^
/home/jenkins/.jenkins/jobs/oxTrust_4.2.1/workspace/service/src/main/java/org/gluu/oxtrust/service/Shibboleth3ConfService.java:1329: warning: no description for @param
     * @param key
       ^
/home/jenkins/.jenkins/jobs/oxTrust_4.2.1/workspace/service/src/main/java/org/gluu/oxtrust/service/Shibboleth3ConfService.java:1330: warning: no description for @throws
     * @throws IOException
       ^
/home/jenkins/.jenkins/jobs/oxTrust_4.2.1/workspace/service/src/main/java/org/gluu/oxtrust/service/SSLService.java:63: warning: no description for @param
	 * @param fileName
	   ^
/home/jenkins/.jenkins/jobs/oxTrust_4.2.1/workspace/service/src/main/java/org/gluu/oxtrust/service/SSLService.java:64: warning: no description for @return
	 * @return
	   ^
/home/jenkins/.jenkins/jobs/oxTrust_4.2.1/workspace/service/src/main/java/org/gluu/oxtrust/service/SSLService.java:79: error: @param name not found
	 * @param certStream
	          ^
/home/jenkins/.jenkins/jobs/oxTrust_4.2.1/workspace/service/src/main/java/org/gluu/oxtrust/service/SSLService.java:79: warning: no description for @param
	 * @param certStream
	   ^
/home/jenkins/.jenkins/jobs/oxTrust_4.2.1/workspace/service/src/main/java/org/gluu/oxtrust/service/SSLService.java:80: warning: no description for @return
	 * @return
	   ^
/home/jenkins/.jenkins/jobs/oxTrust_4.2.1/workspace/service/src/main/java/org/gluu/oxtrust/service/SSLService.java:82: warning: no @param for cert
	public X509Certificate getPEMCertificate(byte[] cert) {
	                       ^
/home/jenkins/.jenkins/jobs/oxTrust_4.2.1/workspace/service/src/main/java/org/gluu/oxtrust/service/SSLService.java:93: warning: no description for @param
	 * @param certStream
	   ^
/home/jenkins/.jenkins/jobs/oxTrust_4.2.1/workspace/service/src/main/java/org/gluu/oxtrust/service/SSLService.java:94: warning: no description for @return
	 * @return
	   ^
/home/jenkins/.jenkins/jobs/oxTrust_4.2.1/workspace/service/src/main/java/org/gluu/oxtrust/service/SSLService.java:108: warning: no description for @param
	 * @param certStream
	   ^
/home/jenkins/.jenkins/jobs/oxTrust_4.2.1/workspace/service/src/main/java/org/gluu/oxtrust/service/SSLService.java:109: warning: no description for @return
	 * @return
	   ^
/home/jenkins/.jenkins/jobs/oxTrust_4.2.1/workspace/service/src/main/java/org/gluu/oxtrust/service/SSLService.java:111: warning: no @throws for java.lang.Exception
	public static X509Certificate getPEMCertificateStatic(InputStream certStream) throws Exception {
	                              ^
/home/jenkins/.jenkins/jobs/oxTrust_4.2.1/workspace/service/src/main/java/org/gluu/oxtrust/service/SSLService.java:138: warning: no @throws for java.lang.Exception
	public static X509Certificate[] loadCertificates(InputStream is) throws Exception {
	                                ^
/home/jenkins/.jenkins/jobs/oxTrust_4.2.1/workspace/service/src/main/java/org/gluu/oxtrust/service/SSLService.java:151: warning: no @throws for java.lang.Exception
	public static X509Certificate[] loadCertificates(byte[] certsBytes) throws Exception {
	                                ^
/home/jenkins/.jenkins/jobs/oxTrust_4.2.1/workspace/service/src/main/java/org/gluu/oxtrust/service/uma/ResourceSetService.java:209: error: @param name not found
	 * @param id
	          ^
/home/jenkins/.jenkins/jobs/oxTrust_4.2.1/workspace/service/src/main/java/org/gluu/oxtrust/service/uma/UmaScopeService.java:79: error: @param name not found
	 * @param scopeDescription
	          ^
/home/jenkins/.jenkins/jobs/oxTrust_4.2.1/workspace/service/src/main/java/org/gluu/oxtrust/util/ServiceUtil.java:63: error: invalid use of @return
	 * @return void
	   ^
/home/jenkins/.jenkins/jobs/oxTrust_4.2.1/workspace/service/src/main/java/org/gluu/oxtrust/util/ServiceUtil.java:117: error: invalid use of @return
	 * @return void
	   ^
/home/jenkins/.jenkins/jobs/oxTrust_4.2.1/workspace/service/src/main/java/org/gluu/oxtrust/util/ServiceUtil.java:161: error: invalid use of @return
	 * @return void
	   ^

Command line was: /usr/lib/jvm/java-1.8.0-openjdk-1.8.0.312.b07-1.el7_9.x86_64/jre/../bin/javadoc @options @packages

Refer to the generated Javadoc files in '/home/jenkins/.jenkins/jobs/oxTrust_4.2.1/workspace/service/target/site/apidocs' dir.

	at org.apache.maven.plugins.javadoc.AbstractJavadocMojo.executeJavadocCommandLine(AbstractJavadocMojo.java:5298)
	at org.apache.maven.plugins.javadoc.AbstractJavadocMojo.executeReport(AbstractJavadocMojo.java:2134)
	at org.apache.maven.plugins.javadoc.JavadocReport.generate(JavadocReport.java:134)
	at org.apache.maven.plugins.javadoc.JavadocReport.doExecute(JavadocReport.java:329)
	at org.apache.maven.plugins.javadoc.AbstractJavadocMojo.execute(AbstractJavadocMojo.java:1912)
	at org.apache.maven.plugin.DefaultBuildPluginManager.executeMojo(DefaultBuildPluginManager.java:134)
	at org.apache.maven.lifecycle.internal.MojoExecutor.execute(MojoExecutor.java:207)
	at org.apache.maven.lifecycle.internal.MojoExecutor.execute(MojoExecutor.java:153)
	at org.apache.maven.lifecycle.internal.MojoExecutor.execute(MojoExecutor.java:145)
	at org.apache.maven.lifecycle.internal.LifecycleModuleBuilder.buildProject(LifecycleModuleBuilder.java:116)
	at org.apache.maven.lifecycle.internal.LifecycleModuleBuilder.buildProject(LifecycleModuleBuilder.java:80)
	at org.apache.maven.lifecycle.internal.builder.singlethreaded.SingleThreadedBuilder.build(SingleThreadedBuilder.java:51)
	at org.apache.maven.lifecycle.internal.LifecycleStarter.execute(LifecycleStarter.java:128)
	at org.apache.maven.DefaultMaven.doExecute(DefaultMaven.java:307)
	at org.apache.maven.DefaultMaven.doExecute(DefaultMaven.java:193)
	at org.apache.maven.DefaultMaven.execute(DefaultMaven.java:106)
	at org.apache.maven.cli.MavenCli.execute(MavenCli.java:863)
	at org.apache.maven.cli.MavenCli.doMain(MavenCli.java:288)
	at org.apache.maven.cli.MavenCli.main(MavenCli.java:199)
	at sun.reflect.NativeMethodAccessorImpl.invoke0(Native Method)
	at sun.reflect.NativeMethodAccessorImpl.invoke(NativeMethodAccessorImpl.java:62)
	at sun.reflect.DelegatingMethodAccessorImpl.invoke(DelegatingMethodAccessorImpl.java:43)
	at java.lang.reflect.Method.invoke(Method.java:498)
	at org.codehaus.plexus.classworlds.launcher.Launcher.launchEnhanced(Launcher.java:289)
	at org.codehaus.plexus.classworlds.launcher.Launcher.launch(Launcher.java:229)
	at org.codehaus.plexus.classworlds.launcher.Launcher.mainWithExitCode(Launcher.java:415)
	at org.codehaus.plexus.classworlds.launcher.Launcher.main(Launcher.java:356)
[INFO] 
[INFO] --- findbugs-maven-plugin:3.0.4:findbugs (default-cli) @ oxtrust-service ---
[INFO] Fork Value is true
     [java] Warnings generated: 120
[INFO] Done FindBugs Analysis....
[INFO] 
[INFO] --- maven-site-plugin:2.1.1:site (default-site) @ oxtrust-service ---
[INFO]                                                                         
[INFO] ------------------------------------------------------------------------
[INFO] Building OpenId authentication module 4.2.1.Final
[INFO] ------------------------------------------------------------------------
[WARNING] Failure to transfer net.minidev:json-smart/maven-metadata.xml from https://repo2.maven.org/maven2/org/bouncycastle was cached in the local repository, resolution will not be reattempted until the update interval of bouncycastle has elapsed or updates are forced. Original error: Could not transfer metadata net.minidev:json-smart/maven-metadata.xml from/to bouncycastle (http://repo2.maven.org/maven2/org/bouncycastle): repo2.maven.org: Name or service not known
[INFO] 
[INFO] --- maven-clean-plugin:2.5:clean (default-clean) @ oxtrust-openid-auth-client ---
[INFO] Deleting /home/jenkins/.jenkins/jobs/oxTrust_4.2.1/workspace/openid-auth-client/target
[INFO] 
[INFO] --- maven-resources-plugin:2.6:resources (default-resources) @ oxtrust-openid-auth-client ---
[INFO] Using 'UTF-8' encoding to copy filtered resources.
[INFO] skip non existing resourceDirectory /home/jenkins/.jenkins/jobs/oxTrust_4.2.1/workspace/openid-auth-client/src/main/resources
[INFO] 
[INFO] --- maven-compiler-plugin:2.3.2:compile (default-compile) @ oxtrust-openid-auth-client ---
[INFO] Compiling 6 source files to /home/jenkins/.jenkins/jobs/oxTrust_4.2.1/workspace/openid-auth-client/target/classes
[INFO] 
[INFO] --- maven-resources-plugin:2.6:resources (default-resources) @ oxtrust-openid-auth-client ---
[INFO] Using 'UTF-8' encoding to copy filtered resources.
[INFO] skip non existing resourceDirectory /home/jenkins/.jenkins/jobs/oxTrust_4.2.1/workspace/openid-auth-client/src/main/resources
[INFO] 
[INFO] --- maven-compiler-plugin:2.3.2:compile (default-compile) @ oxtrust-openid-auth-client ---
[INFO] Nothing to compile - all classes are up to date
[INFO] 
[INFO] --- maven-resources-plugin:2.6:testResources (default-testResources) @ oxtrust-openid-auth-client ---
[INFO] Using 'UTF-8' encoding to copy filtered resources.
[INFO] skip non existing resourceDirectory /home/jenkins/.jenkins/jobs/oxTrust_4.2.1/workspace/openid-auth-client/src/test/resources
[INFO] 
[INFO] --- maven-compiler-plugin:2.3.2:testCompile (default-testCompile) @ oxtrust-openid-auth-client ---
[INFO] No sources to compile
[INFO] 
[INFO] --- maven-surefire-plugin:2.19.1:test (default-test) @ oxtrust-openid-auth-client ---
[INFO] No tests to run.
[INFO] 
[INFO] --- maven-jar-plugin:2.4:jar (default-jar) @ oxtrust-openid-auth-client ---
[INFO] Building jar: /home/jenkins/.jenkins/jobs/oxTrust_4.2.1/workspace/openid-auth-client/target/oxtrust-openid-auth-client-4.2.1.Final.jar
[INFO] 
[INFO] --- maven-jar-plugin:2.4:test-jar (default) @ oxtrust-openid-auth-client ---
[WARNING] JAR will be empty - no content was marked for inclusion!
[INFO] Building jar: /home/jenkins/.jenkins/jobs/oxTrust_4.2.1/workspace/openid-auth-client/target/oxtrust-openid-auth-client-4.2.1.Final-tests.jar
[INFO] 
[INFO] --- maven-install-plugin:2.3.1:install (default-install) @ oxtrust-openid-auth-client ---
[INFO] Installing /home/jenkins/.jenkins/jobs/oxTrust_4.2.1/workspace/openid-auth-client/target/oxtrust-openid-auth-client-4.2.1.Final.jar to /var/www/html/maven/org/gluu/oxtrust-openid-auth-client/4.2.1.Final/oxtrust-openid-auth-client-4.2.1.Final.jar
[INFO] Installing /home/jenkins/.jenkins/jobs/oxTrust_4.2.1/workspace/openid-auth-client/pom.xml to /var/www/html/maven/org/gluu/oxtrust-openid-auth-client/4.2.1.Final/oxtrust-openid-auth-client-4.2.1.Final.pom
[INFO] Installing /home/jenkins/.jenkins/jobs/oxTrust_4.2.1/workspace/openid-auth-client/target/oxtrust-openid-auth-client-4.2.1.Final-tests.jar to /var/www/html/maven/org/gluu/oxtrust-openid-auth-client/4.2.1.Final/oxtrust-openid-auth-client-4.2.1.Final-tests.jar
[INFO] 
[INFO] >>> maven-javadoc-plugin:3.0.1:javadoc (default-cli) > generate-sources @ oxtrust-openid-auth-client >>>
[INFO] 
[INFO] <<< maven-javadoc-plugin:3.0.1:javadoc (default-cli) < generate-sources @ oxtrust-openid-auth-client <<<
[INFO] 
[INFO] --- maven-javadoc-plugin:3.0.1:javadoc (default-cli) @ oxtrust-openid-auth-client ---
[INFO] 
Loading source files for package org.gluu.oxauth.client...
Loading source files for package org.gluu.oxauth.client.auth.principal...
Loading source files for package org.gluu.oxauth.client.auth.user...
Loading source files for package org.gluu.oxauth.client.exception...
Constructing Javadoc information...
Standard Doclet version 1.8.0_312
Building tree for all the packages and classes...
Generating /home/jenkins/.jenkins/jobs/oxTrust_4.2.1/workspace/openid-auth-client/target/site/apidocs/org/gluu/oxauth/client/Client.html...
Generating /home/jenkins/.jenkins/jobs/oxTrust_4.2.1/workspace/openid-auth-client/target/site/apidocs/org/gluu/oxauth/client/OpenIdClient.html...
Generating /home/jenkins/.jenkins/jobs/oxTrust_4.2.1/workspace/openid-auth-client/target/site/apidocs/org/gluu/oxauth/client/auth/principal/OpenIdCredentials.html...
Generating /home/jenkins/.jenkins/jobs/oxTrust_4.2.1/workspace/openid-auth-client/target/site/apidocs/org/gluu/oxauth/client/auth/user/CommonProfile.html...
Generating /home/jenkins/.jenkins/jobs/oxTrust_4.2.1/workspace/openid-auth-client/target/site/apidocs/org/gluu/oxauth/client/auth/user/UserProfile.html...
Generating /home/jenkins/.jenkins/jobs/oxTrust_4.2.1/workspace/openid-auth-client/target/site/apidocs/org/gluu/oxauth/client/exception/CommunicationException.html...
Generating /home/jenkins/.jenkins/jobs/oxTrust_4.2.1/workspace/openid-auth-client/target/site/apidocs/overview-frame.html...
Generating /home/jenkins/.jenkins/jobs/oxTrust_4.2.1/workspace/openid-auth-client/target/site/apidocs/org/gluu/oxauth/client/package-frame.html...
Generating /home/jenkins/.jenkins/jobs/oxTrust_4.2.1/workspace/openid-auth-client/target/site/apidocs/org/gluu/oxauth/client/package-summary.html...
Generating /home/jenkins/.jenkins/jobs/oxTrust_4.2.1/workspace/openid-auth-client/target/site/apidocs/org/gluu/oxauth/client/package-tree.html...
Generating /home/jenkins/.jenkins/jobs/oxTrust_4.2.1/workspace/openid-auth-client/target/site/apidocs/org/gluu/oxauth/client/auth/principal/package-frame.html...
Generating /home/jenkins/.jenkins/jobs/oxTrust_4.2.1/workspace/openid-auth-client/target/site/apidocs/org/gluu/oxauth/client/auth/principal/package-summary.html...
Generating /home/jenkins/.jenkins/jobs/oxTrust_4.2.1/workspace/openid-auth-client/target/site/apidocs/org/gluu/oxauth/client/auth/principal/package-tree.html...
Generating /home/jenkins/.jenkins/jobs/oxTrust_4.2.1/workspace/openid-auth-client/target/site/apidocs/org/gluu/oxauth/client/auth/user/package-frame.html...
Generating /home/jenkins/.jenkins/jobs/oxTrust_4.2.1/workspace/openid-auth-client/target/site/apidocs/org/gluu/oxauth/client/auth/user/package-summary.html...
Generating /home/jenkins/.jenkins/jobs/oxTrust_4.2.1/workspace/openid-auth-client/target/site/apidocs/org/gluu/oxauth/client/auth/user/package-tree.html...
Generating /home/jenkins/.jenkins/jobs/oxTrust_4.2.1/workspace/openid-auth-client/target/site/apidocs/org/gluu/oxauth/client/exception/package-frame.html...
Generating /home/jenkins/.jenkins/jobs/oxTrust_4.2.1/workspace/openid-auth-client/target/site/apidocs/org/gluu/oxauth/client/exception/package-summary.html...
Generating /home/jenkins/.jenkins/jobs/oxTrust_4.2.1/workspace/openid-auth-client/target/site/apidocs/org/gluu/oxauth/client/exception/package-tree.html...
Generating /home/jenkins/.jenkins/jobs/oxTrust_4.2.1/workspace/openid-auth-client/target/site/apidocs/constant-values.html...
Generating /home/jenkins/.jenkins/jobs/oxTrust_4.2.1/workspace/openid-auth-client/target/site/apidocs/serialized-form.html...
Generating /home/jenkins/.jenkins/jobs/oxTrust_4.2.1/workspace/openid-auth-client/target/site/apidocs/org/gluu/oxauth/client/class-use/OpenIdClient.html...
Generating /home/jenkins/.jenkins/jobs/oxTrust_4.2.1/workspace/openid-auth-client/target/site/apidocs/org/gluu/oxauth/client/class-use/Client.html...
Generating /home/jenkins/.jenkins/jobs/oxTrust_4.2.1/workspace/openid-auth-client/target/site/apidocs/org/gluu/oxauth/client/auth/principal/class-use/OpenIdCredentials.html...
Generating /home/jenkins/.jenkins/jobs/oxTrust_4.2.1/workspace/openid-auth-client/target/site/apidocs/org/gluu/oxauth/client/auth/user/class-use/UserProfile.html...
Generating /home/jenkins/.jenkins/jobs/oxTrust_4.2.1/workspace/openid-auth-client/target/site/apidocs/org/gluu/oxauth/client/auth/user/class-use/CommonProfile.html...
Generating /home/jenkins/.jenkins/jobs/oxTrust_4.2.1/workspace/openid-auth-client/target/site/apidocs/org/gluu/oxauth/client/exception/class-use/CommunicationException.html...
Generating /home/jenkins/.jenkins/jobs/oxTrust_4.2.1/workspace/openid-auth-client/target/site/apidocs/org/gluu/oxauth/client/package-use.html...
Generating /home/jenkins/.jenkins/jobs/oxTrust_4.2.1/workspace/openid-auth-client/target/site/apidocs/org/gluu/oxauth/client/auth/principal/package-use.html...
Generating /home/jenkins/.jenkins/jobs/oxTrust_4.2.1/workspace/openid-auth-client/target/site/apidocs/org/gluu/oxauth/client/auth/user/package-use.html...
Generating /home/jenkins/.jenkins/jobs/oxTrust_4.2.1/workspace/openid-auth-client/target/site/apidocs/org/gluu/oxauth/client/exception/package-use.html...
Building index for all the packages and classes...
Generating /home/jenkins/.jenkins/jobs/oxTrust_4.2.1/workspace/openid-auth-client/target/site/apidocs/overview-tree.html...
Generating /home/jenkins/.jenkins/jobs/oxTrust_4.2.1/workspace/openid-auth-client/target/site/apidocs/index-all.html...
Generating /home/jenkins/.jenkins/jobs/oxTrust_4.2.1/workspace/openid-auth-client/target/site/apidocs/deprecated-list.html...
Building index for all classes...
Generating /home/jenkins/.jenkins/jobs/oxTrust_4.2.1/workspace/openid-auth-client/target/site/apidocs/allclasses-frame.html...
Generating /home/jenkins/.jenkins/jobs/oxTrust_4.2.1/workspace/openid-auth-client/target/site/apidocs/allclasses-noframe.html...
Generating /home/jenkins/.jenkins/jobs/oxTrust_4.2.1/workspace/openid-auth-client/target/site/apidocs/index.html...
Generating /home/jenkins/.jenkins/jobs/oxTrust_4.2.1/workspace/openid-auth-client/target/site/apidocs/overview-summary.html...
Generating /home/jenkins/.jenkins/jobs/oxTrust_4.2.1/workspace/openid-auth-client/target/site/apidocs/help-doc.html...
4 warnings
[WARNING] Javadoc Warnings
[WARNING] /home/jenkins/.jenkins/jobs/oxTrust_4.2.1/workspace/openid-auth-client/src/main/java/org/gluu/oxauth/client/Client.java:29: warning: no description for @param
[WARNING] * @param context
[WARNING] ^
[WARNING] /home/jenkins/.jenkins/jobs/oxTrust_4.2.1/workspace/openid-auth-client/src/main/java/org/gluu/oxauth/client/Client.java:30: warning: no description for @param
[WARNING] * @param customStateParameters
[WARNING] ^
[WARNING] /home/jenkins/.jenkins/jobs/oxTrust_4.2.1/workspace/openid-auth-client/src/main/java/org/gluu/oxauth/client/Client.java:31: warning: no description for @param
[WARNING] * @param customParameters
[WARNING] ^
[WARNING] /home/jenkins/.jenkins/jobs/oxTrust_4.2.1/workspace/openid-auth-client/src/main/java/org/gluu/oxauth/client/Client.java:34: warning: no @param for force
[WARNING] public String getRedirectionUrl(final WebContext context, Map<String, String> customStateParameters, final Map<String, String> customParameters, final boolean force);
[WARNING] ^
[INFO] 
[INFO] --- findbugs-maven-plugin:3.0.4:findbugs (default-cli) @ oxtrust-openid-auth-client ---
[INFO] Fork Value is true
[INFO] Done FindBugs Analysis....
[INFO] 
[INFO] --- maven-site-plugin:2.1.1:site (default-site) @ oxtrust-openid-auth-client ---
[INFO]                                                                         
[INFO] ------------------------------------------------------------------------
[INFO] Building oxTrust Server 4.2.1.Final
[INFO] ------------------------------------------------------------------------
[WARNING] Failure to transfer net.minidev:json-smart/maven-metadata.xml from https://repo2.maven.org/maven2/org/bouncycastle was cached in the local repository, resolution will not be reattempted until the update interval of bouncycastle has elapsed or updates are forced. Original error: Could not transfer metadata net.minidev:json-smart/maven-metadata.xml from/to bouncycastle (http://repo2.maven.org/maven2/org/bouncycastle): repo2.maven.org: Name or service not known
Downloading: https://repository.jboss.org/nexus/content/groups/public-jboss/org/hibernate/hibernate-validator/5.4.3.Final/hibernate-validator-5.4.3.Final.jar
         
Downloaded: https://repository.jboss.org/nexus/content/groups/public-jboss/org/hibernate/hibernate-validator/5.4.3.Final/hibernate-validator-5.4.3.Final.jar (0 B at 0.0 KB/sec)
[INFO] 
[INFO] --- maven-clean-plugin:2.5:clean (default-clean) @ oxtrust-server ---
[INFO] Deleting /home/jenkins/.jenkins/jobs/oxTrust_4.2.1/workspace/server/target
[INFO] 
[INFO] --- buildnumber-maven-plugin:1.1:create (default) @ oxtrust-server ---
[INFO] Checking for local modifications: skipped.
[INFO] Updating project files from SCM: skipped.
[INFO] Executing: /bin/sh -c cd /home/jenkins/.jenkins/jobs/oxTrust_4.2.1/workspace/server && git rev-parse --verify HEAD
[INFO] Working directory: /home/jenkins/.jenkins/jobs/oxTrust_4.2.1/workspace/server
[INFO] Storing buildNumber: 1557759f054e6dbc20bcc041ac045781586b4a1a at timestamp: 1639671098715
[INFO] Executing: /bin/sh -c cd /home/jenkins/.jenkins/jobs/oxTrust_4.2.1/workspace/server && git rev-parse --verify HEAD
[INFO] Working directory: /home/jenkins/.jenkins/jobs/oxTrust_4.2.1/workspace/server
[INFO] Storing buildScmBranch: UNKNOWN
[INFO] 
[INFO] --- git-commit-id-plugin:2.2.6:revision (get-the-git-infos) @ oxtrust-server ---
Downloading: https://repo.maven.apache.org/maven2/commons-logging/commons-logging/1.1.3/commons-logging-1.1.3.pom
         
Downloaded: https://repo.maven.apache.org/maven2/commons-logging/commons-logging/1.1.3/commons-logging-1.1.3.pom (0 B at 0.0 KB/sec)
Downloading: https://repo.maven.apache.org/maven2/commons-logging/commons-logging/1.1.3/commons-logging-1.1.3.jar
         
Downloaded: https://repo.maven.apache.org/maven2/commons-logging/commons-logging/1.1.3/commons-logging-1.1.3.jar (0 B at 0.0 KB/sec)
[INFO] 
[INFO] --- maven-resources-plugin:2.6:resources (default-resources) @ oxtrust-server ---
[INFO] Using 'UTF-8' encoding to copy filtered resources.
[INFO] Copying 109 resources
[INFO] 
[INFO] --- maven-compiler-plugin:2.3.2:compile (default-compile) @ oxtrust-server ---
[INFO] Compiling 180 source files to /home/jenkins/.jenkins/jobs/oxTrust_4.2.1/workspace/server/target/classes
[INFO] 
[INFO] --- maven-jar-plugin:2.4:jar (make-a-jar) @ oxtrust-server ---
[INFO] Building jar: /home/jenkins/.jenkins/jobs/oxTrust_4.2.1/workspace/server/target/oxtrust-server.jar
[INFO] 
[INFO] --- buildnumber-maven-plugin:1.1:create (default) @ oxtrust-server ---
[INFO] Checking for local modifications: skipped.
[INFO] Updating project files from SCM: skipped.
[INFO] Executing: /bin/sh -c cd /home/jenkins/.jenkins/jobs/oxTrust_4.2.1/workspace/server && git rev-parse --verify HEAD
[INFO] Working directory: /home/jenkins/.jenkins/jobs/oxTrust_4.2.1/workspace/server
[INFO] Storing buildNumber: 1557759f054e6dbc20bcc041ac045781586b4a1a at timestamp: 1639671107001
[INFO] Executing: /bin/sh -c cd /home/jenkins/.jenkins/jobs/oxTrust_4.2.1/workspace/server && git rev-parse --verify HEAD
[INFO] Working directory: /home/jenkins/.jenkins/jobs/oxTrust_4.2.1/workspace/server
[INFO] Storing buildScmBranch: UNKNOWN
[INFO] 
[INFO] --- git-commit-id-plugin:2.2.6:revision (get-the-git-infos) @ oxtrust-server ---
[INFO] 
[INFO] --- maven-resources-plugin:2.6:resources (default-resources) @ oxtrust-server ---
[INFO] Using 'UTF-8' encoding to copy filtered resources.
[INFO] Copying 109 resources
[INFO] 
[INFO] --- maven-compiler-plugin:2.3.2:compile (default-compile) @ oxtrust-server ---
[INFO] Nothing to compile - all classes are up to date
[INFO] 
[INFO] --- maven-jar-plugin:2.4:jar (make-a-jar) @ oxtrust-server ---
[INFO] Building jar: /home/jenkins/.jenkins/jobs/oxTrust_4.2.1/workspace/server/target/oxtrust-server.jar
[INFO] 
[INFO] --- maven-resources-plugin:2.6:testResources (default-testResources) @ oxtrust-server ---
[INFO] Using 'UTF-8' encoding to copy filtered resources.
[INFO] Copying 96 resources
[INFO] Copying 6 resources
[INFO] 
[INFO] --- maven-resources-plugin:2.6:copy-resources (prepare-configuration-files) @ oxtrust-server ---
[INFO] Using 'UTF-8' encoding to copy filtered resources.
[INFO] Copying 97 resources
[INFO] 
[INFO] --- maven-compiler-plugin:2.3.2:testCompile (default-testCompile) @ oxtrust-server ---
[INFO] Compiling 13 source files to /home/jenkins/.jenkins/jobs/oxTrust_4.2.1/workspace/server/target/test-classes
[INFO] 
[INFO] --- maven-surefire-plugin:2.19.1:test (default-test) @ oxtrust-server ---

-------------------------------------------------------
 T E S T S
-------------------------------------------------------
Running TestSuite
SLF4J: Class path contains multiple SLF4J bindings.
SLF4J: Found binding in [jar:file:/var/www/html/maven/org/slf4j/slf4j-simple/1.7.30/slf4j-simple-1.7.30.jar!/org/slf4j/impl/StaticLoggerBinder.class]
SLF4J: Found binding in [jar:file:/var/www/html/maven/org/apache/logging/log4j/log4j-slf4j-impl/2.13.3/log4j-slf4j-impl-2.13.3.jar!/org/slf4j/impl/StaticLoggerBinder.class]
SLF4J: See http://www.slf4j.org/codes.html#multiple_bindings for an explanation.
SLF4J: Actual binding is of type [org.slf4j.impl.SimpleLoggerFactory]
[main] INFO org.reflections.Reflections - Reflections took 118 ms to scan 1 urls, producing 8 keys and 13 values 
Dec 16, 2021 4:11:52 PM org.eu.ingwar.tools.arquillian.extension.suite.DeploymentClassFinder getDeploymentClassFromAnnotation
INFO: arquillian-suite-deployment: Found class annotated with @ArquillianSuiteDeployment: org.gluu.oxtrust.action.ConfigurableTest
Dec 16, 2021 4:11:52 PM org.jboss.arquillian.container.impl.MapObject populate
WARNING: Configuration contain properties not supported by the backing object org.jboss.arquillian.container.jetty.embedded_9.JettyEmbeddedConfiguration
Unused property entries: {javaVmArguments=-Xms256m -Xmx512m -XX:MaxPermSize=256m}
Supported property names: [tempDirectory, dumpServerAfterStart, mimeTypes, bindHttpPort, idleTimeoutMillis, headerBufferSize, defaultsDescriptor, classloaderBehavior, configurationClasses, bindAddress, realmProperties, httpConfiguration]
Dec 16, 2021 4:11:52 PM org.eclipse.jetty.util.log.Log initialized
INFO: Logging initialized @2398ms to org.eclipse.jetty.util.log.JavaUtilLog
Dec 16, 2021 4:11:52 PM org.jboss.arquillian.container.jetty.embedded_9.JettyEmbeddedContainer start
INFO: Starting Jetty Embedded Server 9.4.9.v20180320 [id:725680028]
Dec 16, 2021 4:11:52 PM org.eclipse.jetty.server.Server doStart
INFO: jetty-9.4.9.v20180320; built: 2018-03-20T12:21:10Z; git: 1f8159b1e4a42d3f79997021ea1609f2fbac6de5; jvm 1.8.0_312-b07
Dec 16, 2021 4:11:52 PM org.eclipse.jetty.server.AbstractConnector doStart
INFO: Started ServerConnector@57bc27f5{HTTP/1.1,[http/1.1]}{localhost:9980}
Dec 16, 2021 4:11:52 PM org.eclipse.jetty.server.Server doStart
INFO: Started @2785ms
Invoked init test suite method
Dec 16, 2021 4:11:56 PM org.jboss.arquillian.container.jetty.embedded_9.ArquillianAppProvider createApp
INFO: Webapp archive location: file:/home/jenkins/.jenkins/jobs/oxTrust_4.2.1/workspace/server/target/arquillian-jetty-temp/export4136889291191827874oxtrust.war
Dec 16, 2021 4:11:56 PM org.eclipse.jetty.annotations.AnnotationConfiguration scanForAnnotations
INFO: Scanning elapsed time=184ms
Dec 16, 2021 4:11:56 PM org.eclipse.jetty.webapp.StandardDescriptorProcessor visitServlet
INFO: NO JSP Support for /export4136889291191827874oxtrust, did not find org.eclipse.jetty.jsp.JettyJspServlet
Dec 16, 2021 4:11:57 PM org.richfaces.webapp.ResourceServletContainerInitializer registerServlet
INFO: Auto-registered servlet ResourceServlet with mapping '/org.richfaces.resources/*'
2021-12-16 16:12:09,451 INFO  [main] [org.gluu.oxauth.model.util.SecurityProviderUtility] (SecurityProviderUtility.java:24) - Adding Bouncy Castle Provider
[main] INFO org.gluu.oxtrust.util.BuildVersionService - Root element :beans
[main] INFO org.gluu.oxtrust.service.AppInitializer - Build date 2021-12-16 16:10. Code revision 1557759f054e6dbc20bcc041ac045781586b4a1a on 2020-09-23T19:42:23+0000. Build 2226
[main] INFO org.gluu.service.config.ConfigurationFactory - Creating oxTrustConfiguration
[main] INFO org.gluu.service.config.ConfigurationFactory - Loading configuration from 'ldap' DB...
[main] INFO org.gluu.persist.ldap.operation.impl.LdapConnectionProvider - Attempting to create connection pool: 1
[main] INFO org.gluu.persist.ldap.operation.impl.LdapConnectionProvider - Attempting to create connection pool: 1
[main] INFO org.gluu.persist.ldap.impl.LdapEntryManagerFactory - Created LdapEntryManager: org.gluu.persist.ldap.operation.impl.LdapOperationServiceImpl@47dff7db
[main] INFO org.gluu.oxtrust.service.AppInitializer - Created persistenceEntryManager: org.gluu.persist.ldap.impl.LdapEntryManager@66c937dd with operation service: org.gluu.persist.ldap.operation.impl.LdapOperationServiceImpl@47dff7db
[main] ERROR org.gluu.oxtrust.service.config.ConfigurationFactory - Failed to load configuration from LDAP
org.gluu.persist.exception.EntryPersistenceException: Failed to find entry: ou=oxtrust,ou=configuration,o=gluu
	at org.gluu.persist.ldap.impl.LdapEntryManager.find(LdapEntryManager.java:409)
	at org.gluu.persist.impl.BaseEntryManager.find(BaseEntryManager.java:624)
	at org.gluu.persist.impl.BaseEntryManager.find(BaseEntryManager.java:504)
	at sun.reflect.NativeMethodAccessorImpl.invoke0(Native Method)
	at sun.reflect.NativeMethodAccessorImpl.invoke(NativeMethodAccessorImpl.java:62)
	at sun.reflect.DelegatingMethodAccessorImpl.invoke(DelegatingMethodAccessorImpl.java:43)
	at java.lang.reflect.Method.invoke(Method.java:498)
	at org.jboss.weld.bean.proxy.AbstractBeanInstance.invoke(AbstractBeanInstance.java:38)
	at org.jboss.weld.bean.proxy.ProxyMethodHandler.invoke(ProxyMethodHandler.java:106)
	at org.gluu.persist.EntityManager$PersistenceEntryManager$1894364089$Proxy$_$$_WeldClientProxy.find(Unknown Source)
	at org.gluu.oxtrust.service.config.ConfigurationFactory.loadConfigurationFromDb(ConfigurationFactory.java:60)
	at org.gluu.oxtrust.service.config.ConfigurationFactory$Proxy$_$$_WeldSubclass.loadConfigurationFromDb(Unknown Source)
	at org.gluu.oxtrust.service.config.ConfigurationFactory.loadConfigurationFromDb(ConfigurationFactory.java:29)
	at org.gluu.service.config.ConfigurationFactory.createFromDb(ConfigurationFactory.java:291)
	at org.gluu.service.config.ConfigurationFactory.create(ConfigurationFactory.java:146)
	at org.gluu.oxtrust.service.config.ConfigurationFactory$Proxy$_$$_WeldSubclass.create(Unknown Source)
	at org.gluu.oxtrust.service.config.ConfigurationFactory$Proxy$_$$_WeldClientProxy.create(Unknown Source)
	at org.gluu.oxtrust.service.AppInitializer.applicationInitialized(AppInitializer.java:180)
	at sun.reflect.NativeMethodAccessorImpl.invoke0(Native Method)
	at sun.reflect.NativeMethodAccessorImpl.invoke(NativeMethodAccessorImpl.java:62)
	at sun.reflect.DelegatingMethodAccessorImpl.invoke(DelegatingMethodAccessorImpl.java:43)
	at java.lang.reflect.Method.invoke(Method.java:498)
	at org.jboss.weld.injection.StaticMethodInjectionPoint.invoke(StaticMethodInjectionPoint.java:95)
	at org.jboss.weld.injection.StaticMethodInjectionPoint.invoke(StaticMethodInjectionPoint.java:85)
	at org.jboss.weld.injection.MethodInvocationStrategy$SimpleMethodInvocationStrategy.invoke(MethodInvocationStrategy.java:168)
	at org.jboss.weld.event.ObserverMethodImpl.sendEvent(ObserverMethodImpl.java:330)
	at org.jboss.weld.event.ObserverMethodImpl.sendEvent(ObserverMethodImpl.java:308)
	at org.jboss.weld.event.ObserverMethodImpl.notify(ObserverMethodImpl.java:286)
	at javax.enterprise.inject.spi.ObserverMethod.notify(ObserverMethod.java:124)
	at org.jboss.weld.util.Observers.notify(Observers.java:166)
	at org.jboss.weld.event.ObserverNotifier.notifySyncObservers(ObserverNotifier.java:285)
	at org.jboss.weld.event.ObserverNotifier.notify(ObserverNotifier.java:273)
	at org.jboss.weld.event.ObserverNotifier.fireEvent(ObserverNotifier.java:177)
	at org.jboss.weld.bootstrap.BeanDeploymentModule.fireEvent(BeanDeploymentModule.java:93)
	at org.jboss.weld.module.web.servlet.HttpContextLifecycle.fireEventForApplicationScope(HttpContextLifecycle.java:161)
	at org.jboss.weld.module.web.servlet.HttpContextLifecycle.contextInitialized(HttpContextLifecycle.java:147)
	at org.jboss.weld.module.web.servlet.WeldInitialListener.contextInitialized(WeldInitialListener.java:99)
	at org.jboss.weld.servlet.api.helpers.ForwardingServletListener.contextInitialized(ForwardingServletListener.java:34)
	at org.jboss.weld.environment.servlet.EnhancedListener.onStartup(EnhancedListener.java:66)
	at org.eclipse.jetty.plus.annotation.ContainerInitializer.callStartup(ContainerInitializer.java:140)
	at org.eclipse.jetty.annotations.ServletContainerInitializersStarter.doStart(ServletContainerInitializersStarter.java:64)
	at org.eclipse.jetty.util.component.AbstractLifeCycle.start(AbstractLifeCycle.java:68)
	at org.eclipse.jetty.servlet.ServletContextHandler.startContext(ServletContextHandler.java:355)
	at org.eclipse.jetty.webapp.WebAppContext.startWebapp(WebAppContext.java:1497)
	at org.eclipse.jetty.webapp.WebAppContext.startContext(WebAppContext.java:1459)
	at org.eclipse.jetty.server.handler.ContextHandler.doStart(ContextHandler.java:785)
	at org.eclipse.jetty.servlet.ServletContextHandler.doStart(ServletContextHandler.java:287)
	at org.eclipse.jetty.webapp.WebAppContext.doStart(WebAppContext.java:545)
	at org.eclipse.jetty.util.component.AbstractLifeCycle.start(AbstractLifeCycle.java:68)
	at org.eclipse.jetty.deploy.bindings.StandardStarter.processBinding(StandardStarter.java:46)
	at org.eclipse.jetty.deploy.AppLifeCycle.runBindings(AppLifeCycle.java:192)
	at org.eclipse.jetty.deploy.DeploymentManager.requestAppGoal(DeploymentManager.java:505)
	at org.eclipse.jetty.deploy.DeploymentManager.addApp(DeploymentManager.java:151)
	at org.jboss.arquillian.container.jetty.embedded_9.JettyEmbeddedContainer.deploy(JettyEmbeddedContainer.java:295)
	at org.jboss.arquillian.container.impl.client.container.ContainerDeployController$3.call(ContainerDeployController.java:151)
	at org.jboss.arquillian.container.impl.client.container.ContainerDeployController$3.call(ContainerDeployController.java:118)
	at org.jboss.arquillian.container.impl.client.container.ContainerDeployController.executeOperation(ContainerDeployController.java:239)
	at org.jboss.arquillian.container.impl.client.container.ContainerDeployController.deploy(ContainerDeployController.java:118)
	at sun.reflect.NativeMethodAccessorImpl.invoke0(Native Method)
	at sun.reflect.NativeMethodAccessorImpl.invoke(NativeMethodAccessorImpl.java:62)
	at sun.reflect.DelegatingMethodAccessorImpl.invoke(DelegatingMethodAccessorImpl.java:43)
	at java.lang.reflect.Method.invoke(Method.java:498)
	at org.jboss.arquillian.core.impl.ObserverImpl.invoke(ObserverImpl.java:86)
	at org.jboss.arquillian.core.impl.EventContextImpl.invokeObservers(EventContextImpl.java:103)
	at org.jboss.arquillian.core.impl.EventContextImpl.proceed(EventContextImpl.java:90)
	at org.jboss.arquillian.container.impl.client.container.DeploymentExceptionHandler.verifyExpectedExceptionDuringDeploy(DeploymentExceptionHandler.java:47)
	at sun.reflect.NativeMethodAccessorImpl.invoke0(Native Method)
	at sun.reflect.NativeMethodAccessorImpl.invoke(NativeMethodAccessorImpl.java:62)
	at sun.reflect.DelegatingMethodAccessorImpl.invoke(DelegatingMethodAccessorImpl.java:43)
	at java.lang.reflect.Method.invoke(Method.java:498)
	at org.jboss.arquillian.core.impl.ObserverImpl.invoke(ObserverImpl.java:86)
	at org.jboss.arquillian.core.impl.EventContextImpl.proceed(EventContextImpl.java:95)
	at org.jboss.arquillian.container.impl.client.ContainerDeploymentContextHandler.createDeploymentContext(ContainerDeploymentContextHandler.java:71)
	at sun.reflect.NativeMethodAccessorImpl.invoke0(Native Method)
	at sun.reflect.NativeMethodAccessorImpl.invoke(NativeMethodAccessorImpl.java:62)
	at sun.reflect.DelegatingMethodAccessorImpl.invoke(DelegatingMethodAccessorImpl.java:43)
	at java.lang.reflect.Method.invoke(Method.java:498)
	at org.jboss.arquillian.core.impl.ObserverImpl.invoke(ObserverImpl.java:86)
	at org.jboss.arquillian.core.impl.EventContextImpl.proceed(EventContextImpl.java:95)
	at org.jboss.arquillian.container.impl.client.ContainerDeploymentContextHandler.createContainerContext(ContainerDeploymentContextHandler.java:54)
	at sun.reflect.NativeMethodAccessorImpl.invoke0(Native Method)
	at sun.reflect.NativeMethodAccessorImpl.invoke(NativeMethodAccessorImpl.java:62)
	at sun.reflect.DelegatingMethodAccessorImpl.invoke(DelegatingMethodAccessorImpl.java:43)
	at java.lang.reflect.Method.invoke(Method.java:498)
	at org.jboss.arquillian.core.impl.ObserverImpl.invoke(ObserverImpl.java:86)
	at org.jboss.arquillian.core.impl.EventContextImpl.proceed(EventContextImpl.java:95)
	at org.jboss.arquillian.core.impl.ManagerImpl.fire(ManagerImpl.java:133)
	at org.jboss.arquillian.core.impl.ManagerImpl.fire(ManagerImpl.java:105)
	at org.jboss.arquillian.core.impl.EventImpl.fire(EventImpl.java:62)
	at org.jboss.arquillian.container.impl.client.container.ContainerDeployController$1.perform(ContainerDeployController.java:92)
	at org.jboss.arquillian.container.impl.client.container.ContainerDeployController$1.perform(ContainerDeployController.java:77)
	at org.jboss.arquillian.container.impl.client.container.ContainerDeployController.forEachDeployment(ContainerDeployController.java:232)
	at org.jboss.arquillian.container.impl.client.container.ContainerDeployController.forEachManagedDeployment(ContainerDeployController.java:212)
	at org.jboss.arquillian.container.impl.client.container.ContainerDeployController.deployManaged(ContainerDeployController.java:77)
	at sun.reflect.NativeMethodAccessorImpl.invoke0(Native Method)
	at sun.reflect.NativeMethodAccessorImpl.invoke(NativeMethodAccessorImpl.java:62)
	at sun.reflect.DelegatingMethodAccessorImpl.invoke(DelegatingMethodAccessorImpl.java:43)
	at java.lang.reflect.Method.invoke(Method.java:498)
	at org.jboss.arquillian.core.impl.ObserverImpl.invoke(ObserverImpl.java:86)
	at org.jboss.arquillian.core.impl.EventContextImpl.invokeObservers(EventContextImpl.java:103)
	at org.jboss.arquillian.core.impl.EventContextImpl.proceed(EventContextImpl.java:90)
	at org.eu.ingwar.tools.arquillian.extension.suite.SuiteDeployer.blockDeployManagedDeploymentsWhenNeeded(SuiteDeployer.java:95)
	at sun.reflect.NativeMethodAccessorImpl.invoke0(Native Method)
	at sun.reflect.NativeMethodAccessorImpl.invoke(NativeMethodAccessorImpl.java:62)
	at sun.reflect.DelegatingMethodAccessorImpl.invoke(DelegatingMethodAccessorImpl.java:43)
	at java.lang.reflect.Method.invoke(Method.java:498)
	at org.jboss.arquillian.core.impl.ObserverImpl.invoke(ObserverImpl.java:86)
	at org.jboss.arquillian.core.impl.EventContextImpl.proceed(EventContextImpl.java:95)
	at org.jboss.arquillian.core.impl.ManagerImpl.fire(ManagerImpl.java:133)
	at org.jboss.arquillian.core.impl.ManagerImpl.fire(ManagerImpl.java:105)
	at org.jboss.arquillian.core.impl.EventImpl.fire(EventImpl.java:62)
	at org.jboss.arquillian.container.test.impl.client.ContainerEventController.execute(ContainerEventController.java:96)
	at sun.reflect.NativeMethodAccessorImpl.invoke0(Native Method)
	at sun.reflect.NativeMethodAccessorImpl.invoke(NativeMethodAccessorImpl.java:62)
	at sun.reflect.DelegatingMethodAccessorImpl.invoke(DelegatingMethodAccessorImpl.java:43)
	at java.lang.reflect.Method.invoke(Method.java:498)
	at org.jboss.arquillian.core.impl.ObserverImpl.invoke(ObserverImpl.java:86)
	at org.jboss.arquillian.core.impl.EventContextImpl.invokeObservers(EventContextImpl.java:103)
	at org.jboss.arquillian.core.impl.EventContextImpl.proceed(EventContextImpl.java:90)
	at org.jboss.arquillian.test.impl.TestContextHandler.createClassContext(TestContextHandler.java:83)
	at sun.reflect.NativeMethodAccessorImpl.invoke0(Native Method)
	at sun.reflect.NativeMethodAccessorImpl.invoke(NativeMethodAccessorImpl.java:62)
	at sun.reflect.DelegatingMethodAccessorImpl.invoke(DelegatingMethodAccessorImpl.java:43)
	at java.lang.reflect.Method.invoke(Method.java:498)
	at org.jboss.arquillian.core.impl.ObserverImpl.invoke(ObserverImpl.java:86)
	at org.jboss.arquillian.core.impl.EventContextImpl.proceed(EventContextImpl.java:95)
	at org.jboss.arquillian.test.impl.TestContextHandler.createSuiteContext(TestContextHandler.java:69)
	at sun.reflect.NativeMethodAccessorImpl.invoke0(Native Method)
	at sun.reflect.NativeMethodAccessorImpl.invoke(NativeMethodAccessorImpl.java:62)
	at sun.reflect.DelegatingMethodAccessorImpl.invoke(DelegatingMethodAccessorImpl.java:43)
	at java.lang.reflect.Method.invoke(Method.java:498)
	at org.jboss.arquillian.core.impl.ObserverImpl.invoke(ObserverImpl.java:86)
	at org.jboss.arquillian.core.impl.EventContextImpl.proceed(EventContextImpl.java:95)
	at org.jboss.arquillian.core.impl.ManagerImpl.fire(ManagerImpl.java:133)
	at org.jboss.arquillian.core.impl.ManagerImpl.fire(ManagerImpl.java:105)
	at org.jboss.arquillian.test.impl.EventTestRunnerAdaptor.beforeClass(EventTestRunnerAdaptor.java:89)
	at org.jboss.arquillian.testng.Arquillian.arquillianBeforeClass(Arquillian.java:96)
	at sun.reflect.NativeMethodAccessorImpl.invoke0(Native Method)
	at sun.reflect.NativeMethodAccessorImpl.invoke(NativeMethodAccessorImpl.java:62)
	at sun.reflect.DelegatingMethodAccessorImpl.invoke(DelegatingMethodAccessorImpl.java:43)
	at java.lang.reflect.Method.invoke(Method.java:498)
	at org.testng.internal.MethodInvocationHelper.invokeMethod(MethodInvocationHelper.java:124)
	at org.testng.internal.MethodInvocationHelper.invokeMethodConsideringTimeout(MethodInvocationHelper.java:59)
	at org.testng.internal.Invoker.invokeConfigurationMethod(Invoker.java:458)
	at org.testng.internal.Invoker.invokeConfigurations(Invoker.java:222)
	at org.testng.internal.Invoker.invokeConfigurations(Invoker.java:142)
	at org.testng.internal.TestMethodWorker.invokeBeforeClassMethods(TestMethodWorker.java:168)
	at org.testng.internal.TestMethodWorker.run(TestMethodWorker.java:105)
	at org.testng.TestRunner.privateRun(TestRunner.java:648)
	at org.testng.TestRunner.run(TestRunner.java:505)
	at org.testng.SuiteRunner.runTest(SuiteRunner.java:455)
	at org.testng.SuiteRunner.runSequentially(SuiteRunner.java:450)
	at org.testng.SuiteRunner.privateRun(SuiteRunner.java:415)
	at org.testng.SuiteRunner.run(SuiteRunner.java:364)
	at org.testng.SuiteRunnerWorker.runSuite(SuiteRunnerWorker.java:52)
	at org.testng.SuiteRunnerWorker.run(SuiteRunnerWorker.java:84)
	at org.testng.TestNG.runSuitesSequentially(TestNG.java:1208)
	at org.testng.TestNG.runSuitesLocally(TestNG.java:1137)
	at org.testng.TestNG.runSuites(TestNG.java:1049)
	at org.testng.TestNG.run(TestNG.java:1017)
	at org.apache.maven.surefire.testng.TestNGExecutor.run(TestNGExecutor.java:281)
	at org.apache.maven.surefire.testng.TestNGXmlTestSuite.execute(TestNGXmlTestSuite.java:75)
	at org.apache.maven.surefire.testng.TestNGProvider.invoke(TestNGProvider.java:121)
	at org.apache.maven.surefire.booter.ForkedBooter.invokeProviderInSameClassLoader(ForkedBooter.java:290)
	at org.apache.maven.surefire.booter.ForkedBooter.runSuitesInProcess(ForkedBooter.java:242)
	at org.apache.maven.surefire.booter.ForkedBooter.main(ForkedBooter.java:121)
Caused by: org.gluu.persist.exception.operation.ConnectionException: Failed to lookup entry
	at org.gluu.persist.ldap.operation.impl.LdapOperationServiceImpl.lookupImpl(LdapOperationServiceImpl.java:698)
	at org.gluu.persist.ldap.operation.impl.LdapOperationServiceImpl.lookup(LdapOperationServiceImpl.java:682)
	at org.gluu.persist.ldap.impl.LdapEntryManager.find(LdapEntryManager.java:403)
	... 165 more
Caused by: LDAPException(resultCode=80 (other), numEntries=0, numReferences=0, diagnosticMessage='com.sleepycat.je.LogWriteException: (JE 5.0.104) Environment must be closed, caused by: com.sleepycat.je.LogWriteException: Environment invalid because of previous exception: (JE 5.0.104) /opt/opendj/db/userRoot java.io.IOException: No space left on device LOG_WRITE: IOException on write, log is likely incomplete. Environment is invalid and must be closed.', ldapSDKVersion=5.1.0, revision=89705d759f7c1ab3bccb2870f8c2e7d529ed231b')
	at com.unboundid.ldap.sdk.LDAPConnection.search(LDAPConnection.java:3833)
	at com.unboundid.ldap.sdk.LDAPConnection.getEntry(LDAPConnection.java:1830)
	at com.unboundid.ldap.sdk.AbstractConnectionPool.getEntry(AbstractConnectionPool.java:630)
	at org.gluu.persist.ldap.operation.impl.LdapOperationServiceImpl.lookupImpl(LdapOperationServiceImpl.java:695)
	... 167 more
[main] ERROR org.gluu.service.config.ConfigurationFactory - Failed to load configuration from LDAP. Please fix it!!!.
[main] WARN org.eclipse.jetty.annotations.ServletContainerInitializersStarter - 
org.gluu.exception.ConfigurationException: Failed to load configuration from LDAP.
	at org.gluu.service.config.ConfigurationFactory.create(ConfigurationFactory.java:148)
	at org.gluu.oxtrust.service.config.ConfigurationFactory$Proxy$_$$_WeldSubclass.create(Unknown Source)
	at org.gluu.oxtrust.service.config.ConfigurationFactory$Proxy$_$$_WeldClientProxy.create(Unknown Source)
	at org.gluu.oxtrust.service.AppInitializer.applicationInitialized(AppInitializer.java:180)
	at sun.reflect.NativeMethodAccessorImpl.invoke0(Native Method)
	at sun.reflect.NativeMethodAccessorImpl.invoke(NativeMethodAccessorImpl.java:62)
	at sun.reflect.DelegatingMethodAccessorImpl.invoke(DelegatingMethodAccessorImpl.java:43)
	at java.lang.reflect.Method.invoke(Method.java:498)
	at org.jboss.weld.injection.StaticMethodInjectionPoint.invoke(StaticMethodInjectionPoint.java:95)
	at org.jboss.weld.injection.StaticMethodInjectionPoint.invoke(StaticMethodInjectionPoint.java:85)
	at org.jboss.weld.injection.MethodInvocationStrategy$SimpleMethodInvocationStrategy.invoke(MethodInvocationStrategy.java:168)
	at org.jboss.weld.event.ObserverMethodImpl.sendEvent(ObserverMethodImpl.java:330)
	at org.jboss.weld.event.ObserverMethodImpl.sendEvent(ObserverMethodImpl.java:308)
	at org.jboss.weld.event.ObserverMethodImpl.notify(ObserverMethodImpl.java:286)
	at javax.enterprise.inject.spi.ObserverMethod.notify(ObserverMethod.java:124)
	at org.jboss.weld.util.Observers.notify(Observers.java:166)
	at org.jboss.weld.event.ObserverNotifier.notifySyncObservers(ObserverNotifier.java:285)
	at org.jboss.weld.event.ObserverNotifier.notify(ObserverNotifier.java:273)
	at org.jboss.weld.event.ObserverNotifier.fireEvent(ObserverNotifier.java:177)
	at org.jboss.weld.bootstrap.BeanDeploymentModule.fireEvent(BeanDeploymentModule.java:93)
	at org.jboss.weld.module.web.servlet.HttpContextLifecycle.fireEventForApplicationScope(HttpContextLifecycle.java:161)
	at org.jboss.weld.module.web.servlet.HttpContextLifecycle.contextInitialized(HttpContextLifecycle.java:147)
	at org.jboss.weld.module.web.servlet.WeldInitialListener.contextInitialized(WeldInitialListener.java:99)
	at org.jboss.weld.servlet.api.helpers.ForwardingServletListener.contextInitialized(ForwardingServletListener.java:34)
	at org.jboss.weld.environment.servlet.EnhancedListener.onStartup(EnhancedListener.java:66)
	at org.eclipse.jetty.plus.annotation.ContainerInitializer.callStartup(ContainerInitializer.java:140)
	at org.eclipse.jetty.annotations.ServletContainerInitializersStarter.doStart(ServletContainerInitializersStarter.java:64)
	at org.eclipse.jetty.util.component.AbstractLifeCycle.start(AbstractLifeCycle.java:68)
	at org.eclipse.jetty.servlet.ServletContextHandler.startContext(ServletContextHandler.java:355)
	at org.eclipse.jetty.webapp.WebAppContext.startWebapp(WebAppContext.java:1497)
	at org.eclipse.jetty.webapp.WebAppContext.startContext(WebAppContext.java:1459)
	at org.eclipse.jetty.server.handler.ContextHandler.doStart(ContextHandler.java:785)
	at org.eclipse.jetty.servlet.ServletContextHandler.doStart(ServletContextHandler.java:287)
	at org.eclipse.jetty.webapp.WebAppContext.doStart(WebAppContext.java:545)
	at org.eclipse.jetty.util.component.AbstractLifeCycle.start(AbstractLifeCycle.java:68)
	at org.eclipse.jetty.deploy.bindings.StandardStarter.processBinding(StandardStarter.java:46)
	at org.eclipse.jetty.deploy.AppLifeCycle.runBindings(AppLifeCycle.java:192)
	at org.eclipse.jetty.deploy.DeploymentManager.requestAppGoal(DeploymentManager.java:505)
	at org.eclipse.jetty.deploy.DeploymentManager.addApp(DeploymentManager.java:151)
	at org.jboss.arquillian.container.jetty.embedded_9.JettyEmbeddedContainer.deploy(JettyEmbeddedContainer.java:295)
	at org.jboss.arquillian.container.impl.client.container.ContainerDeployController$3.call(ContainerDeployController.java:151)
	at org.jboss.arquillian.container.impl.client.container.ContainerDeployController$3.call(ContainerDeployController.java:118)
	at org.jboss.arquillian.container.impl.client.container.ContainerDeployController.executeOperation(ContainerDeployController.java:239)
	at org.jboss.arquillian.container.impl.client.container.ContainerDeployController.deploy(ContainerDeployController.java:118)
	at sun.reflect.NativeMethodAccessorImpl.invoke0(Native Method)
	at sun.reflect.NativeMethodAccessorImpl.invoke(NativeMethodAccessorImpl.java:62)
	at sun.reflect.DelegatingMethodAccessorImpl.invoke(DelegatingMethodAccessorImpl.java:43)
	at java.lang.reflect.Method.invoke(Method.java:498)
	at org.jboss.arquillian.core.impl.ObserverImpl.invoke(ObserverImpl.java:86)
	at org.jboss.arquillian.core.impl.EventContextImpl.invokeObservers(EventContextImpl.java:103)
	at org.jboss.arquillian.core.impl.EventContextImpl.proceed(EventContextImpl.java:90)
	at org.jboss.arquillian.container.impl.client.container.DeploymentExceptionHandler.verifyExpectedExceptionDuringDeploy(DeploymentExceptionHandler.java:47)
	at sun.reflect.NativeMethodAccessorImpl.invoke0(Native Method)
	at sun.reflect.NativeMethodAccessorImpl.invoke(NativeMethodAccessorImpl.java:62)
	at sun.reflect.DelegatingMethodAccessorImpl.invoke(DelegatingMethodAccessorImpl.java:43)
	at java.lang.reflect.Method.invoke(Method.java:498)
	at org.jboss.arquillian.core.impl.ObserverImpl.invoke(ObserverImpl.java:86)
	at org.jboss.arquillian.core.impl.EventContextImpl.proceed(EventContextImpl.java:95)
	at org.jboss.arquillian.container.impl.client.ContainerDeploymentContextHandler.createDeploymentContext(ContainerDeploymentContextHandler.java:71)
	at sun.reflect.NativeMethodAccessorImpl.invoke0(Native Method)
	at sun.reflect.NativeMethodAccessorImpl.invoke(NativeMethodAccessorImpl.java:62)
	at sun.reflect.DelegatingMethodAccessorImpl.invoke(DelegatingMethodAccessorImpl.java:43)
	at java.lang.reflect.Method.invoke(Method.java:498)
	at org.jboss.arquillian.core.impl.ObserverImpl.invoke(ObserverImpl.java:86)
	at org.jboss.arquillian.core.impl.EventContextImpl.proceed(EventContextImpl.java:95)
	at org.jboss.arquillian.container.impl.client.ContainerDeploymentContextHandler.createContainerContext(ContainerDeploymentContextHandler.java:54)
	at sun.reflect.NativeMethodAccessorImpl.invoke0(Native Method)
	at sun.reflect.NativeMethodAccessorImpl.invoke(NativeMethodAccessorImpl.java:62)
	at sun.reflect.DelegatingMethodAccessorImpl.invoke(DelegatingMethodAccessorImpl.java:43)
	at java.lang.reflect.Method.invoke(Method.java:498)
	at org.jboss.arquillian.core.impl.ObserverImpl.invoke(ObserverImpl.java:86)
	at org.jboss.arquillian.core.impl.EventContextImpl.proceed(EventContextImpl.java:95)
	at org.jboss.arquillian.core.impl.ManagerImpl.fire(ManagerImpl.java:133)
	at org.jboss.arquillian.core.impl.ManagerImpl.fire(ManagerImpl.java:105)
	at org.jboss.arquillian.core.impl.EventImpl.fire(EventImpl.java:62)
	at org.jboss.arquillian.container.impl.client.container.ContainerDeployController$1.perform(ContainerDeployController.java:92)
	at org.jboss.arquillian.container.impl.client.container.ContainerDeployController$1.perform(ContainerDeployController.java:77)
	at org.jboss.arquillian.container.impl.client.container.ContainerDeployController.forEachDeployment(ContainerDeployController.java:232)
	at org.jboss.arquillian.container.impl.client.container.ContainerDeployController.forEachManagedDeployment(ContainerDeployController.java:212)
	at org.jboss.arquillian.container.impl.client.container.ContainerDeployController.deployManaged(ContainerDeployController.java:77)
	at sun.reflect.NativeMethodAccessorImpl.invoke0(Native Method)
	at sun.reflect.NativeMethodAccessorImpl.invoke(NativeMethodAccessorImpl.java:62)
	at sun.reflect.DelegatingMethodAccessorImpl.invoke(DelegatingMethodAccessorImpl.java:43)
	at java.lang.reflect.Method.invoke(Method.java:498)
	at org.jboss.arquillian.core.impl.ObserverImpl.invoke(ObserverImpl.java:86)
	at org.jboss.arquillian.core.impl.EventContextImpl.invokeObservers(EventContextImpl.java:103)
	at org.jboss.arquillian.core.impl.EventContextImpl.proceed(EventContextImpl.java:90)
	at org.eu.ingwar.tools.arquillian.extension.suite.SuiteDeployer.blockDeployManagedDeploymentsWhenNeeded(SuiteDeployer.java:95)
	at sun.reflect.NativeMethodAccessorImpl.invoke0(Native Method)
	at sun.reflect.NativeMethodAccessorImpl.invoke(NativeMethodAccessorImpl.java:62)
	at sun.reflect.DelegatingMethodAccessorImpl.invoke(DelegatingMethodAccessorImpl.java:43)
	at java.lang.reflect.Method.invoke(Method.java:498)
	at org.jboss.arquillian.core.impl.ObserverImpl.invoke(ObserverImpl.java:86)
	at org.jboss.arquillian.core.impl.EventContextImpl.proceed(EventContextImpl.java:95)
	at org.jboss.arquillian.core.impl.ManagerImpl.fire(ManagerImpl.java:133)
	at org.jboss.arquillian.core.impl.ManagerImpl.fire(ManagerImpl.java:105)
	at org.jboss.arquillian.core.impl.EventImpl.fire(EventImpl.java:62)
	at org.jboss.arquillian.container.test.impl.client.ContainerEventController.execute(ContainerEventController.java:96)
	at sun.reflect.NativeMethodAccessorImpl.invoke0(Native Method)
	at sun.reflect.NativeMethodAccessorImpl.invoke(NativeMethodAccessorImpl.java:62)
	at sun.reflect.DelegatingMethodAccessorImpl.invoke(DelegatingMethodAccessorImpl.java:43)
	at java.lang.reflect.Method.invoke(Method.java:498)
	at org.jboss.arquillian.core.impl.ObserverImpl.invoke(ObserverImpl.java:86)
	at org.jboss.arquillian.core.impl.EventContextImpl.invokeObservers(EventContextImpl.java:103)
	at org.jboss.arquillian.core.impl.EventContextImpl.proceed(EventContextImpl.java:90)
	at org.jboss.arquillian.test.impl.TestContextHandler.createClassContext(TestContextHandler.java:83)
	at sun.reflect.NativeMethodAccessorImpl.invoke0(Native Method)
	at sun.reflect.NativeMethodAccessorImpl.invoke(NativeMethodAccessorImpl.java:62)
	at sun.reflect.DelegatingMethodAccessorImpl.invoke(DelegatingMethodAccessorImpl.java:43)
	at java.lang.reflect.Method.invoke(Method.java:498)
	at org.jboss.arquillian.core.impl.ObserverImpl.invoke(ObserverImpl.java:86)
	at org.jboss.arquillian.core.impl.EventContextImpl.proceed(EventContextImpl.java:95)
	at org.jboss.arquillian.test.impl.TestContextHandler.createSuiteContext(TestContextHandler.java:69)
	at sun.reflect.NativeMethodAccessorImpl.invoke0(Native Method)
	at sun.reflect.NativeMethodAccessorImpl.invoke(NativeMethodAccessorImpl.java:62)
	at sun.reflect.DelegatingMethodAccessorImpl.invoke(DelegatingMethodAccessorImpl.java:43)
	at java.lang.reflect.Method.invoke(Method.java:498)
	at org.jboss.arquillian.core.impl.ObserverImpl.invoke(ObserverImpl.java:86)
	at org.jboss.arquillian.core.impl.EventContextImpl.proceed(EventContextImpl.java:95)
	at org.jboss.arquillian.core.impl.ManagerImpl.fire(ManagerImpl.java:133)
	at org.jboss.arquillian.core.impl.ManagerImpl.fire(ManagerImpl.java:105)
	at org.jboss.arquillian.test.impl.EventTestRunnerAdaptor.beforeClass(EventTestRunnerAdaptor.java:89)
	at org.jboss.arquillian.testng.Arquillian.arquillianBeforeClass(Arquillian.java:96)
	at sun.reflect.NativeMethodAccessorImpl.invoke0(Native Method)
	at sun.reflect.NativeMethodAccessorImpl.invoke(NativeMethodAccessorImpl.java:62)
	at sun.reflect.DelegatingMethodAccessorImpl.invoke(DelegatingMethodAccessorImpl.java:43)
	at java.lang.reflect.Method.invoke(Method.java:498)
	at org.testng.internal.MethodInvocationHelper.invokeMethod(MethodInvocationHelper.java:124)
	at org.testng.internal.MethodInvocationHelper.invokeMethodConsideringTimeout(MethodInvocationHelper.java:59)
	at org.testng.internal.Invoker.invokeConfigurationMethod(Invoker.java:458)
	at org.testng.internal.Invoker.invokeConfigurations(Invoker.java:222)
	at org.testng.internal.Invoker.invokeConfigurations(Invoker.java:142)
	at org.testng.internal.TestMethodWorker.invokeBeforeClassMethods(TestMethodWorker.java:168)
	at org.testng.internal.TestMethodWorker.run(TestMethodWorker.java:105)
	at org.testng.TestRunner.privateRun(TestRunner.java:648)
	at org.testng.TestRunner.run(TestRunner.java:505)
	at org.testng.SuiteRunner.runTest(SuiteRunner.java:455)
	at org.testng.SuiteRunner.runSequentially(SuiteRunner.java:450)
	at org.testng.SuiteRunner.privateRun(SuiteRunner.java:415)
	at org.testng.SuiteRunner.run(SuiteRunner.java:364)
	at org.testng.SuiteRunnerWorker.runSuite(SuiteRunnerWorker.java:52)
	at org.testng.SuiteRunnerWorker.run(SuiteRunnerWorker.java:84)
	at org.testng.TestNG.runSuitesSequentially(TestNG.java:1208)
	at org.testng.TestNG.runSuitesLocally(TestNG.java:1137)
	at org.testng.TestNG.runSuites(TestNG.java:1049)
	at org.testng.TestNG.run(TestNG.java:1017)
	at org.apache.maven.surefire.testng.TestNGExecutor.run(TestNGExecutor.java:281)
	at org.apache.maven.surefire.testng.TestNGXmlTestSuite.execute(TestNGXmlTestSuite.java:75)
	at org.apache.maven.surefire.testng.TestNGProvider.invoke(TestNGProvider.java:121)
	at org.apache.maven.surefire.booter.ForkedBooter.invokeProviderInSameClassLoader(ForkedBooter.java:290)
	at org.apache.maven.surefire.booter.ForkedBooter.runSuitesInProcess(ForkedBooter.java:242)
	at org.apache.maven.surefire.booter.ForkedBooter.main(ForkedBooter.java:121)
[main] WARN org.eclipse.jetty.webapp.WebAppContext - Failed startup of context o.e.j.w.WebAppContext@51c65a43{/export4136889291191827874oxtrust,file:///tmp/jetty-localhost-9980-export4136889291191827874oxtrust.war-_export4136889291191827874oxtrust-any-873979724327850153.dir/webapp/,UNAVAILABLE}{/home/jenkins/.jenkins/jobs/oxTrust_4.2.1/workspace/server/target/arquillian-jetty-temp/export4136889291191827874oxtrust.war}
java.lang.RuntimeException: org.gluu.exception.ConfigurationException: Failed to load configuration from LDAP.
	at org.eclipse.jetty.annotations.ServletContainerInitializersStarter.doStart(ServletContainerInitializersStarter.java:69)
	at org.eclipse.jetty.util.component.AbstractLifeCycle.start(AbstractLifeCycle.java:68)
	at org.eclipse.jetty.servlet.ServletContextHandler.startContext(ServletContextHandler.java:355)
	at org.eclipse.jetty.webapp.WebAppContext.startWebapp(WebAppContext.java:1497)
	at org.eclipse.jetty.webapp.WebAppContext.startContext(WebAppContext.java:1459)
	at org.eclipse.jetty.server.handler.ContextHandler.doStart(ContextHandler.java:785)
	at org.eclipse.jetty.servlet.ServletContextHandler.doStart(ServletContextHandler.java:287)
	at org.eclipse.jetty.webapp.WebAppContext.doStart(WebAppContext.java:545)
	at org.eclipse.jetty.util.component.AbstractLifeCycle.start(AbstractLifeCycle.java:68)
	at org.eclipse.jetty.deploy.bindings.StandardStarter.processBinding(StandardStarter.java:46)
	at org.eclipse.jetty.deploy.AppLifeCycle.runBindings(AppLifeCycle.java:192)
	at org.eclipse.jetty.deploy.DeploymentManager.requestAppGoal(DeploymentManager.java:505)
	at org.eclipse.jetty.deploy.DeploymentManager.addApp(DeploymentManager.java:151)
	at org.jboss.arquillian.container.jetty.embedded_9.JettyEmbeddedContainer.deploy(JettyEmbeddedContainer.java:295)
	at org.jboss.arquillian.container.impl.client.container.ContainerDeployController$3.call(ContainerDeployController.java:151)
	at org.jboss.arquillian.container.impl.client.container.ContainerDeployController$3.call(ContainerDeployController.java:118)
	at org.jboss.arquillian.container.impl.client.container.ContainerDeployController.executeOperation(ContainerDeployController.java:239)
	at org.jboss.arquillian.container.impl.client.container.ContainerDeployController.deploy(ContainerDeployController.java:118)
	at sun.reflect.NativeMethodAccessorImpl.invoke0(Native Method)
	at sun.reflect.NativeMethodAccessorImpl.invoke(NativeMethodAccessorImpl.java:62)
	at sun.reflect.DelegatingMethodAccessorImpl.invoke(DelegatingMethodAccessorImpl.java:43)
	at java.lang.reflect.Method.invoke(Method.java:498)
	at org.jboss.arquillian.core.impl.ObserverImpl.invoke(ObserverImpl.java:86)
	at org.jboss.arquillian.core.impl.EventContextImpl.invokeObservers(EventContextImpl.java:103)
	at org.jboss.arquillian.core.impl.EventContextImpl.proceed(EventContextImpl.java:90)
	at org.jboss.arquillian.container.impl.client.container.DeploymentExceptionHandler.verifyExpectedExceptionDuringDeploy(DeploymentExceptionHandler.java:47)
	at sun.reflect.NativeMethodAccessorImpl.invoke0(Native Method)
	at sun.reflect.NativeMethodAccessorImpl.invoke(NativeMethodAccessorImpl.java:62)
	at sun.reflect.DelegatingMethodAccessorImpl.invoke(DelegatingMethodAccessorImpl.java:43)
	at java.lang.reflect.Method.invoke(Method.java:498)
	at org.jboss.arquillian.core.impl.ObserverImpl.invoke(ObserverImpl.java:86)
	at org.jboss.arquillian.core.impl.EventContextImpl.proceed(EventContextImpl.java:95)
	at org.jboss.arquillian.container.impl.client.ContainerDeploymentContextHandler.createDeploymentContext(ContainerDeploymentContextHandler.java:71)
	at sun.reflect.NativeMethodAccessorImpl.invoke0(Native Method)
	at sun.reflect.NativeMethodAccessorImpl.invoke(NativeMethodAccessorImpl.java:62)
	at sun.reflect.DelegatingMethodAccessorImpl.invoke(DelegatingMethodAccessorImpl.java:43)
	at java.lang.reflect.Method.invoke(Method.java:498)
	at org.jboss.arquillian.core.impl.ObserverImpl.invoke(ObserverImpl.java:86)
	at org.jboss.arquillian.core.impl.EventContextImpl.proceed(EventContextImpl.java:95)
	at org.jboss.arquillian.container.impl.client.ContainerDeploymentContextHandler.createContainerContext(ContainerDeploymentContextHandler.java:54)
	at sun.reflect.NativeMethodAccessorImpl.invoke0(Native Method)
	at sun.reflect.NativeMethodAccessorImpl.invoke(NativeMethodAccessorImpl.java:62)
	at sun.reflect.DelegatingMethodAccessorImpl.invoke(DelegatingMethodAccessorImpl.java:43)
	at java.lang.reflect.Method.invoke(Method.java:498)
	at org.jboss.arquillian.core.impl.ObserverImpl.invoke(ObserverImpl.java:86)
	at org.jboss.arquillian.core.impl.EventContextImpl.proceed(EventContextImpl.java:95)
	at org.jboss.arquillian.core.impl.ManagerImpl.fire(ManagerImpl.java:133)
	at org.jboss.arquillian.core.impl.ManagerImpl.fire(ManagerImpl.java:105)
	at org.jboss.arquillian.core.impl.EventImpl.fire(EventImpl.java:62)
	at org.jboss.arquillian.container.impl.client.container.ContainerDeployController$1.perform(ContainerDeployController.java:92)
	at org.jboss.arquillian.container.impl.client.container.ContainerDeployController$1.perform(ContainerDeployController.java:77)
	at org.jboss.arquillian.container.impl.client.container.ContainerDeployController.forEachDeployment(ContainerDeployController.java:232)
	at org.jboss.arquillian.container.impl.client.container.ContainerDeployController.forEachManagedDeployment(ContainerDeployController.java:212)
	at org.jboss.arquillian.container.impl.client.container.ContainerDeployController.deployManaged(ContainerDeployController.java:77)
	at sun.reflect.NativeMethodAccessorImpl.invoke0(Native Method)
	at sun.reflect.NativeMethodAccessorImpl.invoke(NativeMethodAccessorImpl.java:62)
	at sun.reflect.DelegatingMethodAccessorImpl.invoke(DelegatingMethodAccessorImpl.java:43)
	at java.lang.reflect.Method.invoke(Method.java:498)
	at org.jboss.arquillian.core.impl.ObserverImpl.invoke(ObserverImpl.java:86)
	at org.jboss.arquillian.core.impl.EventContextImpl.invokeObservers(EventContextImpl.java:103)
	at org.jboss.arquillian.core.impl.EventContextImpl.proceed(EventContextImpl.java:90)
	at org.eu.ingwar.tools.arquillian.extension.suite.SuiteDeployer.blockDeployManagedDeploymentsWhenNeeded(SuiteDeployer.java:95)
	at sun.reflect.NativeMethodAccessorImpl.invoke0(Native Method)
	at sun.reflect.NativeMethodAccessorImpl.invoke(NativeMethodAccessorImpl.java:62)
	at sun.reflect.DelegatingMethodAccessorImpl.invoke(DelegatingMethodAccessorImpl.java:43)
	at java.lang.reflect.Method.invoke(Method.java:498)
	at org.jboss.arquillian.core.impl.ObserverImpl.invoke(ObserverImpl.java:86)
	at org.jboss.arquillian.core.impl.EventContextImpl.proceed(EventContextImpl.java:95)
	at org.jboss.arquillian.core.impl.ManagerImpl.fire(ManagerImpl.java:133)
	at org.jboss.arquillian.core.impl.ManagerImpl.fire(ManagerImpl.java:105)
	at org.jboss.arquillian.core.impl.EventImpl.fire(EventImpl.java:62)
	at org.jboss.arquillian.container.test.impl.client.ContainerEventController.execute(ContainerEventController.java:96)
	at sun.reflect.NativeMethodAccessorImpl.invoke0(Native Method)
	at sun.reflect.NativeMethodAccessorImpl.invoke(NativeMethodAccessorImpl.java:62)
	at sun.reflect.DelegatingMethodAccessorImpl.invoke(DelegatingMethodAccessorImpl.java:43)
	at java.lang.reflect.Method.invoke(Method.java:498)
	at org.jboss.arquillian.core.impl.ObserverImpl.invoke(ObserverImpl.java:86)
	at org.jboss.arquillian.core.impl.EventContextImpl.invokeObservers(EventContextImpl.java:103)
	at org.jboss.arquillian.core.impl.EventContextImpl.proceed(EventContextImpl.java:90)
	at org.jboss.arquillian.test.impl.TestContextHandler.createClassContext(TestContextHandler.java:83)
	at sun.reflect.NativeMethodAccessorImpl.invoke0(Native Method)
	at sun.reflect.NativeMethodAccessorImpl.invoke(NativeMethodAccessorImpl.java:62)
	at sun.reflect.DelegatingMethodAccessorImpl.invoke(DelegatingMethodAccessorImpl.java:43)
	at java.lang.reflect.Method.invoke(Method.java:498)
	at org.jboss.arquillian.core.impl.ObserverImpl.invoke(ObserverImpl.java:86)
	at org.jboss.arquillian.core.impl.EventContextImpl.proceed(EventContextImpl.java:95)
	at org.jboss.arquillian.test.impl.TestContextHandler.createSuiteContext(TestContextHandler.java:69)
	at sun.reflect.NativeMethodAccessorImpl.invoke0(Native Method)
	at sun.reflect.NativeMethodAccessorImpl.invoke(NativeMethodAccessorImpl.java:62)
	at sun.reflect.DelegatingMethodAccessorImpl.invoke(DelegatingMethodAccessorImpl.java:43)
	at java.lang.reflect.Method.invoke(Method.java:498)
	at org.jboss.arquillian.core.impl.ObserverImpl.invoke(ObserverImpl.java:86)
	at org.jboss.arquillian.core.impl.EventContextImpl.proceed(EventContextImpl.java:95)
	at org.jboss.arquillian.core.impl.ManagerImpl.fire(ManagerImpl.java:133)
	at org.jboss.arquillian.core.impl.ManagerImpl.fire(ManagerImpl.java:105)
	at org.jboss.arquillian.test.impl.EventTestRunnerAdaptor.beforeClass(EventTestRunnerAdaptor.java:89)
	at org.jboss.arquillian.testng.Arquillian.arquillianBeforeClass(Arquillian.java:96)
	at sun.reflect.NativeMethodAccessorImpl.invoke0(Native Method)
	at sun.reflect.NativeMethodAccessorImpl.invoke(NativeMethodAccessorImpl.java:62)
	at sun.reflect.DelegatingMethodAccessorImpl.invoke(DelegatingMethodAccessorImpl.java:43)
	at java.lang.reflect.Method.invoke(Method.java:498)
	at org.testng.internal.MethodInvocationHelper.invokeMethod(MethodInvocationHelper.java:124)
	at org.testng.internal.MethodInvocationHelper.invokeMethodConsideringTimeout(MethodInvocationHelper.java:59)
	at org.testng.internal.Invoker.invokeConfigurationMethod(Invoker.java:458)
	at org.testng.internal.Invoker.invokeConfigurations(Invoker.java:222)
	at org.testng.internal.Invoker.invokeConfigurations(Invoker.java:142)
	at org.testng.internal.TestMethodWorker.invokeBeforeClassMethods(TestMethodWorker.java:168)
	at org.testng.internal.TestMethodWorker.run(TestMethodWorker.java:105)
	at org.testng.TestRunner.privateRun(TestRunner.java:648)
	at org.testng.TestRunner.run(TestRunner.java:505)
	at org.testng.SuiteRunner.runTest(SuiteRunner.java:455)
	at org.testng.SuiteRunner.runSequentially(SuiteRunner.java:450)
	at org.testng.SuiteRunner.privateRun(SuiteRunner.java:415)
	at org.testng.SuiteRunner.run(SuiteRunner.java:364)
	at org.testng.SuiteRunnerWorker.runSuite(SuiteRunnerWorker.java:52)
	at org.testng.SuiteRunnerWorker.run(SuiteRunnerWorker.java:84)
	at org.testng.TestNG.runSuitesSequentially(TestNG.java:1208)
	at org.testng.TestNG.runSuitesLocally(TestNG.java:1137)
	at org.testng.TestNG.runSuites(TestNG.java:1049)
	at org.testng.TestNG.run(TestNG.java:1017)
	at org.apache.maven.surefire.testng.TestNGExecutor.run(TestNGExecutor.java:281)
	at org.apache.maven.surefire.testng.TestNGXmlTestSuite.execute(TestNGXmlTestSuite.java:75)
	at org.apache.maven.surefire.testng.TestNGProvider.invoke(TestNGProvider.java:121)
	at org.apache.maven.surefire.booter.ForkedBooter.invokeProviderInSameClassLoader(ForkedBooter.java:290)
	at org.apache.maven.surefire.booter.ForkedBooter.runSuitesInProcess(ForkedBooter.java:242)
	at org.apache.maven.surefire.booter.ForkedBooter.main(ForkedBooter.java:121)
Caused by: org.gluu.exception.ConfigurationException: Failed to load configuration from LDAP.
	at org.gluu.service.config.ConfigurationFactory.create(ConfigurationFactory.java:148)
	at org.gluu.oxtrust.service.config.ConfigurationFactory$Proxy$_$$_WeldSubclass.create(Unknown Source)
	at org.gluu.oxtrust.service.config.ConfigurationFactory$Proxy$_$$_WeldClientProxy.create(Unknown Source)
	at org.gluu.oxtrust.service.AppInitializer.applicationInitialized(AppInitializer.java:180)
	at sun.reflect.NativeMethodAccessorImpl.invoke0(Native Method)
	at sun.reflect.NativeMethodAccessorImpl.invoke(NativeMethodAccessorImpl.java:62)
	at sun.reflect.DelegatingMethodAccessorImpl.invoke(DelegatingMethodAccessorImpl.java:43)
	at java.lang.reflect.Method.invoke(Method.java:498)
	at org.jboss.weld.injection.StaticMethodInjectionPoint.invoke(StaticMethodInjectionPoint.java:95)
	at org.jboss.weld.injection.StaticMethodInjectionPoint.invoke(StaticMethodInjectionPoint.java:85)
	at org.jboss.weld.injection.MethodInvocationStrategy$SimpleMethodInvocationStrategy.invoke(MethodInvocationStrategy.java:168)
	at org.jboss.weld.event.ObserverMethodImpl.sendEvent(ObserverMethodImpl.java:330)
	at org.jboss.weld.event.ObserverMethodImpl.sendEvent(ObserverMethodImpl.java:308)
	at org.jboss.weld.event.ObserverMethodImpl.notify(ObserverMethodImpl.java:286)
	at javax.enterprise.inject.spi.ObserverMethod.notify(ObserverMethod.java:124)
	at org.jboss.weld.util.Observers.notify(Observers.java:166)
	at org.jboss.weld.event.ObserverNotifier.notifySyncObservers(ObserverNotifier.java:285)
	at org.jboss.weld.event.ObserverNotifier.notify(ObserverNotifier.java:273)
	at org.jboss.weld.event.ObserverNotifier.fireEvent(ObserverNotifier.java:177)
	at org.jboss.weld.bootstrap.BeanDeploymentModule.fireEvent(BeanDeploymentModule.java:93)
	at org.jboss.weld.module.web.servlet.HttpContextLifecycle.fireEventForApplicationScope(HttpContextLifecycle.java:161)
	at org.jboss.weld.module.web.servlet.HttpContextLifecycle.contextInitialized(HttpContextLifecycle.java:147)
	at org.jboss.weld.module.web.servlet.WeldInitialListener.contextInitialized(WeldInitialListener.java:99)
	at org.jboss.weld.servlet.api.helpers.ForwardingServletListener.contextInitialized(ForwardingServletListener.java:34)
	at org.jboss.weld.environment.servlet.EnhancedListener.onStartup(EnhancedListener.java:66)
	at org.eclipse.jetty.plus.annotation.ContainerInitializer.callStartup(ContainerInitializer.java:140)
	at org.eclipse.jetty.annotations.ServletContainerInitializersStarter.doStart(ServletContainerInitializersStarter.java:64)
	... 125 more
[main] INFO org.eclipse.jetty.server.handler.ContextHandler - Stopped o.e.j.w.WebAppContext@51c65a43{/export4136889291191827874oxtrust,null,UNAVAILABLE}{/home/jenkins/.jenkins/jobs/oxTrust_4.2.1/workspace/server/target/arquillian-jetty-temp/export4136889291191827874oxtrust.war}
[main] INFO org.jboss.arquillian.container.jetty.embedded_9.JettyEmbeddedContainer - Stopping Jetty Embedded Server [id:725680028]
[main] INFO org.eclipse.jetty.server.AbstractConnector - Stopped ServerConnector@57bc27f5{HTTP/1.1,[http/1.1]}{localhost:9980}
Tests run: 9, Failures: 1, Errors: 0, Skipped: 4, Time elapsed: 24.562 sec <<< FAILURE! - in TestSuite
arquillianBeforeClass(org.gluu.oxtrust.action.ConfigurationStatusTest)  Time elapsed: 23.719 sec  <<< FAILURE!
org.jboss.arquillian.container.spi.client.container.DeploymentException: Could not deploy oxtrust.war
	at org.jboss.arquillian.container.jetty.embedded_9.JettyEmbeddedContainer.deploy(JettyEmbeddedContainer.java:311)
	at org.jboss.arquillian.container.impl.client.container.ContainerDeployController$3.call(ContainerDeployController.java:151)
	at org.jboss.arquillian.container.impl.client.container.ContainerDeployController$3.call(ContainerDeployController.java:118)
	at org.jboss.arquillian.container.impl.client.container.ContainerDeployController.executeOperation(ContainerDeployController.java:239)
	at org.jboss.arquillian.container.impl.client.container.ContainerDeployController.deploy(ContainerDeployController.java:118)
	at sun.reflect.NativeMethodAccessorImpl.invoke0(Native Method)
	at sun.reflect.NativeMethodAccessorImpl.invoke(NativeMethodAccessorImpl.java:62)
	at sun.reflect.DelegatingMethodAccessorImpl.invoke(DelegatingMethodAccessorImpl.java:43)
	at java.lang.reflect.Method.invoke(Method.java:498)
	at org.jboss.arquillian.core.impl.ObserverImpl.invoke(ObserverImpl.java:86)
	at org.jboss.arquillian.core.impl.EventContextImpl.invokeObservers(EventContextImpl.java:103)
	at org.jboss.arquillian.core.impl.EventContextImpl.proceed(EventContextImpl.java:90)
	at org.jboss.arquillian.container.impl.client.container.DeploymentExceptionHandler.verifyExpectedExceptionDuringDeploy(DeploymentExceptionHandler.java:47)
	at sun.reflect.NativeMethodAccessorImpl.invoke0(Native Method)
	at sun.reflect.NativeMethodAccessorImpl.invoke(NativeMethodAccessorImpl.java:62)
	at sun.reflect.DelegatingMethodAccessorImpl.invoke(DelegatingMethodAccessorImpl.java:43)
	at java.lang.reflect.Method.invoke(Method.java:498)
	at org.jboss.arquillian.core.impl.ObserverImpl.invoke(ObserverImpl.java:86)
	at org.jboss.arquillian.core.impl.EventContextImpl.proceed(EventContextImpl.java:95)
	at org.jboss.arquillian.container.impl.client.ContainerDeploymentContextHandler.createDeploymentContext(ContainerDeploymentContextHandler.java:71)
	at sun.reflect.NativeMethodAccessorImpl.invoke0(Native Method)
	at sun.reflect.NativeMethodAccessorImpl.invoke(NativeMethodAccessorImpl.java:62)
	at sun.reflect.DelegatingMethodAccessorImpl.invoke(DelegatingMethodAccessorImpl.java:43)
	at java.lang.reflect.Method.invoke(Method.java:498)
	at org.jboss.arquillian.core.impl.ObserverImpl.invoke(ObserverImpl.java:86)
	at org.jboss.arquillian.core.impl.EventContextImpl.proceed(EventContextImpl.java:95)
	at org.jboss.arquillian.container.impl.client.ContainerDeploymentContextHandler.createContainerContext(ContainerDeploymentContextHandler.java:54)
	at sun.reflect.NativeMethodAccessorImpl.invoke0(Native Method)
	at sun.reflect.NativeMethodAccessorImpl.invoke(NativeMethodAccessorImpl.java:62)
	at sun.reflect.DelegatingMethodAccessorImpl.invoke(DelegatingMethodAccessorImpl.java:43)
	at java.lang.reflect.Method.invoke(Method.java:498)
	at org.jboss.arquillian.core.impl.ObserverImpl.invoke(ObserverImpl.java:86)
	at org.jboss.arquillian.core.impl.EventContextImpl.proceed(EventContextImpl.java:95)
	at org.jboss.arquillian.core.impl.ManagerImpl.fire(ManagerImpl.java:133)
	at org.jboss.arquillian.core.impl.ManagerImpl.fire(ManagerImpl.java:105)
	at org.jboss.arquillian.core.impl.EventImpl.fire(EventImpl.java:62)
	at org.jboss.arquillian.container.impl.client.container.ContainerDeployController$1.perform(ContainerDeployController.java:92)
	at org.jboss.arquillian.container.impl.client.container.ContainerDeployController$1.perform(ContainerDeployController.java:77)
	at org.jboss.arquillian.container.impl.client.container.ContainerDeployController.forEachDeployment(ContainerDeployController.java:232)
	at org.jboss.arquillian.container.impl.client.container.ContainerDeployController.forEachManagedDeployment(ContainerDeployController.java:212)
	at org.jboss.arquillian.container.impl.client.container.ContainerDeployController.deployManaged(ContainerDeployController.java:77)
	at sun.reflect.NativeMethodAccessorImpl.invoke0(Native Method)
	at sun.reflect.NativeMethodAccessorImpl.invoke(NativeMethodAccessorImpl.java:62)
	at sun.reflect.DelegatingMethodAccessorImpl.invoke(DelegatingMethodAccessorImpl.java:43)
	at java.lang.reflect.Method.invoke(Method.java:498)
	at org.jboss.arquillian.core.impl.ObserverImpl.invoke(ObserverImpl.java:86)
	at org.jboss.arquillian.core.impl.EventContextImpl.invokeObservers(EventContextImpl.java:103)
	at org.jboss.arquillian.core.impl.EventContextImpl.proceed(EventContextImpl.java:90)
	at org.eu.ingwar.tools.arquillian.extension.suite.SuiteDeployer.blockDeployManagedDeploymentsWhenNeeded(SuiteDeployer.java:95)
	at sun.reflect.NativeMethodAccessorImpl.invoke0(Native Method)
	at sun.reflect.NativeMethodAccessorImpl.invoke(NativeMethodAccessorImpl.java:62)
	at sun.reflect.DelegatingMethodAccessorImpl.invoke(DelegatingMethodAccessorImpl.java:43)
	at java.lang.reflect.Method.invoke(Method.java:498)
	at org.jboss.arquillian.core.impl.ObserverImpl.invoke(ObserverImpl.java:86)
	at org.jboss.arquillian.core.impl.EventContextImpl.proceed(EventContextImpl.java:95)
	at org.jboss.arquillian.core.impl.ManagerImpl.fire(ManagerImpl.java:133)
	at org.jboss.arquillian.core.impl.ManagerImpl.fire(ManagerImpl.java:105)
	at org.jboss.arquillian.core.impl.EventImpl.fire(EventImpl.java:62)
	at org.jboss.arquillian.container.test.impl.client.ContainerEventController.execute(ContainerEventController.java:96)
	at sun.reflect.NativeMethodAccessorImpl.invoke0(Native Method)
	at sun.reflect.NativeMethodAccessorImpl.invoke(NativeMethodAccessorImpl.java:62)
	at sun.reflect.DelegatingMethodAccessorImpl.invoke(DelegatingMethodAccessorImpl.java:43)
	at java.lang.reflect.Method.invoke(Method.java:498)
	at org.jboss.arquillian.core.impl.ObserverImpl.invoke(ObserverImpl.java:86)
	at org.jboss.arquillian.core.impl.EventContextImpl.invokeObservers(EventContextImpl.java:103)
	at org.jboss.arquillian.core.impl.EventContextImpl.proceed(EventContextImpl.java:90)
	at org.jboss.arquillian.test.impl.TestContextHandler.createClassContext(TestContextHandler.java:83)
	at sun.reflect.NativeMethodAccessorImpl.invoke0(Native Method)
	at sun.reflect.NativeMethodAccessorImpl.invoke(NativeMethodAccessorImpl.java:62)
	at sun.reflect.DelegatingMethodAccessorImpl.invoke(DelegatingMethodAccessorImpl.java:43)
	at java.lang.reflect.Method.invoke(Method.java:498)
	at org.jboss.arquillian.core.impl.ObserverImpl.invoke(ObserverImpl.java:86)
	at org.jboss.arquillian.core.impl.EventContextImpl.proceed(EventContextImpl.java:95)
	at org.jboss.arquillian.test.impl.TestContextHandler.createSuiteContext(TestContextHandler.java:69)
	at sun.reflect.NativeMethodAccessorImpl.invoke0(Native Method)
	at sun.reflect.NativeMethodAccessorImpl.invoke(NativeMethodAccessorImpl.java:62)
	at sun.reflect.DelegatingMethodAccessorImpl.invoke(DelegatingMethodAccessorImpl.java:43)
	at java.lang.reflect.Method.invoke(Method.java:498)
	at org.jboss.arquillian.core.impl.ObserverImpl.invoke(ObserverImpl.java:86)
	at org.jboss.arquillian.core.impl.EventContextImpl.proceed(EventContextImpl.java:95)
	at org.jboss.arquillian.core.impl.ManagerImpl.fire(ManagerImpl.java:133)
	at org.jboss.arquillian.core.impl.ManagerImpl.fire(ManagerImpl.java:105)
	at org.jboss.arquillian.test.impl.EventTestRunnerAdaptor.beforeClass(EventTestRunnerAdaptor.java:89)
	at org.jboss.arquillian.testng.Arquillian.arquillianBeforeClass(Arquillian.java:96)
	at sun.reflect.NativeMethodAccessorImpl.invoke0(Native Method)
	at sun.reflect.NativeMethodAccessorImpl.invoke(NativeMethodAccessorImpl.java:62)
	at sun.reflect.DelegatingMethodAccessorImpl.invoke(DelegatingMethodAccessorImpl.java:43)
	at java.lang.reflect.Method.invoke(Method.java:498)
	at org.testng.internal.MethodInvocationHelper.invokeMethod(MethodInvocationHelper.java:124)
	at org.testng.internal.MethodInvocationHelper.invokeMethodConsideringTimeout(MethodInvocationHelper.java:59)
	at org.testng.internal.Invoker.invokeConfigurationMethod(Invoker.java:458)
	at org.testng.internal.Invoker.invokeConfigurations(Invoker.java:222)
	at org.testng.internal.Invoker.invokeConfigurations(Invoker.java:142)
	at org.testng.internal.TestMethodWorker.invokeBeforeClassMethods(TestMethodWorker.java:168)
	at org.testng.internal.TestMethodWorker.run(TestMethodWorker.java:105)
	at org.testng.TestRunner.privateRun(TestRunner.java:648)
	at org.testng.TestRunner.run(TestRunner.java:505)
	at org.testng.SuiteRunner.runTest(SuiteRunner.java:455)
	at org.testng.SuiteRunner.runSequentially(SuiteRunner.java:450)
	at org.testng.SuiteRunner.privateRun(SuiteRunner.java:415)
	at org.testng.SuiteRunner.run(SuiteRunner.java:364)
	at org.testng.SuiteRunnerWorker.runSuite(SuiteRunnerWorker.java:52)
	at org.testng.SuiteRunnerWorker.run(SuiteRunnerWorker.java:84)
	at org.testng.TestNG.runSuitesSequentially(TestNG.java:1208)
	at org.testng.TestNG.runSuitesLocally(TestNG.java:1137)
	at org.testng.TestNG.runSuites(TestNG.java:1049)
	at org.testng.TestNG.run(TestNG.java:1017)
	at org.apache.maven.surefire.testng.TestNGExecutor.run(TestNGExecutor.java:281)
	at org.apache.maven.surefire.testng.TestNGXmlTestSuite.execute(TestNGXmlTestSuite.java:75)
	at org.apache.maven.surefire.testng.TestNGProvider.invoke(TestNGProvider.java:121)
	at org.apache.maven.surefire.booter.ForkedBooter.invokeProviderInSameClassLoader(ForkedBooter.java:290)
	at org.apache.maven.surefire.booter.ForkedBooter.runSuitesInProcess(ForkedBooter.java:242)
	at org.apache.maven.surefire.booter.ForkedBooter.main(ForkedBooter.java:121)
Caused by: java.lang.NullPointerException
	at org.eclipse.jetty.servlet.ServletHolder.getContextPath(ServletHolder.java:763)
	at org.jboss.arquillian.container.jetty.embedded_9.JettyEmbeddedContainer.deploy(JettyEmbeddedContainer.java:305)
	... 112 more


Results :

Failed tests: 
  ConfigurationStatusTest>Arquillian.arquillianBeforeClass:96 ยป Deployment Could...

Tests run: 9, Failures: 1, Errors: 0, Skipped: 4

[INFO] ------------------------------------------------------------------------
[INFO] Reactor Summary:
[INFO] 
[INFO] oxTrust ............................................ SUCCESS [  3.658 s]
[INFO] oxTrust static resources ........................... SUCCESS [  2.365 s]
[INFO] oxTrust configuration .............................. SUCCESS [  0.323 s]
[INFO] oxTrust Model library .............................. SUCCESS [ 12.763 s]
[INFO] oxTrust Client library ............................. SUCCESS [  0.276 s]
[INFO] oxTrust Service .................................... SUCCESS [ 26.754 s]
[INFO] OpenId authentication module ....................... SUCCESS [  7.871 s]
[INFO] oxTrust Server ..................................... FAILURE [ 39.074 s]
[INFO] OpenId authentication module for Saml .............. SKIPPED
[INFO] OpenId authentication module for CAS ............... SKIPPED
[INFO] oxtrust-qa ......................................... SKIPPED
[INFO] oxTrust Server Test ................................ SKIPPED
[INFO] API Server ......................................... SKIPPED
[INFO] ------------------------------------------------------------------------
[INFO] BUILD FAILURE
[INFO] ------------------------------------------------------------------------
[INFO] Total time: 01:34 min
[INFO] Finished at: 2021-12-16T16:12:16+00:00
[INFO] Final Memory: 158M/959M
[INFO] ------------------------------------------------------------------------
[ERROR] Failed to execute goal org.apache.maven.plugins:maven-surefire-plugin:2.19.1:test (default-test) on project oxtrust-server: There are test failures.
[ERROR] 
[ERROR] Please refer to /home/jenkins/.jenkins/jobs/oxTrust_4.2.1/workspace/server/target/surefire-reports for the individual test results.
[ERROR] -> [Help 1]
[ERROR] 
[ERROR] To see the full stack trace of the errors, re-run Maven with the -e switch.
[ERROR] Re-run Maven using the -X switch to enable full debug logging.
[ERROR] 
[ERROR] For more information about the errors and possible solutions, please read the following articles:
[ERROR] [Help 1] http://cwiki.apache.org/confluence/display/MAVEN/MojoFailureException
[ERROR] 
[ERROR] After correcting the problems, you can resume the build with the command
[ERROR]   mvn <goals> -rf :oxtrust-server
Build step 'Invoke top-level Maven targets' marked build as failure
[FINDBUGS] Skipping publisher since build result is FAILURE
Publishing Javadoc
TestNG Reports Processing: START
Looking for TestNG results report in workspace using pattern: **/testng-results.xml
Saving reports...
Processing '/home/jenkins/.jenkins/jobs/oxTrust_4.2.1/builds/2226/testng/testng-results.xml'
TestNG Reports Processing: FINISH
Sending e-mails to: support@gluu.org
ERROR: Couldn't connect to host, port: webmail.gluu.org, 465; timeout 60000
com.sun.mail.util.MailConnectException: Couldn't connect to host, port: webmail.gluu.org, 465; timeout 60000;
  nested exception is:
	java.net.SocketTimeoutException: connect timed out
	at com.sun.mail.smtp.SMTPTransport.openServer(SMTPTransport.java:2210)
	at com.sun.mail.smtp.SMTPTransport.protocolConnect(SMTPTransport.java:722)
	at javax.mail.Service.connect(Service.java:310)
	at javax.mail.Service.connect(Service.java:169)
	at javax.mail.Service.connect(Service.java:118)
	at javax.mail.Transport.send0(Transport.java:188)
	at javax.mail.Transport.send(Transport.java:118)
	at hudson.tasks.MailSender.run(MailSender.java:130)
	at hudson.tasks.Mailer.perform(Mailer.java:176)
	at hudson.tasks.Mailer.perform(Mailer.java:139)
	at hudson.tasks.BuildStepMonitor$1.perform(BuildStepMonitor.java:20)
	at hudson.model.AbstractBuild$AbstractBuildExecution.perform(AbstractBuild.java:741)
	at hudson.model.AbstractBuild$AbstractBuildExecution.performAllBuildSteps(AbstractBuild.java:690)
	at hudson.model.Build$BuildExecution.post2(Build.java:186)
	at hudson.model.AbstractBuild$AbstractBuildExecution.post(AbstractBuild.java:635)
	at hudson.model.Run.execute(Run.java:1905)
	at hudson.model.FreeStyleBuild.run(FreeStyleBuild.java:43)
	at hudson.model.ResourceController.execute(ResourceController.java:97)
	at hudson.model.Executor.run(Executor.java:428)
Caused by: java.net.SocketTimeoutException: connect timed out
	at java.net.PlainSocketImpl.socketConnect(Native Method)
	at java.net.AbstractPlainSocketImpl.doConnect(AbstractPlainSocketImpl.java:350)
	at java.net.AbstractPlainSocketImpl.connectToAddress(AbstractPlainSocketImpl.java:206)
	at java.net.AbstractPlainSocketImpl.connect(AbstractPlainSocketImpl.java:188)
	at java.net.SocksSocketImpl.connect(SocksSocketImpl.java:392)
	at java.net.Socket.connect(Socket.java:589)
	at com.sun.mail.util.SocketFetcher.createSocket(SocketFetcher.java:333)
	at com.sun.mail.util.SocketFetcher.getSocket(SocketFetcher.java:193)
	at com.sun.mail.smtp.SMTPTransport.openServer(SMTPTransport.java:2160)
	... 18 more
[Boolean condition] checking [true] against [^(1|y|yes|t|true|on|run)$] (origin token: $DEPLOY_BUILD)
Run condition [Boolean condition] enabling perform for step [Builder to mark whether executed]
Finished: FAILURE