FailedConsole Output

Skipping 276 KB.. Full Log
Generating /home/jenkins/.jenkins/jobs/oxTrust_4.2.1/workspace/server/target/site/apidocs/org/gluu/oxtrust/action/push/class-use/PushDeviceInventoryAction.html...
Generating /home/jenkins/.jenkins/jobs/oxTrust_4.2.1/workspace/server/target/site/apidocs/org/gluu/oxtrust/action/push/class-use/PushApplicationInventoryAction.html...
Generating /home/jenkins/.jenkins/jobs/oxTrust_4.2.1/workspace/server/target/site/apidocs/org/gluu/oxtrust/action/radius/class-use/UpdateGluuRadiusConfigAction.html...
Generating /home/jenkins/.jenkins/jobs/oxTrust_4.2.1/workspace/server/target/site/apidocs/org/gluu/oxtrust/action/radius/class-use/UpdateRadiusClientAction.html...
Generating /home/jenkins/.jenkins/jobs/oxTrust_4.2.1/workspace/server/target/site/apidocs/org/gluu/oxtrust/action/radius/class-use/SearchRadiusClientAction.html...
Generating /home/jenkins/.jenkins/jobs/oxTrust_4.2.1/workspace/server/target/site/apidocs/org/gluu/oxtrust/action/radius/class-use/AddRadiusClientAction.html...
Generating /home/jenkins/.jenkins/jobs/oxTrust_4.2.1/workspace/server/target/site/apidocs/org/gluu/oxtrust/action/uma/class-use/UpdateUmaScopeAction.html...
Generating /home/jenkins/.jenkins/jobs/oxTrust_4.2.1/workspace/server/target/site/apidocs/org/gluu/oxtrust/action/uma/class-use/UpdateResourceAction.html...
Generating /home/jenkins/.jenkins/jobs/oxTrust_4.2.1/workspace/server/target/site/apidocs/org/gluu/oxtrust/action/uma/class-use/UmaScopeDownloadAction.html...
Generating /home/jenkins/.jenkins/jobs/oxTrust_4.2.1/workspace/server/target/site/apidocs/org/gluu/oxtrust/action/uma/class-use/UmaInventoryAction.html...
Generating /home/jenkins/.jenkins/jobs/oxTrust_4.2.1/workspace/server/target/site/apidocs/org/gluu/oxtrust/api/rest/class-use/InumRestWebService.html...
Generating /home/jenkins/.jenkins/jobs/oxTrust_4.2.1/workspace/server/target/site/apidocs/org/gluu/oxtrust/exception/class-use/GlobalExceptionHandler.html...
Generating /home/jenkins/.jenkins/jobs/oxTrust_4.2.1/workspace/server/target/site/apidocs/org/gluu/oxtrust/exception/class-use/UncaughtException.html...
Generating /home/jenkins/.jenkins/jobs/oxTrust_4.2.1/workspace/server/target/site/apidocs/org/gluu/oxtrust/exception/class-use/PersonRequiredFieldsException.html...
Generating /home/jenkins/.jenkins/jobs/oxTrust_4.2.1/workspace/server/target/site/apidocs/org/gluu/oxtrust/exception/class-use/PermissionException.html...
Generating /home/jenkins/.jenkins/jobs/oxTrust_4.2.1/workspace/server/target/site/apidocs/org/gluu/oxtrust/exception/class-use/GlobalExceptionHandlerFactory.html...
Generating /home/jenkins/.jenkins/jobs/oxTrust_4.2.1/workspace/server/target/site/apidocs/org/gluu/oxtrust/i18n/class-use/ApplicationFacesLocalizationConfigPopulator.html...
Generating /home/jenkins/.jenkins/jobs/oxTrust_4.2.1/workspace/server/target/site/apidocs/org/gluu/oxtrust/i18n/class-use/CustomResourceBundle.html...
Generating /home/jenkins/.jenkins/jobs/oxTrust_4.2.1/workspace/server/target/site/apidocs/org/gluu/oxtrust/ldap/cache/model/class-use/GluuSimplePerson.html...
Generating /home/jenkins/.jenkins/jobs/oxTrust_4.2.1/workspace/server/target/site/apidocs/org/gluu/oxtrust/ldap/cache/model/class-use/GluuInumMap.html...
Generating /home/jenkins/.jenkins/jobs/oxTrust_4.2.1/workspace/server/target/site/apidocs/org/gluu/oxtrust/ldap/cache/model/class-use/GluuCacheRefreshConfiguration.html...
Generating /home/jenkins/.jenkins/jobs/oxTrust_4.2.1/workspace/server/target/site/apidocs/org/gluu/oxtrust/ldap/cache/model/class-use/CacheCompoundKey.html...
Generating /home/jenkins/.jenkins/jobs/oxTrust_4.2.1/workspace/server/target/site/apidocs/org/gluu/oxtrust/ldap/cache/service/class-use/CacheRefreshTimer.html...
Generating /home/jenkins/.jenkins/jobs/oxTrust_4.2.1/workspace/server/target/site/apidocs/org/gluu/oxtrust/ldap/cache/service/class-use/CacheRefreshService.html...
Generating /home/jenkins/.jenkins/jobs/oxTrust_4.2.1/workspace/server/target/site/apidocs/org/gluu/oxtrust/ldap/cache/service/class-use/CacheRefreshUpdateMethod.html...
Generating /home/jenkins/.jenkins/jobs/oxTrust_4.2.1/workspace/server/target/site/apidocs/org/gluu/oxtrust/ldap/cache/service/class-use/CacheRefreshSnapshotFileService.html...
Generating /home/jenkins/.jenkins/jobs/oxTrust_4.2.1/workspace/server/target/site/apidocs/org/gluu/oxtrust/ldap/load/conf/class-use/ImportPersonConfiguration.html...
Generating /home/jenkins/.jenkins/jobs/oxTrust_4.2.1/workspace/server/target/site/apidocs/org/gluu/oxtrust/model/class-use/PassportProvider.html...
Generating /home/jenkins/.jenkins/jobs/oxTrust_4.2.1/workspace/server/target/site/apidocs/org/gluu/oxtrust/model/class-use/OptionEntry.html...
Generating /home/jenkins/.jenkins/jobs/oxTrust_4.2.1/workspace/server/target/site/apidocs/org/gluu/oxtrust/model/class-use/GluuUserPairwiseIdentifier.html...
Generating /home/jenkins/.jenkins/jobs/oxTrust_4.2.1/workspace/server/target/site/apidocs/org/gluu/oxtrust/model/class-use/OxAuthClient.html...
Generating /home/jenkins/.jenkins/jobs/oxTrust_4.2.1/workspace/server/target/site/apidocs/org/gluu/oxtrust/model/status/class-use/FacterJson.html...
Generating /home/jenkins/.jenkins/jobs/oxTrust_4.2.1/workspace/server/target/site/apidocs/org/gluu/oxtrust/model/status/class-use/OxtrustStat.html...
Generating /home/jenkins/.jenkins/jobs/oxTrust_4.2.1/workspace/server/target/site/apidocs/org/gluu/oxtrust/model/status/class-use/ConfigurationStatus.html...
Generating /home/jenkins/.jenkins/jobs/oxTrust_4.2.1/workspace/server/target/site/apidocs/org/gluu/oxtrust/service/class-use/MetadataValidationTimer.html...
Generating /home/jenkins/.jenkins/jobs/oxTrust_4.2.1/workspace/server/target/site/apidocs/org/gluu/oxtrust/service/class-use/MetricService.html...
Generating /home/jenkins/.jenkins/jobs/oxTrust_4.2.1/workspace/server/target/site/apidocs/org/gluu/oxtrust/service/class-use/SvnSyncTimer.html...
Generating /home/jenkins/.jenkins/jobs/oxTrust_4.2.1/workspace/server/target/site/apidocs/org/gluu/oxtrust/service/class-use/StatusCheckerDaily.html...
Generating /home/jenkins/.jenkins/jobs/oxTrust_4.2.1/workspace/server/target/site/apidocs/org/gluu/oxtrust/service/class-use/RecaptchaService.html...
Generating /home/jenkins/.jenkins/jobs/oxTrust_4.2.1/workspace/server/target/site/apidocs/org/gluu/oxtrust/service/class-use/OxTrustConfigurationService.html...
Generating /home/jenkins/.jenkins/jobs/oxTrust_4.2.1/workspace/server/target/site/apidocs/org/gluu/oxtrust/service/class-use/LogFileSizeChecker.html...
Generating /home/jenkins/.jenkins/jobs/oxTrust_4.2.1/workspace/server/target/site/apidocs/org/gluu/oxtrust/service/class-use/LdifArchiver.html...
Generating /home/jenkins/.jenkins/jobs/oxTrust_4.2.1/workspace/server/target/site/apidocs/org/gluu/oxtrust/service/class-use/ImageService.html...
Generating /home/jenkins/.jenkins/jobs/oxTrust_4.2.1/workspace/server/target/site/apidocs/org/gluu/oxtrust/service/class-use/IPairwiseIdService.html...
Generating /home/jenkins/.jenkins/jobs/oxTrust_4.2.1/workspace/server/target/site/apidocs/org/gluu/oxtrust/service/class-use/GluuVersionAvailability.html...
Generating /home/jenkins/.jenkins/jobs/oxTrust_4.2.1/workspace/server/target/site/apidocs/org/gluu/oxtrust/service/class-use/GluuComponent.html...
Generating /home/jenkins/.jenkins/jobs/oxTrust_4.2.1/workspace/server/target/site/apidocs/org/gluu/oxtrust/service/class-use/ExcelService.html...
Generating /home/jenkins/.jenkins/jobs/oxTrust_4.2.1/workspace/server/target/site/apidocs/org/gluu/oxtrust/service/class-use/EmailUniquenessService.html...
Generating /home/jenkins/.jenkins/jobs/oxTrust_4.2.1/workspace/server/target/site/apidocs/org/gluu/oxtrust/service/class-use/DownloadService.html...
Generating /home/jenkins/.jenkins/jobs/oxTrust_4.2.1/workspace/server/target/site/apidocs/org/gluu/oxtrust/service/class-use/AppInitializer.html...
Generating /home/jenkins/.jenkins/jobs/oxTrust_4.2.1/workspace/server/target/site/apidocs/org/gluu/oxtrust/service/class-use/EntityIDMonitoringService.html...
Generating /home/jenkins/.jenkins/jobs/oxTrust_4.2.1/workspace/server/target/site/apidocs/org/gluu/oxtrust/service/class-use/ViewHandlerService.html...
Generating /home/jenkins/.jenkins/jobs/oxTrust_4.2.1/workspace/server/target/site/apidocs/org/gluu/oxtrust/service/class-use/UpdateChecker.html...
Generating /home/jenkins/.jenkins/jobs/oxTrust_4.2.1/workspace/server/target/site/apidocs/org/gluu/oxtrust/service/class-use/StatusCheckerTimer.html...
Generating /home/jenkins/.jenkins/jobs/oxTrust_4.2.1/workspace/server/target/site/apidocs/org/gluu/oxtrust/service/class-use/ShibbolethInitializer.html...
Generating /home/jenkins/.jenkins/jobs/oxTrust_4.2.1/workspace/server/target/site/apidocs/org/gluu/oxtrust/service/class-use/SecurityService.html...
Generating /home/jenkins/.jenkins/jobs/oxTrust_4.2.1/workspace/server/target/site/apidocs/org/gluu/oxtrust/service/class-use/PropertyService.html...
Generating /home/jenkins/.jenkins/jobs/oxTrust_4.2.1/workspace/server/target/site/apidocs/org/gluu/oxtrust/service/class-use/PermissionService.html...
Generating /home/jenkins/.jenkins/jobs/oxTrust_4.2.1/workspace/server/target/site/apidocs/org/gluu/oxtrust/service/class-use/PasswordResetService.html...
Generating /home/jenkins/.jenkins/jobs/oxTrust_4.2.1/workspace/server/target/site/apidocs/org/gluu/oxtrust/service/class-use/PairwiseIdService.html...
Generating /home/jenkins/.jenkins/jobs/oxTrust_4.2.1/workspace/server/target/site/apidocs/org/gluu/oxtrust/service/class-use/OxTrustAuditService.html...
Generating /home/jenkins/.jenkins/jobs/oxTrust_4.2.1/workspace/server/target/site/apidocs/org/gluu/oxtrust/service/class-use/MemberService.html...
Generating /home/jenkins/.jenkins/jobs/oxTrust_4.2.1/workspace/server/target/site/apidocs/org/gluu/oxtrust/service/class-use/LdifService.html...
Generating /home/jenkins/.jenkins/jobs/oxTrust_4.2.1/workspace/server/target/site/apidocs/org/gluu/oxtrust/service/class-use/InumService.html...
Generating /home/jenkins/.jenkins/jobs/oxTrust_4.2.1/workspace/server/target/site/apidocs/org/gluu/oxtrust/service/class-use/ImapDataService.html...
Generating /home/jenkins/.jenkins/jobs/oxTrust_4.2.1/workspace/server/target/site/apidocs/org/gluu/oxtrust/service/class-use/ImageRepository.html...
Generating /home/jenkins/.jenkins/jobs/oxTrust_4.2.1/workspace/server/target/site/apidocs/org/gluu/oxtrust/service/class-use/CleanerTimer.html...
Generating /home/jenkins/.jenkins/jobs/oxTrust_4.2.1/workspace/server/target/site/apidocs/org/gluu/oxtrust/service/class-use/ResteasyInitializer.html...
Generating /home/jenkins/.jenkins/jobs/oxTrust_4.2.1/workspace/server/target/site/apidocs/org/gluu/oxtrust/service/class-use/PasswordGenerator.html...
Generating /home/jenkins/.jenkins/jobs/oxTrust_4.2.1/workspace/server/target/site/apidocs/org/gluu/oxtrust/service/class-use/CleanUpLogger.html...
Generating /home/jenkins/.jenkins/jobs/oxTrust_4.2.1/workspace/server/target/site/apidocs/org/gluu/oxtrust/service/class-use/AuthenticationSessionService.html...
Generating /home/jenkins/.jenkins/jobs/oxTrust_4.2.1/workspace/server/target/site/apidocs/org/gluu/oxtrust/service/external/class-use/ExternalUserRegistrationService.html...
Generating /home/jenkins/.jenkins/jobs/oxTrust_4.2.1/workspace/server/target/site/apidocs/org/gluu/oxtrust/service/external/class-use/ExternalUpdateUserService.html...
Generating /home/jenkins/.jenkins/jobs/oxTrust_4.2.1/workspace/server/target/site/apidocs/org/gluu/oxtrust/service/external/class-use/ExternalCacheRefreshService.html...
Generating /home/jenkins/.jenkins/jobs/oxTrust_4.2.1/workspace/server/target/site/apidocs/org/gluu/oxtrust/service/logger/class-use/LoggerService.html...
Generating /home/jenkins/.jenkins/jobs/oxTrust_4.2.1/workspace/server/target/site/apidocs/org/gluu/oxtrust/service/push/class-use/PushDeviceService.html...
Generating /home/jenkins/.jenkins/jobs/oxTrust_4.2.1/workspace/server/target/site/apidocs/org/gluu/oxtrust/service/push/class-use/PushApplicationService.html...
Generating /home/jenkins/.jenkins/jobs/oxTrust_4.2.1/workspace/server/target/site/apidocs/org/gluu/oxtrust/service/push/class-use/PushApplicationConfigurationService.html...
Generating /home/jenkins/.jenkins/jobs/oxTrust_4.2.1/workspace/server/target/site/apidocs/org/gluu/oxtrust/service/python/interfaces/class-use/RegistrationScript.html...
Generating /home/jenkins/.jenkins/jobs/oxTrust_4.2.1/workspace/server/target/site/apidocs/org/gluu/oxtrust/service/render/class-use/RenderService.html...
Generating /home/jenkins/.jenkins/jobs/oxTrust_4.2.1/workspace/server/target/site/apidocs/org/gluu/oxtrust/service/status/ldap/class-use/PersistanceStatusTimer.html...
Generating /home/jenkins/.jenkins/jobs/oxTrust_4.2.1/workspace/server/target/site/apidocs/org/gluu/oxtrust/service/secure/class-use/ApiPermissionService.html...
Generating /home/jenkins/.jenkins/jobs/oxTrust_4.2.1/workspace/server/target/site/apidocs/org/gluu/oxtrust/service/config/class-use/ConfigurationFactory.html...
Generating /home/jenkins/.jenkins/jobs/oxTrust_4.2.1/workspace/server/target/site/apidocs/org/gluu/oxtrust/servlet/class-use/OxAuthLogoServlet.html...
Generating /home/jenkins/.jenkins/jobs/oxTrust_4.2.1/workspace/server/target/site/apidocs/org/gluu/oxtrust/servlet/class-use/OxAuthFaviconServlet.html...
Generating /home/jenkins/.jenkins/jobs/oxTrust_4.2.1/workspace/server/target/site/apidocs/org/gluu/oxtrust/servlet/class-use/LogoImageServlet.html...
Generating /home/jenkins/.jenkins/jobs/oxTrust_4.2.1/workspace/server/target/site/apidocs/org/gluu/oxtrust/servlet/class-use/BusyIndicatorImageServlet.html...
Generating /home/jenkins/.jenkins/jobs/oxTrust_4.2.1/workspace/server/target/site/apidocs/org/gluu/oxtrust/servlet/class-use/IdpLogoServlet.html...
Generating /home/jenkins/.jenkins/jobs/oxTrust_4.2.1/workspace/server/target/site/apidocs/org/gluu/oxtrust/servlet/class-use/IdpFaviconServlet.html...
Generating /home/jenkins/.jenkins/jobs/oxTrust_4.2.1/workspace/server/target/site/apidocs/org/gluu/oxtrust/servlet/class-use/FaviconImageServlet.html...
Generating /home/jenkins/.jenkins/jobs/oxTrust_4.2.1/workspace/server/target/site/apidocs/org/gluu/oxtrust/util/class-use/MetadataUtil.html...
Generating /home/jenkins/.jenkins/jobs/oxTrust_4.2.1/workspace/server/target/site/apidocs/org/gluu/oxtrust/util/class-use/PasswordValidator.html...
Generating /home/jenkins/.jenkins/jobs/oxTrust_4.2.1/workspace/server/target/site/apidocs/org/gluu/oxtrust/util/class-use/UserDateTimeConverter.html...
Generating /home/jenkins/.jenkins/jobs/oxTrust_4.2.1/workspace/server/target/site/apidocs/org/gluu/oxtrust/util/class-use/UserDateConverter.html...
Generating /home/jenkins/.jenkins/jobs/oxTrust_4.2.1/workspace/server/target/site/apidocs/org/gluu/oxtrust/util/class-use/PropertyUtil.html...
Generating /home/jenkins/.jenkins/jobs/oxTrust_4.2.1/workspace/server/target/site/apidocs/org/gluu/oxtrust/util/class-use/PeopleUidConverter.html...
Generating /home/jenkins/.jenkins/jobs/oxTrust_4.2.1/workspace/server/target/site/apidocs/org/gluu/oxtrust/util/class-use/GluuAttributeValidator.html...
Generating /home/jenkins/.jenkins/jobs/oxTrust_4.2.1/workspace/server/target/site/apidocs/org/gluu/oxtrust/util/class-use/X509CertificateShortInfoView.html...
Generating /home/jenkins/.jenkins/jobs/oxTrust_4.2.1/workspace/server/target/site/apidocs/org/gluu/oxtrust/util/class-use/RecaptchaUtil.html...
Generating /home/jenkins/.jenkins/jobs/oxTrust_4.2.1/workspace/server/target/site/apidocs/org/gluu/oxtrust/util/class-use/OxTrustApiConstants.html...
Generating /home/jenkins/.jenkins/jobs/oxTrust_4.2.1/workspace/server/target/site/apidocs/org/gluu/oxtrust/util/class-use/NumberHelper.html...
Generating /home/jenkins/.jenkins/jobs/oxTrust_4.2.1/workspace/server/target/site/apidocs/org/gluu/oxtrust/util/class-use/MapperUtil.html...
Generating /home/jenkins/.jenkins/jobs/oxTrust_4.2.1/workspace/server/target/site/apidocs/org/gluu/oxtrust/util/class-use/KeystoreWrapper.html...
Generating /home/jenkins/.jenkins/jobs/oxTrust_4.2.1/workspace/server/target/site/apidocs/org/gluu/oxtrust/util/class-use/GluuSetupConfiguration.html...
Generating /home/jenkins/.jenkins/jobs/oxTrust_4.2.1/workspace/server/target/site/apidocs/org/gluu/oxtrust/util/class-use/EntityIDHandler.html...
Generating /home/jenkins/.jenkins/jobs/oxTrust_4.2.1/workspace/server/target/site/apidocs/org/gluu/oxtrust/util/class-use/ConnectionStatusDTO.html...
Generating /home/jenkins/.jenkins/jobs/oxTrust_4.2.1/workspace/server/target/site/apidocs/org/gluu/oxtrust/util/class-use/BuildVersionService.html...
Generating /home/jenkins/.jenkins/jobs/oxTrust_4.2.1/workspace/server/target/site/apidocs/org/gluu/oxtrust/util/jsf/class-use/MetadataFilterConverter.html...
Generating /home/jenkins/.jenkins/jobs/oxTrust_4.2.1/workspace/server/target/site/apidocs/org/gluu/oxtrust/util/jsf/class-use/FederationProposalConverter.html...
Generating /home/jenkins/.jenkins/jobs/oxTrust_4.2.1/workspace/server/target/site/apidocs/org/gluu/oxtrust/util/jsf/class-use/FederationConverter.html...
Generating /home/jenkins/.jenkins/jobs/oxTrust_4.2.1/workspace/server/target/site/apidocs/org/gluu/oxtrust/util/jsf/class-use/OxTrustAttributeValidator.html...
Generating /home/jenkins/.jenkins/jobs/oxTrust_4.2.1/workspace/server/target/site/apidocs/org/gluu/oxtrust/util/jsf/class-use/ProfileConfigurationConverter.html...
Generating /home/jenkins/.jenkins/jobs/oxTrust_4.2.1/workspace/server/target/site/apidocs/org/gluu/oxtrust/util/jsf/class-use/JsfFunctions.html...
Generating /home/jenkins/.jenkins/jobs/oxTrust_4.2.1/workspace/server/target/site/apidocs/org/gluu/oxtrust/util/jsf/class-use/GluuJsfLibrary.html...
Generating /home/jenkins/.jenkins/jobs/oxTrust_4.2.1/workspace/server/target/site/apidocs/org/gluu/oxtrust/util/jsf/class-use/FacesComponentUtility.html...
Generating /home/jenkins/.jenkins/jobs/oxTrust_4.2.1/workspace/server/target/site/apidocs/org/gluu/oxtrust/util/velocity/class-use/ClasspathPathResourceLoader.html...
Generating /home/jenkins/.jenkins/jobs/oxTrust_4.2.1/workspace/server/target/site/apidocs/org/gluu/oxtrust/ws/rs/passport/class-use/PassportRestWebService.html...
Generating /home/jenkins/.jenkins/jobs/oxTrust_4.2.1/workspace/server/target/site/apidocs/org/gluu/oxtrust/ws/rs/controller/class-use/HealthCheckController.html...
Generating /home/jenkins/.jenkins/jobs/oxTrust_4.2.1/workspace/server/target/site/apidocs/org/gluu/oxtrust/class-use/LanguageBean.html...
Generating /home/jenkins/.jenkins/jobs/oxTrust_4.2.1/workspace/server/target/site/apidocs/org/gluu/oxtrust/auth/uma/class-use/PassportUmaProtectionService.html...
Generating /home/jenkins/.jenkins/jobs/oxTrust_4.2.1/workspace/server/target/site/apidocs/org/gluu/oxtrust/package-use.html...
Generating /home/jenkins/.jenkins/jobs/oxTrust_4.2.1/workspace/server/target/site/apidocs/org/gluu/oxtrust/action/package-use.html...
Generating /home/jenkins/.jenkins/jobs/oxTrust_4.2.1/workspace/server/target/site/apidocs/org/gluu/oxtrust/action/push/package-use.html...
Generating /home/jenkins/.jenkins/jobs/oxTrust_4.2.1/workspace/server/target/site/apidocs/org/gluu/oxtrust/action/radius/package-use.html...
Generating /home/jenkins/.jenkins/jobs/oxTrust_4.2.1/workspace/server/target/site/apidocs/org/gluu/oxtrust/action/uma/package-use.html...
Generating /home/jenkins/.jenkins/jobs/oxTrust_4.2.1/workspace/server/target/site/apidocs/org/gluu/oxtrust/api/rest/package-use.html...
Generating /home/jenkins/.jenkins/jobs/oxTrust_4.2.1/workspace/server/target/site/apidocs/org/gluu/oxtrust/auth/uma/package-use.html...
Generating /home/jenkins/.jenkins/jobs/oxTrust_4.2.1/workspace/server/target/site/apidocs/org/gluu/oxtrust/exception/package-use.html...
Generating /home/jenkins/.jenkins/jobs/oxTrust_4.2.1/workspace/server/target/site/apidocs/org/gluu/oxtrust/i18n/package-use.html...
Generating /home/jenkins/.jenkins/jobs/oxTrust_4.2.1/workspace/server/target/site/apidocs/org/gluu/oxtrust/ldap/cache/model/package-use.html...
Generating /home/jenkins/.jenkins/jobs/oxTrust_4.2.1/workspace/server/target/site/apidocs/org/gluu/oxtrust/ldap/cache/service/package-use.html...
Generating /home/jenkins/.jenkins/jobs/oxTrust_4.2.1/workspace/server/target/site/apidocs/org/gluu/oxtrust/ldap/load/conf/package-use.html...
Generating /home/jenkins/.jenkins/jobs/oxTrust_4.2.1/workspace/server/target/site/apidocs/org/gluu/oxtrust/model/package-use.html...
Generating /home/jenkins/.jenkins/jobs/oxTrust_4.2.1/workspace/server/target/site/apidocs/org/gluu/oxtrust/model/status/package-use.html...
Generating /home/jenkins/.jenkins/jobs/oxTrust_4.2.1/workspace/server/target/site/apidocs/org/gluu/oxtrust/service/package-use.html...
Generating /home/jenkins/.jenkins/jobs/oxTrust_4.2.1/workspace/server/target/site/apidocs/org/gluu/oxtrust/service/config/package-use.html...
Generating /home/jenkins/.jenkins/jobs/oxTrust_4.2.1/workspace/server/target/site/apidocs/org/gluu/oxtrust/service/external/package-use.html...
Generating /home/jenkins/.jenkins/jobs/oxTrust_4.2.1/workspace/server/target/site/apidocs/org/gluu/oxtrust/service/logger/package-use.html...
Generating /home/jenkins/.jenkins/jobs/oxTrust_4.2.1/workspace/server/target/site/apidocs/org/gluu/oxtrust/service/push/package-use.html...
Generating /home/jenkins/.jenkins/jobs/oxTrust_4.2.1/workspace/server/target/site/apidocs/org/gluu/oxtrust/service/python/interfaces/package-use.html...
Generating /home/jenkins/.jenkins/jobs/oxTrust_4.2.1/workspace/server/target/site/apidocs/org/gluu/oxtrust/service/render/package-use.html...
Generating /home/jenkins/.jenkins/jobs/oxTrust_4.2.1/workspace/server/target/site/apidocs/org/gluu/oxtrust/service/secure/package-use.html...
Generating /home/jenkins/.jenkins/jobs/oxTrust_4.2.1/workspace/server/target/site/apidocs/org/gluu/oxtrust/service/status/ldap/package-use.html...
Generating /home/jenkins/.jenkins/jobs/oxTrust_4.2.1/workspace/server/target/site/apidocs/org/gluu/oxtrust/servlet/package-use.html...
Generating /home/jenkins/.jenkins/jobs/oxTrust_4.2.1/workspace/server/target/site/apidocs/org/gluu/oxtrust/util/package-use.html...
Generating /home/jenkins/.jenkins/jobs/oxTrust_4.2.1/workspace/server/target/site/apidocs/org/gluu/oxtrust/util/jsf/package-use.html...
Generating /home/jenkins/.jenkins/jobs/oxTrust_4.2.1/workspace/server/target/site/apidocs/org/gluu/oxtrust/util/velocity/package-use.html...
Generating /home/jenkins/.jenkins/jobs/oxTrust_4.2.1/workspace/server/target/site/apidocs/org/gluu/oxtrust/ws/rs/controller/package-use.html...
Generating /home/jenkins/.jenkins/jobs/oxTrust_4.2.1/workspace/server/target/site/apidocs/org/gluu/oxtrust/ws/rs/passport/package-use.html...
Building index for all the packages and classes...
Generating /home/jenkins/.jenkins/jobs/oxTrust_4.2.1/workspace/server/target/site/apidocs/overview-tree.html...
Generating /home/jenkins/.jenkins/jobs/oxTrust_4.2.1/workspace/server/target/site/apidocs/index-all.html...
Generating /home/jenkins/.jenkins/jobs/oxTrust_4.2.1/workspace/server/target/site/apidocs/deprecated-list.html...
Building index for all classes...
Generating /home/jenkins/.jenkins/jobs/oxTrust_4.2.1/workspace/server/target/site/apidocs/allclasses-frame.html...
Generating /home/jenkins/.jenkins/jobs/oxTrust_4.2.1/workspace/server/target/site/apidocs/allclasses-noframe.html...
Generating /home/jenkins/.jenkins/jobs/oxTrust_4.2.1/workspace/server/target/site/apidocs/index.html...
Generating /home/jenkins/.jenkins/jobs/oxTrust_4.2.1/workspace/server/target/site/apidocs/overview-summary.html...
Generating /home/jenkins/.jenkins/jobs/oxTrust_4.2.1/workspace/server/target/site/apidocs/help-doc.html...
24 errors
91 warnings
[ERROR] Error while creating javadoc report: 
Exit code: 1 - javadoc: warning - Multiple sources of package comments found for package "javax.interceptor"
/home/jenkins/.jenkins/jobs/oxTrust_4.2.1/workspace/server/src/main/java/org/gluu/oxtrust/action/Authenticator.java:197: warning: no description for @throws
	 * @throws IOException
	   ^
/home/jenkins/.jenkins/jobs/oxTrust_4.2.1/workspace/server/src/main/java/org/gluu/oxtrust/action/Authenticator.java:199: warning: no description for @throws
	 * @throws Exception
	   ^
/home/jenkins/.jenkins/jobs/oxTrust_4.2.1/workspace/server/src/main/java/org/gluu/oxtrust/action/Authenticator.java:201: warning: no @return
	public boolean oAuthLogin() throws IOException, Exception {
	               ^
/home/jenkins/.jenkins/jobs/oxTrust_4.2.1/workspace/server/src/main/java/org/gluu/oxtrust/action/Authenticator.java:234: warning: no description for @return
	 * @return
	   ^
/home/jenkins/.jenkins/jobs/oxTrust_4.2.1/workspace/server/src/main/java/org/gluu/oxtrust/action/Authenticator.java:235: warning: no description for @throws
	 * @throws JSONException
	   ^
/home/jenkins/.jenkins/jobs/oxTrust_4.2.1/workspace/server/src/main/java/org/gluu/oxtrust/action/CustomAttributeAction.java:317: warning: no description for @param
	 * @param attribute
	   ^
/home/jenkins/.jenkins/jobs/oxTrust_4.2.1/workspace/server/src/main/java/org/gluu/oxtrust/action/ManageCertificateAction.java:148: warning: no @param for fileName
	public void getCert(String fileName) {
	            ^
/home/jenkins/.jenkins/jobs/oxTrust_4.2.1/workspace/server/src/main/java/org/gluu/oxtrust/action/ManageCertificateAction.java:157: warning: no @param for trustStoreCertificate
	public void getCert(TrustStoreCertificate trustStoreCertificate) {
	            ^
/home/jenkins/.jenkins/jobs/oxTrust_4.2.1/workspace/server/src/main/java/org/gluu/oxtrust/action/RegisterPersonAction.java:151: error: exception not thrown: java.lang.Exception
	 * @throws Exception
	           ^
/home/jenkins/.jenkins/jobs/oxTrust_4.2.1/workspace/server/src/main/java/org/gluu/oxtrust/action/RegisterPersonAction.java:151: warning: no description for @throws
	 * @throws Exception
	   ^
/home/jenkins/.jenkins/jobs/oxTrust_4.2.1/workspace/server/src/main/java/org/gluu/oxtrust/action/RegisterPersonAction.java:429: error: exception not thrown: java.lang.Exception
	 * @throws Exception
	           ^
/home/jenkins/.jenkins/jobs/oxTrust_4.2.1/workspace/server/src/main/java/org/gluu/oxtrust/action/RegisterPersonAction.java:429: warning: no description for @throws
	 * @throws Exception
	   ^
/home/jenkins/.jenkins/jobs/oxTrust_4.2.1/workspace/server/src/main/java/org/gluu/oxtrust/action/UpdatePersonAction.java:266: error: exception not thrown: java.lang.Exception
	 * @throws Exception
	           ^
/home/jenkins/.jenkins/jobs/oxTrust_4.2.1/workspace/server/src/main/java/org/gluu/oxtrust/action/UpdatePersonAction.java:266: warning: no description for @throws
	 * @throws Exception
	   ^
/home/jenkins/.jenkins/jobs/oxTrust_4.2.1/workspace/server/src/main/java/org/gluu/oxtrust/action/UpdatePersonAction.java:288: error: exception not thrown: java.lang.Exception
	 * @throws Exception
	           ^
/home/jenkins/.jenkins/jobs/oxTrust_4.2.1/workspace/server/src/main/java/org/gluu/oxtrust/action/UpdatePersonAction.java:288: warning: no description for @throws
	 * @throws Exception
	   ^
/home/jenkins/.jenkins/jobs/oxTrust_4.2.1/workspace/server/src/main/java/org/gluu/oxtrust/action/UpdatePersonAction.java:519: warning: no @throws for java.lang.Exception
	public String save() throws Exception {
	              ^
/home/jenkins/.jenkins/jobs/oxTrust_4.2.1/workspace/server/src/main/java/org/gluu/oxtrust/action/UpdatePersonAction.java:656: warning: no description for @param
	 * @param gluuCustomPerson
	   ^
/home/jenkins/.jenkins/jobs/oxTrust_4.2.1/workspace/server/src/main/java/org/gluu/oxtrust/action/UpdatePersonAction.java:657: warning: no description for @param
	 * @param isScim2
	   ^
/home/jenkins/.jenkins/jobs/oxTrust_4.2.1/workspace/server/src/main/java/org/gluu/oxtrust/action/UpdatePersonAction.java:658: warning: no description for @return
	 * @return
	   ^
/home/jenkins/.jenkins/jobs/oxTrust_4.2.1/workspace/server/src/main/java/org/gluu/oxtrust/action/UpdatePersonAction.java:659: warning: no description for @throws
	 * @throws Exception
	   ^
/home/jenkins/.jenkins/jobs/oxTrust_4.2.1/workspace/server/src/main/java/org/gluu/oxtrust/action/UpdatePersonAction.java:748: error: exception not thrown: java.lang.Exception
	 * @throws Exception
	           ^
/home/jenkins/.jenkins/jobs/oxTrust_4.2.1/workspace/server/src/main/java/org/gluu/oxtrust/action/UpdatePersonAction.java:748: warning: no description for @throws
	 * @throws Exception
	   ^
/home/jenkins/.jenkins/jobs/oxTrust_4.2.1/workspace/server/src/main/java/org/gluu/oxtrust/action/UpdatePersonAction.java:838: warning: no description for @param
	 * @param inum
	   ^
/home/jenkins/.jenkins/jobs/oxTrust_4.2.1/workspace/server/src/main/java/org/gluu/oxtrust/action/UpdatePersonAction.java:856: warning: no description for @return
	 * @return
	   ^
/home/jenkins/.jenkins/jobs/oxTrust_4.2.1/workspace/server/src/main/java/org/gluu/oxtrust/service/AppInitializer.java:176: warning: no @param for init
	public void applicationInitialized(@Observes @Initialized(ApplicationScoped.class) Object init) {
	            ^
/home/jenkins/.jenkins/jobs/oxTrust_4.2.1/workspace/server/src/main/java/org/gluu/oxtrust/service/ImageRepository.java:88: warning: no description for @throws
	 * @throws Exception
	   ^
/home/jenkins/.jenkins/jobs/oxTrust_4.2.1/workspace/server/src/main/java/org/gluu/oxtrust/service/ImageRepository.java:91: warning: no @param for thumbWidth
	public boolean addThumbnail(GluuImage image, int thumbWidth, int thumbHeight) throws Exception {
	               ^
/home/jenkins/.jenkins/jobs/oxTrust_4.2.1/workspace/server/src/main/java/org/gluu/oxtrust/service/ImageRepository.java:91: warning: no @param for thumbHeight
	public boolean addThumbnail(GluuImage image, int thumbWidth, int thumbHeight) throws Exception {
	               ^
/home/jenkins/.jenkins/jobs/oxTrust_4.2.1/workspace/server/src/main/java/org/gluu/oxtrust/service/InumService.java:231: warning: no @param for inumEntryManager
	public boolean addInumByObject(EntityManager inumEntryManager, InumSqlEntry inumEntry) {
	               ^
/home/jenkins/.jenkins/jobs/oxTrust_4.2.1/workspace/server/src/main/java/org/gluu/oxtrust/service/InumService.java:231: warning: no @param for inumEntry
	public boolean addInumByObject(EntityManager inumEntryManager, InumSqlEntry inumEntry) {
	               ^
/home/jenkins/.jenkins/jobs/oxTrust_4.2.1/workspace/server/src/main/java/org/gluu/oxtrust/service/InumService.java:262: warning: no @param for inumEntryManager
	public boolean containsInum(EntityManager inumEntryManager, String inum) {
	               ^
/home/jenkins/.jenkins/jobs/oxTrust_4.2.1/workspace/server/src/main/java/org/gluu/oxtrust/service/InumService.java:262: warning: no @param for inum
	public boolean containsInum(EntityManager inumEntryManager, String inum) {
	               ^
/home/jenkins/.jenkins/jobs/oxTrust_4.2.1/workspace/server/src/main/java/org/gluu/oxtrust/service/InumService.java:272: warning: no @param for inumEntryManager
	public InumSqlEntry findInum(EntityManager inumEntryManager, String inum) {
	                    ^
/home/jenkins/.jenkins/jobs/oxTrust_4.2.1/workspace/server/src/main/java/org/gluu/oxtrust/service/InumService.java:272: warning: no @param for inum
	public InumSqlEntry findInum(EntityManager inumEntryManager, String inum) {
	                    ^
/home/jenkins/.jenkins/jobs/oxTrust_4.2.1/workspace/server/src/main/java/org/gluu/oxtrust/service/InumService.java:311: warning: no @param for inumEntryManager
	public InumSqlEntry findInum(EntityManager inumEntryManager, String inum, String type) {
	                    ^
/home/jenkins/.jenkins/jobs/oxTrust_4.2.1/workspace/server/src/main/java/org/gluu/oxtrust/service/InumService.java:311: warning: no @param for inum
	public InumSqlEntry findInum(EntityManager inumEntryManager, String inum, String type) {
	                    ^
/home/jenkins/.jenkins/jobs/oxTrust_4.2.1/workspace/server/src/main/java/org/gluu/oxtrust/service/InumService.java:311: warning: no @param for type
	public InumSqlEntry findInum(EntityManager inumEntryManager, String inum, String type) {
	                    ^
/home/jenkins/.jenkins/jobs/oxTrust_4.2.1/workspace/server/src/main/java/org/gluu/oxtrust/service/InumService.java:328: warning: no @param for inumEntryManager
	public List<InumSqlEntry> findInums(EntityManager inumEntryManager, String type) {
	                          ^
/home/jenkins/.jenkins/jobs/oxTrust_4.2.1/workspace/server/src/main/java/org/gluu/oxtrust/service/InumService.java:328: warning: no @param for type
	public List<InumSqlEntry> findInums(EntityManager inumEntryManager, String type) {
	                          ^
/home/jenkins/.jenkins/jobs/oxTrust_4.2.1/workspace/server/src/main/java/org/gluu/oxtrust/service/InumService.java:345: warning: no @param for inumEntryManager
	public boolean removeInum(EntityManager inumEntryManager, String inum) {
	               ^
/home/jenkins/.jenkins/jobs/oxTrust_4.2.1/workspace/server/src/main/java/org/gluu/oxtrust/service/InumService.java:345: warning: no @param for inum
	public boolean removeInum(EntityManager inumEntryManager, String inum) {
	               ^
/home/jenkins/.jenkins/jobs/oxTrust_4.2.1/workspace/server/src/main/java/org/gluu/oxtrust/service/InumService.java:389: warning: no @param for inumEntryManager
	public InumSqlEntry findInumByObject(EntityManager inumEntryManager, String inum) {
	                    ^
/home/jenkins/.jenkins/jobs/oxTrust_4.2.1/workspace/server/src/main/java/org/gluu/oxtrust/service/InumService.java:389: warning: no @param for inum
	public InumSqlEntry findInumByObject(EntityManager inumEntryManager, String inum) {
	                    ^
/home/jenkins/.jenkins/jobs/oxTrust_4.2.1/workspace/server/src/main/java/org/gluu/oxtrust/service/InumService.java:427: warning: no @param for inumEntryManager
	public boolean addInum(EntityManager inumEntryManager, String inum, String type) {
	               ^
/home/jenkins/.jenkins/jobs/oxTrust_4.2.1/workspace/server/src/main/java/org/gluu/oxtrust/service/InumService.java:427: warning: no @param for inum
	public boolean addInum(EntityManager inumEntryManager, String inum, String type) {
	               ^
/home/jenkins/.jenkins/jobs/oxTrust_4.2.1/workspace/server/src/main/java/org/gluu/oxtrust/service/InumService.java:427: warning: no @param for type
	public boolean addInum(EntityManager inumEntryManager, String inum, String type) {
	               ^
/home/jenkins/.jenkins/jobs/oxTrust_4.2.1/workspace/server/src/main/java/org/gluu/oxtrust/service/PasswordResetService.java:76: error: @param name not found
	 * @param DN
	          ^
/home/jenkins/.jenkins/jobs/oxTrust_4.2.1/workspace/server/src/main/java/org/gluu/oxtrust/service/PasswordResetService.java:80: warning: no @param for guid
	public PasswordResetRequest findPasswordResetRequest(String guid) {
	                            ^
/home/jenkins/.jenkins/jobs/oxTrust_4.2.1/workspace/server/src/main/java/org/gluu/oxtrust/service/PasswordResetService.java:90: error: @param name not found
	 * @param PasswordResetRequest
	          ^
/home/jenkins/.jenkins/jobs/oxTrust_4.2.1/workspace/server/src/main/java/org/gluu/oxtrust/service/PasswordResetService.java:93: warning: no @param for passwordResetRequest
	public void addPasswordResetRequest(PasswordResetRequest passwordResetRequest) {
	            ^
/home/jenkins/.jenkins/jobs/oxTrust_4.2.1/workspace/server/src/main/java/org/gluu/oxtrust/service/PasswordResetService.java:100: error: @param name not found
	 * @param PasswordResetRequest
	          ^
/home/jenkins/.jenkins/jobs/oxTrust_4.2.1/workspace/server/src/main/java/org/gluu/oxtrust/service/PasswordResetService.java:103: warning: no @param for passwordResetRequest
	public void updatePasswordResetRequest(PasswordResetRequest passwordResetRequest) {
	            ^
/home/jenkins/.jenkins/jobs/oxTrust_4.2.1/workspace/server/src/main/java/org/gluu/oxtrust/service/PasswordResetService.java:110: error: @param name not found
	 * @param PasswordResetRequest
	          ^
/home/jenkins/.jenkins/jobs/oxTrust_4.2.1/workspace/server/src/main/java/org/gluu/oxtrust/service/PasswordResetService.java:113: warning: no @param for passwordResetRequest
	public void removePasswordResetRequest(PasswordResetRequest passwordResetRequest) {
	            ^
/home/jenkins/.jenkins/jobs/oxTrust_4.2.1/workspace/server/src/main/java/org/gluu/oxtrust/service/PasswordResetService.java:122: warning: no @param for dn
	public boolean containsPasswordResetRequest(String dn) {
	               ^
/home/jenkins/.jenkins/jobs/oxTrust_4.2.1/workspace/server/src/main/java/org/gluu/oxtrust/service/PasswordResetService.java:129: error: @param name not found
	 * @param PasswordResetRequest
	          ^
/home/jenkins/.jenkins/jobs/oxTrust_4.2.1/workspace/server/src/main/java/org/gluu/oxtrust/service/PasswordResetService.java:133: warning: no @param for passwordResetRequest
	public List<PasswordResetRequest> findPasswordResetRequests(PasswordResetRequest passwordResetRequest) {
	                                  ^
/home/jenkins/.jenkins/jobs/oxTrust_4.2.1/workspace/server/src/main/java/org/gluu/oxtrust/service/PasswordResetService.java:142: warning: no @param for ldapReturnAttributes
	public List<PasswordResetRequest> getAllPasswordResetRequests(String... ldapReturnAttributes) {
	                                  ^
/home/jenkins/.jenkins/jobs/oxTrust_4.2.1/workspace/server/src/main/java/org/gluu/oxtrust/service/PasswordResetService.java:150: error: @param name not found
	 * @param pattern
	          ^
/home/jenkins/.jenkins/jobs/oxTrust_4.2.1/workspace/server/src/main/java/org/gluu/oxtrust/service/PasswordResetService.java:152: error: @param name not found
	 * @param sizeLimit
	          ^
/home/jenkins/.jenkins/jobs/oxTrust_4.2.1/workspace/server/src/main/java/org/gluu/oxtrust/service/PasswordResetService.java:156: warning: no @param for personInum
	public PasswordResetRequest findActualPasswordResetRequest(String personInum) {
	                            ^
/home/jenkins/.jenkins/jobs/oxTrust_4.2.1/workspace/server/src/main/java/org/gluu/oxtrust/service/PasswordResetService.java:234: warning: no @param for guid
	public String getDnForPasswordResetRequest(String guid) {
	              ^
/home/jenkins/.jenkins/jobs/oxTrust_4.2.1/workspace/server/src/main/java/org/gluu/oxtrust/service/PasswordResetService.java:234: warning: no @return
	public String getDnForPasswordResetRequest(String guid) {
	              ^
/home/jenkins/.jenkins/jobs/oxTrust_4.2.1/workspace/server/src/main/java/org/gluu/oxtrust/service/PropertyService.java:35: warning: no description for @throws
	 * @throws NoSuchMethodException 
	   ^
/home/jenkins/.jenkins/jobs/oxTrust_4.2.1/workspace/server/src/main/java/org/gluu/oxtrust/service/PropertyService.java:36: warning: no description for @throws
	 * @throws InvocationTargetException 
	   ^
/home/jenkins/.jenkins/jobs/oxTrust_4.2.1/workspace/server/src/main/java/org/gluu/oxtrust/service/PropertyService.java:37: warning: no description for @throws
	 * @throws IllegalAccessException 
	   ^
/home/jenkins/.jenkins/jobs/oxTrust_4.2.1/workspace/server/src/main/java/org/gluu/oxtrust/service/SecurityService.java:51: error: exception not thrown: java.lang.Exception
	 * @throws Exception
	           ^
/home/jenkins/.jenkins/jobs/oxTrust_4.2.1/workspace/server/src/main/java/org/gluu/oxtrust/service/push/PushApplicationService.java:69: error: @param name not found
	 * @param DN oxPush Application DN
	          ^
/home/jenkins/.jenkins/jobs/oxTrust_4.2.1/workspace/server/src/main/java/org/gluu/oxtrust/service/push/PushApplicationService.java:72: warning: no @param for dn
	public PushApplication getPushApplicationByDn(String dn) {
	                       ^
/home/jenkins/.jenkins/jobs/oxTrust_4.2.1/workspace/server/src/main/java/org/gluu/oxtrust/service/push/PushApplicationService.java:79: error: @param name not found
	 * @param PushApplication oxPush Application
	          ^
/home/jenkins/.jenkins/jobs/oxTrust_4.2.1/workspace/server/src/main/java/org/gluu/oxtrust/service/push/PushApplicationService.java:81: warning: no @param for pushApplication
	public void addPushApplication(PushApplication pushApplication) {
	            ^
/home/jenkins/.jenkins/jobs/oxTrust_4.2.1/workspace/server/src/main/java/org/gluu/oxtrust/service/push/PushApplicationService.java:88: error: @param name not found
	 * @param PushApplication oxPush Application
	          ^
/home/jenkins/.jenkins/jobs/oxTrust_4.2.1/workspace/server/src/main/java/org/gluu/oxtrust/service/push/PushApplicationService.java:90: warning: no @param for pushApplication
	public void updatePushApplication(PushApplication pushApplication) {
	            ^
/home/jenkins/.jenkins/jobs/oxTrust_4.2.1/workspace/server/src/main/java/org/gluu/oxtrust/service/push/PushApplicationService.java:97: error: @param name not found
	 * @param PushApplication oxPush Application
	          ^
/home/jenkins/.jenkins/jobs/oxTrust_4.2.1/workspace/server/src/main/java/org/gluu/oxtrust/service/push/PushApplicationService.java:99: warning: no @param for pushApplication
	public void removePushApplication(PushApplication pushApplication) {
	            ^
/home/jenkins/.jenkins/jobs/oxTrust_4.2.1/workspace/server/src/main/java/org/gluu/oxtrust/service/push/PushApplicationService.java:108: warning: no @param for dn
	public boolean containsPushApplication(String dn) {
	               ^
/home/jenkins/.jenkins/jobs/oxTrust_4.2.1/workspace/server/src/main/java/org/gluu/oxtrust/service/push/PushApplicationService.java:115: error: @param name not found
	 * @param PushApplication pushApplication
	          ^
/home/jenkins/.jenkins/jobs/oxTrust_4.2.1/workspace/server/src/main/java/org/gluu/oxtrust/service/push/PushApplicationService.java:118: warning: no @param for pushApplication
	public List<PushApplication> findPushApplications(PushApplication pushApplication) {
	                             ^
/home/jenkins/.jenkins/jobs/oxTrust_4.2.1/workspace/server/src/main/java/org/gluu/oxtrust/service/push/PushApplicationService.java:127: warning: no @param for ldapReturnAttributes
	public List<PushApplication> getAllPushApplications(String... ldapReturnAttributes) {
	                             ^
/home/jenkins/.jenkins/jobs/oxTrust_4.2.1/workspace/server/src/main/java/org/gluu/oxtrust/service/push/PushApplicationService.java:178: warning: no @param for inum
	public String getDnForPushApplication(String inum) {
	              ^
/home/jenkins/.jenkins/jobs/oxTrust_4.2.1/workspace/server/src/main/java/org/gluu/oxtrust/service/push/PushApplicationService.java:178: warning: no @return
	public String getDnForPushApplication(String inum) {
	              ^
/home/jenkins/.jenkins/jobs/oxTrust_4.2.1/workspace/server/src/main/java/org/gluu/oxtrust/service/push/PushDeviceService.java:68: error: @param name not found
	 * @param DN oxPush Device DN
	          ^
/home/jenkins/.jenkins/jobs/oxTrust_4.2.1/workspace/server/src/main/java/org/gluu/oxtrust/service/push/PushDeviceService.java:71: warning: no @param for dn
	public PushDevice getPushDeviceByDn(String dn) {
	                  ^
/home/jenkins/.jenkins/jobs/oxTrust_4.2.1/workspace/server/src/main/java/org/gluu/oxtrust/service/push/PushDeviceService.java:78: error: @param name not found
	 * @param PushDevice oxPush Device
	          ^
/home/jenkins/.jenkins/jobs/oxTrust_4.2.1/workspace/server/src/main/java/org/gluu/oxtrust/service/push/PushDeviceService.java:80: warning: no @param for pushDevice
	public void addPushDevice(PushDevice pushDevice) {
	            ^
/home/jenkins/.jenkins/jobs/oxTrust_4.2.1/workspace/server/src/main/java/org/gluu/oxtrust/service/push/PushDeviceService.java:87: error: @param name not found
	 * @param PushDevice oxPush Device
	          ^
/home/jenkins/.jenkins/jobs/oxTrust_4.2.1/workspace/server/src/main/java/org/gluu/oxtrust/service/push/PushDeviceService.java:89: warning: no @param for pushDevice
	public void updatePushDevice(PushDevice pushDevice) {
	            ^
/home/jenkins/.jenkins/jobs/oxTrust_4.2.1/workspace/server/src/main/java/org/gluu/oxtrust/service/push/PushDeviceService.java:96: error: @param name not found
	 * @param PushDevice oxPush Device
	          ^
/home/jenkins/.jenkins/jobs/oxTrust_4.2.1/workspace/server/src/main/java/org/gluu/oxtrust/service/push/PushDeviceService.java:98: warning: no @param for pushDevice
	public void removePushDevice(PushDevice pushDevice) {
	            ^
/home/jenkins/.jenkins/jobs/oxTrust_4.2.1/workspace/server/src/main/java/org/gluu/oxtrust/service/push/PushDeviceService.java:107: warning: no @param for dn
	public boolean containsPushDevice(String dn) {
	               ^
/home/jenkins/.jenkins/jobs/oxTrust_4.2.1/workspace/server/src/main/java/org/gluu/oxtrust/service/push/PushDeviceService.java:114: error: @param name not found
	 * @param PushDevice pushDevice
	          ^
/home/jenkins/.jenkins/jobs/oxTrust_4.2.1/workspace/server/src/main/java/org/gluu/oxtrust/service/push/PushDeviceService.java:117: warning: no @param for pushDevice
	public List<PushDevice> findPushDevices(PushDevice pushDevice) {
	                        ^
/home/jenkins/.jenkins/jobs/oxTrust_4.2.1/workspace/server/src/main/java/org/gluu/oxtrust/service/push/PushDeviceService.java:126: warning: no @param for ldapReturnAttributes
	public List<PushDevice> getAllPushDevices(String... ldapReturnAttributes) {
	                        ^
/home/jenkins/.jenkins/jobs/oxTrust_4.2.1/workspace/server/src/main/java/org/gluu/oxtrust/service/push/PushDeviceService.java:177: warning: no @param for inum
	public String getDnForPushDevice(String inum) {
	              ^
/home/jenkins/.jenkins/jobs/oxTrust_4.2.1/workspace/server/src/main/java/org/gluu/oxtrust/service/push/PushDeviceService.java:177: warning: no @return
	public String getDnForPushDevice(String inum) {
	              ^
/home/jenkins/.jenkins/jobs/oxTrust_4.2.1/workspace/server/src/main/java/org/gluu/oxtrust/util/KeystoreWrapper.java:113: warning: no description for @param
     * @param key 
       ^
/home/jenkins/.jenkins/jobs/oxTrust_4.2.1/workspace/server/src/main/java/org/gluu/oxtrust/util/KeystoreWrapper.java:114: warning: no description for @param
     * @param alias
       ^
/home/jenkins/.jenkins/jobs/oxTrust_4.2.1/workspace/server/src/main/java/org/gluu/oxtrust/util/KeystoreWrapper.java:115: warning: no description for @param
     * @param password
       ^
/home/jenkins/.jenkins/jobs/oxTrust_4.2.1/workspace/server/src/main/java/org/gluu/oxtrust/util/KeystoreWrapper.java:116: warning: no description for @throws
     * @throws KeyStoreException 
       ^
/home/jenkins/.jenkins/jobs/oxTrust_4.2.1/workspace/server/src/main/java/org/gluu/oxtrust/util/KeystoreWrapper.java:45: warning: no description for @param
     * @param filepath
       ^
/home/jenkins/.jenkins/jobs/oxTrust_4.2.1/workspace/server/src/main/java/org/gluu/oxtrust/util/KeystoreWrapper.java:46: warning: no description for @param
     * @param password
       ^
/home/jenkins/.jenkins/jobs/oxTrust_4.2.1/workspace/server/src/main/java/org/gluu/oxtrust/util/KeystoreWrapper.java:47: warning: no description for @param
     * @param type
       ^
/home/jenkins/.jenkins/jobs/oxTrust_4.2.1/workspace/server/src/main/java/org/gluu/oxtrust/util/KeystoreWrapper.java:48: warning: no description for @throws
     * @throws KeyStoreException
       ^
/home/jenkins/.jenkins/jobs/oxTrust_4.2.1/workspace/server/src/main/java/org/gluu/oxtrust/util/KeystoreWrapper.java:49: warning: no description for @throws
     * @throws IOException
       ^
/home/jenkins/.jenkins/jobs/oxTrust_4.2.1/workspace/server/src/main/java/org/gluu/oxtrust/util/KeystoreWrapper.java:50: warning: no description for @throws
     * @throws NoSuchAlgorithmException
       ^
/home/jenkins/.jenkins/jobs/oxTrust_4.2.1/workspace/server/src/main/java/org/gluu/oxtrust/util/KeystoreWrapper.java:51: warning: no description for @throws
     * @throws CertificateException 
       ^
/home/jenkins/.jenkins/jobs/oxTrust_4.2.1/workspace/server/src/main/java/org/gluu/oxtrust/util/MapperUtil.java:21: warning: no description for @param
	 * @param source
	   ^
/home/jenkins/.jenkins/jobs/oxTrust_4.2.1/workspace/server/src/main/java/org/gluu/oxtrust/util/MapperUtil.java:22: warning: no description for @param
	 * @param destination
	   ^
/home/jenkins/.jenkins/jobs/oxTrust_4.2.1/workspace/server/src/main/java/org/gluu/oxtrust/util/MapperUtil.java:23: warning: no description for @return
	 * @return
	   ^
/home/jenkins/.jenkins/jobs/oxTrust_4.2.1/workspace/server/src/main/java/org/gluu/oxtrust/util/MapperUtil.java:47: warning: no description for @param
	 * @param source
	   ^
/home/jenkins/.jenkins/jobs/oxTrust_4.2.1/workspace/server/src/main/java/org/gluu/oxtrust/util/MapperUtil.java:48: warning: no description for @param
	 * @param destination
	   ^
/home/jenkins/.jenkins/jobs/oxTrust_4.2.1/workspace/server/src/main/java/org/gluu/oxtrust/util/MapperUtil.java:49: warning: no description for @return
	 * @return
	   ^
/home/jenkins/.jenkins/jobs/oxTrust_4.2.1/workspace/server/src/main/java/org/gluu/oxtrust/util/velocity/ClasspathPathResourceLoader.java:49: error: @param name not found
	 * @param name     name of template to get
	          ^

Command line was: /usr/lib/jvm/java-1.8.0-openjdk-1.8.0.222.b10-0.el7_6.x86_64/jre/../bin/javadoc @options @packages

Refer to the generated Javadoc files in '/home/jenkins/.jenkins/jobs/oxTrust_4.2.1/workspace/server/target/site/apidocs' dir.

org.apache.maven.reporting.MavenReportException: 
Exit code: 1 - javadoc: warning - Multiple sources of package comments found for package "javax.interceptor"
/home/jenkins/.jenkins/jobs/oxTrust_4.2.1/workspace/server/src/main/java/org/gluu/oxtrust/action/Authenticator.java:197: warning: no description for @throws
	 * @throws IOException
	   ^
/home/jenkins/.jenkins/jobs/oxTrust_4.2.1/workspace/server/src/main/java/org/gluu/oxtrust/action/Authenticator.java:199: warning: no description for @throws
	 * @throws Exception
	   ^
/home/jenkins/.jenkins/jobs/oxTrust_4.2.1/workspace/server/src/main/java/org/gluu/oxtrust/action/Authenticator.java:201: warning: no @return
	public boolean oAuthLogin() throws IOException, Exception {
	               ^
/home/jenkins/.jenkins/jobs/oxTrust_4.2.1/workspace/server/src/main/java/org/gluu/oxtrust/action/Authenticator.java:234: warning: no description for @return
	 * @return
	   ^
/home/jenkins/.jenkins/jobs/oxTrust_4.2.1/workspace/server/src/main/java/org/gluu/oxtrust/action/Authenticator.java:235: warning: no description for @throws
	 * @throws JSONException
	   ^
/home/jenkins/.jenkins/jobs/oxTrust_4.2.1/workspace/server/src/main/java/org/gluu/oxtrust/action/CustomAttributeAction.java:317: warning: no description for @param
	 * @param attribute
	   ^
/home/jenkins/.jenkins/jobs/oxTrust_4.2.1/workspace/server/src/main/java/org/gluu/oxtrust/action/ManageCertificateAction.java:148: warning: no @param for fileName
	public void getCert(String fileName) {
	            ^
/home/jenkins/.jenkins/jobs/oxTrust_4.2.1/workspace/server/src/main/java/org/gluu/oxtrust/action/ManageCertificateAction.java:157: warning: no @param for trustStoreCertificate
	public void getCert(TrustStoreCertificate trustStoreCertificate) {
	            ^
/home/jenkins/.jenkins/jobs/oxTrust_4.2.1/workspace/server/src/main/java/org/gluu/oxtrust/action/RegisterPersonAction.java:151: error: exception not thrown: java.lang.Exception
	 * @throws Exception
	           ^
/home/jenkins/.jenkins/jobs/oxTrust_4.2.1/workspace/server/src/main/java/org/gluu/oxtrust/action/RegisterPersonAction.java:151: warning: no description for @throws
	 * @throws Exception
	   ^
/home/jenkins/.jenkins/jobs/oxTrust_4.2.1/workspace/server/src/main/java/org/gluu/oxtrust/action/RegisterPersonAction.java:429: error: exception not thrown: java.lang.Exception
	 * @throws Exception
	           ^
/home/jenkins/.jenkins/jobs/oxTrust_4.2.1/workspace/server/src/main/java/org/gluu/oxtrust/action/RegisterPersonAction.java:429: warning: no description for @throws
	 * @throws Exception
	   ^
/home/jenkins/.jenkins/jobs/oxTrust_4.2.1/workspace/server/src/main/java/org/gluu/oxtrust/action/UpdatePersonAction.java:266: error: exception not thrown: java.lang.Exception
	 * @throws Exception
	           ^
/home/jenkins/.jenkins/jobs/oxTrust_4.2.1/workspace/server/src/main/java/org/gluu/oxtrust/action/UpdatePersonAction.java:266: warning: no description for @throws
	 * @throws Exception
	   ^
/home/jenkins/.jenkins/jobs/oxTrust_4.2.1/workspace/server/src/main/java/org/gluu/oxtrust/action/UpdatePersonAction.java:288: error: exception not thrown: java.lang.Exception
	 * @throws Exception
	           ^
/home/jenkins/.jenkins/jobs/oxTrust_4.2.1/workspace/server/src/main/java/org/gluu/oxtrust/action/UpdatePersonAction.java:288: warning: no description for @throws
	 * @throws Exception
	   ^
/home/jenkins/.jenkins/jobs/oxTrust_4.2.1/workspace/server/src/main/java/org/gluu/oxtrust/action/UpdatePersonAction.java:519: warning: no @throws for java.lang.Exception
	public String save() throws Exception {
	              ^
/home/jenkins/.jenkins/jobs/oxTrust_4.2.1/workspace/server/src/main/java/org/gluu/oxtrust/action/UpdatePersonAction.java:656: warning: no description for @param
	 * @param gluuCustomPerson
	   ^
/home/jenkins/.jenkins/jobs/oxTrust_4.2.1/workspace/server/src/main/java/org/gluu/oxtrust/action/UpdatePersonAction.java:657: warning: no description for @param
	 * @param isScim2
	   ^
/home/jenkins/.jenkins/jobs/oxTrust_4.2.1/workspace/server/src/main/java/org/gluu/oxtrust/action/UpdatePersonAction.java:658: warning: no description for @return
	 * @return
	   ^
/home/jenkins/.jenkins/jobs/oxTrust_4.2.1/workspace/server/src/main/java/org/gluu/oxtrust/action/UpdatePersonAction.java:659: warning: no description for @throws
	 * @throws Exception
	   ^
/home/jenkins/.jenkins/jobs/oxTrust_4.2.1/workspace/server/src/main/java/org/gluu/oxtrust/action/UpdatePersonAction.java:748: error: exception not thrown: java.lang.Exception
	 * @throws Exception
	           ^
/home/jenkins/.jenkins/jobs/oxTrust_4.2.1/workspace/server/src/main/java/org/gluu/oxtrust/action/UpdatePersonAction.java:748: warning: no description for @throws
	 * @throws Exception
	   ^
/home/jenkins/.jenkins/jobs/oxTrust_4.2.1/workspace/server/src/main/java/org/gluu/oxtrust/action/UpdatePersonAction.java:838: warning: no description for @param
	 * @param inum
	   ^
/home/jenkins/.jenkins/jobs/oxTrust_4.2.1/workspace/server/src/main/java/org/gluu/oxtrust/action/UpdatePersonAction.java:856: warning: no description for @return
	 * @return
	   ^
/home/jenkins/.jenkins/jobs/oxTrust_4.2.1/workspace/server/src/main/java/org/gluu/oxtrust/service/AppInitializer.java:176: warning: no @param for init
	public void applicationInitialized(@Observes @Initialized(ApplicationScoped.class) Object init) {
	            ^
/home/jenkins/.jenkins/jobs/oxTrust_4.2.1/workspace/server/src/main/java/org/gluu/oxtrust/service/ImageRepository.java:88: warning: no description for @throws
	 * @throws Exception
	   ^
/home/jenkins/.jenkins/jobs/oxTrust_4.2.1/workspace/server/src/main/java/org/gluu/oxtrust/service/ImageRepository.java:91: warning: no @param for thumbWidth
	public boolean addThumbnail(GluuImage image, int thumbWidth, int thumbHeight) throws Exception {
	               ^
/home/jenkins/.jenkins/jobs/oxTrust_4.2.1/workspace/server/src/main/java/org/gluu/oxtrust/service/ImageRepository.java:91: warning: no @param for thumbHeight
	public boolean addThumbnail(GluuImage image, int thumbWidth, int thumbHeight) throws Exception {
	               ^
/home/jenkins/.jenkins/jobs/oxTrust_4.2.1/workspace/server/src/main/java/org/gluu/oxtrust/service/InumService.java:231: warning: no @param for inumEntryManager
	public boolean addInumByObject(EntityManager inumEntryManager, InumSqlEntry inumEntry) {
	               ^
/home/jenkins/.jenkins/jobs/oxTrust_4.2.1/workspace/server/src/main/java/org/gluu/oxtrust/service/InumService.java:231: warning: no @param for inumEntry
	public boolean addInumByObject(EntityManager inumEntryManager, InumSqlEntry inumEntry) {
	               ^
/home/jenkins/.jenkins/jobs/oxTrust_4.2.1/workspace/server/src/main/java/org/gluu/oxtrust/service/InumService.java:262: warning: no @param for inumEntryManager
	public boolean containsInum(EntityManager inumEntryManager, String inum) {
	               ^
/home/jenkins/.jenkins/jobs/oxTrust_4.2.1/workspace/server/src/main/java/org/gluu/oxtrust/service/InumService.java:262: warning: no @param for inum
	public boolean containsInum(EntityManager inumEntryManager, String inum) {
	               ^
/home/jenkins/.jenkins/jobs/oxTrust_4.2.1/workspace/server/src/main/java/org/gluu/oxtrust/service/InumService.java:272: warning: no @param for inumEntryManager
	public InumSqlEntry findInum(EntityManager inumEntryManager, String inum) {
	                    ^
/home/jenkins/.jenkins/jobs/oxTrust_4.2.1/workspace/server/src/main/java/org/gluu/oxtrust/service/InumService.java:272: warning: no @param for inum
	public InumSqlEntry findInum(EntityManager inumEntryManager, String inum) {
	                    ^
/home/jenkins/.jenkins/jobs/oxTrust_4.2.1/workspace/server/src/main/java/org/gluu/oxtrust/service/InumService.java:311: warning: no @param for inumEntryManager
	public InumSqlEntry findInum(EntityManager inumEntryManager, String inum, String type) {
	                    ^
/home/jenkins/.jenkins/jobs/oxTrust_4.2.1/workspace/server/src/main/java/org/gluu/oxtrust/service/InumService.java:311: warning: no @param for inum
	public InumSqlEntry findInum(EntityManager inumEntryManager, String inum, String type) {
	                    ^
/home/jenkins/.jenkins/jobs/oxTrust_4.2.1/workspace/server/src/main/java/org/gluu/oxtrust/service/InumService.java:311: warning: no @param for type
	public InumSqlEntry findInum(EntityManager inumEntryManager, String inum, String type) {
	                    ^
/home/jenkins/.jenkins/jobs/oxTrust_4.2.1/workspace/server/src/main/java/org/gluu/oxtrust/service/InumService.java:328: warning: no @param for inumEntryManager
	public List<InumSqlEntry> findInums(EntityManager inumEntryManager, String type) {
	                          ^
/home/jenkins/.jenkins/jobs/oxTrust_4.2.1/workspace/server/src/main/java/org/gluu/oxtrust/service/InumService.java:328: warning: no @param for type
	public List<InumSqlEntry> findInums(EntityManager inumEntryManager, String type) {
	                          ^
/home/jenkins/.jenkins/jobs/oxTrust_4.2.1/workspace/server/src/main/java/org/gluu/oxtrust/service/InumService.java:345: warning: no @param for inumEntryManager
	public boolean removeInum(EntityManager inumEntryManager, String inum) {
	               ^
/home/jenkins/.jenkins/jobs/oxTrust_4.2.1/workspace/server/src/main/java/org/gluu/oxtrust/service/InumService.java:345: warning: no @param for inum
	public boolean removeInum(EntityManager inumEntryManager, String inum) {
	               ^
/home/jenkins/.jenkins/jobs/oxTrust_4.2.1/workspace/server/src/main/java/org/gluu/oxtrust/service/InumService.java:389: warning: no @param for inumEntryManager
	public InumSqlEntry findInumByObject(EntityManager inumEntryManager, String inum) {
	                    ^
/home/jenkins/.jenkins/jobs/oxTrust_4.2.1/workspace/server/src/main/java/org/gluu/oxtrust/service/InumService.java:389: warning: no @param for inum
	public InumSqlEntry findInumByObject(EntityManager inumEntryManager, String inum) {
	                    ^
/home/jenkins/.jenkins/jobs/oxTrust_4.2.1/workspace/server/src/main/java/org/gluu/oxtrust/service/InumService.java:427: warning: no @param for inumEntryManager
	public boolean addInum(EntityManager inumEntryManager, String inum, String type) {
	               ^
/home/jenkins/.jenkins/jobs/oxTrust_4.2.1/workspace/server/src/main/java/org/gluu/oxtrust/service/InumService.java:427: warning: no @param for inum
	public boolean addInum(EntityManager inumEntryManager, String inum, String type) {
	               ^
/home/jenkins/.jenkins/jobs/oxTrust_4.2.1/workspace/server/src/main/java/org/gluu/oxtrust/service/InumService.java:427: warning: no @param for type
	public boolean addInum(EntityManager inumEntryManager, String inum, String type) {
	               ^
/home/jenkins/.jenkins/jobs/oxTrust_4.2.1/workspace/server/src/main/java/org/gluu/oxtrust/service/PasswordResetService.java:76: error: @param name not found
	 * @param DN
	          ^
/home/jenkins/.jenkins/jobs/oxTrust_4.2.1/workspace/server/src/main/java/org/gluu/oxtrust/service/PasswordResetService.java:80: warning: no @param for guid
	public PasswordResetRequest findPasswordResetRequest(String guid) {
	                            ^
/home/jenkins/.jenkins/jobs/oxTrust_4.2.1/workspace/server/src/main/java/org/gluu/oxtrust/service/PasswordResetService.java:90: error: @param name not found
	 * @param PasswordResetRequest
	          ^
/home/jenkins/.jenkins/jobs/oxTrust_4.2.1/workspace/server/src/main/java/org/gluu/oxtrust/service/PasswordResetService.java:93: warning: no @param for passwordResetRequest
	public void addPasswordResetRequest(PasswordResetRequest passwordResetRequest) {
	            ^
/home/jenkins/.jenkins/jobs/oxTrust_4.2.1/workspace/server/src/main/java/org/gluu/oxtrust/service/PasswordResetService.java:100: error: @param name not found
	 * @param PasswordResetRequest
	          ^
/home/jenkins/.jenkins/jobs/oxTrust_4.2.1/workspace/server/src/main/java/org/gluu/oxtrust/service/PasswordResetService.java:103: warning: no @param for passwordResetRequest
	public void updatePasswordResetRequest(PasswordResetRequest passwordResetRequest) {
	            ^
/home/jenkins/.jenkins/jobs/oxTrust_4.2.1/workspace/server/src/main/java/org/gluu/oxtrust/service/PasswordResetService.java:110: error: @param name not found
	 * @param PasswordResetRequest
	          ^
/home/jenkins/.jenkins/jobs/oxTrust_4.2.1/workspace/server/src/main/java/org/gluu/oxtrust/service/PasswordResetService.java:113: warning: no @param for passwordResetRequest
	public void removePasswordResetRequest(PasswordResetRequest passwordResetRequest) {
	            ^
/home/jenkins/.jenkins/jobs/oxTrust_4.2.1/workspace/server/src/main/java/org/gluu/oxtrust/service/PasswordResetService.java:122: warning: no @param for dn
	public boolean containsPasswordResetRequest(String dn) {
	               ^
/home/jenkins/.jenkins/jobs/oxTrust_4.2.1/workspace/server/src/main/java/org/gluu/oxtrust/service/PasswordResetService.java:129: error: @param name not found
	 * @param PasswordResetRequest
	          ^
/home/jenkins/.jenkins/jobs/oxTrust_4.2.1/workspace/server/src/main/java/org/gluu/oxtrust/service/PasswordResetService.java:133: warning: no @param for passwordResetRequest
	public List<PasswordResetRequest> findPasswordResetRequests(PasswordResetRequest passwordResetRequest) {
	                                  ^
/home/jenkins/.jenkins/jobs/oxTrust_4.2.1/workspace/server/src/main/java/org/gluu/oxtrust/service/PasswordResetService.java:142: warning: no @param for ldapReturnAttributes
	public List<PasswordResetRequest> getAllPasswordResetRequests(String... ldapReturnAttributes) {
	                                  ^
/home/jenkins/.jenkins/jobs/oxTrust_4.2.1/workspace/server/src/main/java/org/gluu/oxtrust/service/PasswordResetService.java:150: error: @param name not found
	 * @param pattern
	          ^
/home/jenkins/.jenkins/jobs/oxTrust_4.2.1/workspace/server/src/main/java/org/gluu/oxtrust/service/PasswordResetService.java:152: error: @param name not found
	 * @param sizeLimit
	          ^
/home/jenkins/.jenkins/jobs/oxTrust_4.2.1/workspace/server/src/main/java/org/gluu/oxtrust/service/PasswordResetService.java:156: warning: no @param for personInum
	public PasswordResetRequest findActualPasswordResetRequest(String personInum) {
	                            ^
/home/jenkins/.jenkins/jobs/oxTrust_4.2.1/workspace/server/src/main/java/org/gluu/oxtrust/service/PasswordResetService.java:234: warning: no @param for guid
	public String getDnForPasswordResetRequest(String guid) {
	              ^
/home/jenkins/.jenkins/jobs/oxTrust_4.2.1/workspace/server/src/main/java/org/gluu/oxtrust/service/PasswordResetService.java:234: warning: no @return
	public String getDnForPasswordResetRequest(String guid) {
	              ^
/home/jenkins/.jenkins/jobs/oxTrust_4.2.1/workspace/server/src/main/java/org/gluu/oxtrust/service/PropertyService.java:35: warning: no description for @throws
	 * @throws NoSuchMethodException 
	   ^
/home/jenkins/.jenkins/jobs/oxTrust_4.2.1/workspace/server/src/main/java/org/gluu/oxtrust/service/PropertyService.java:36: warning: no description for @throws
	 * @throws InvocationTargetException 
	   ^
/home/jenkins/.jenkins/jobs/oxTrust_4.2.1/workspace/server/src/main/java/org/gluu/oxtrust/service/PropertyService.java:37: warning: no description for @throws
	 * @throws IllegalAccessException 
	   ^
/home/jenkins/.jenkins/jobs/oxTrust_4.2.1/workspace/server/src/main/java/org/gluu/oxtrust/service/SecurityService.java:51: error: exception not thrown: java.lang.Exception
	 * @throws Exception
	           ^
/home/jenkins/.jenkins/jobs/oxTrust_4.2.1/workspace/server/src/main/java/org/gluu/oxtrust/service/push/PushApplicationService.java:69: error: @param name not found
	 * @param DN oxPush Application DN
	          ^
/home/jenkins/.jenkins/jobs/oxTrust_4.2.1/workspace/server/src/main/java/org/gluu/oxtrust/service/push/PushApplicationService.java:72: warning: no @param for dn
	public PushApplication getPushApplicationByDn(String dn) {
	                       ^
/home/jenkins/.jenkins/jobs/oxTrust_4.2.1/workspace/server/src/main/java/org/gluu/oxtrust/service/push/PushApplicationService.java:79: error: @param name not found
	 * @param PushApplication oxPush Application
	          ^
/home/jenkins/.jenkins/jobs/oxTrust_4.2.1/workspace/server/src/main/java/org/gluu/oxtrust/service/push/PushApplicationService.java:81: warning: no @param for pushApplication
	public void addPushApplication(PushApplication pushApplication) {
	            ^
/home/jenkins/.jenkins/jobs/oxTrust_4.2.1/workspace/server/src/main/java/org/gluu/oxtrust/service/push/PushApplicationService.java:88: error: @param name not found
	 * @param PushApplication oxPush Application
	          ^
/home/jenkins/.jenkins/jobs/oxTrust_4.2.1/workspace/server/src/main/java/org/gluu/oxtrust/service/push/PushApplicationService.java:90: warning: no @param for pushApplication
	public void updatePushApplication(PushApplication pushApplication) {
	            ^
/home/jenkins/.jenkins/jobs/oxTrust_4.2.1/workspace/server/src/main/java/org/gluu/oxtrust/service/push/PushApplicationService.java:97: error: @param name not found
	 * @param PushApplication oxPush Application
	          ^
/home/jenkins/.jenkins/jobs/oxTrust_4.2.1/workspace/server/src/main/java/org/gluu/oxtrust/service/push/PushApplicationService.java:99: warning: no @param for pushApplication
	public void removePushApplication(PushApplication pushApplication) {
	            ^
/home/jenkins/.jenkins/jobs/oxTrust_4.2.1/workspace/server/src/main/java/org/gluu/oxtrust/service/push/PushApplicationService.java:108: warning: no @param for dn
	public boolean containsPushApplication(String dn) {
	               ^
/home/jenkins/.jenkins/jobs/oxTrust_4.2.1/workspace/server/src/main/java/org/gluu/oxtrust/service/push/PushApplicationService.java:115: error: @param name not found
	 * @param PushApplication pushApplication
	          ^
/home/jenkins/.jenkins/jobs/oxTrust_4.2.1/workspace/server/src/main/java/org/gluu/oxtrust/service/push/PushApplicationService.java:118: warning: no @param for pushApplication
	public List<PushApplication> findPushApplications(PushApplication pushApplication) {
	                             ^
/home/jenkins/.jenkins/jobs/oxTrust_4.2.1/workspace/server/src/main/java/org/gluu/oxtrust/service/push/PushApplicationService.java:127: warning: no @param for ldapReturnAttributes
	public List<PushApplication> getAllPushApplications(String... ldapReturnAttributes) {
	                             ^
/home/jenkins/.jenkins/jobs/oxTrust_4.2.1/workspace/server/src/main/java/org/gluu/oxtrust/service/push/PushApplicationService.java:178: warning: no @param for inum
	public String getDnForPushApplication(String inum) {
	              ^
/home/jenkins/.jenkins/jobs/oxTrust_4.2.1/workspace/server/src/main/java/org/gluu/oxtrust/service/push/PushApplicationService.java:178: warning: no @return
	public String getDnForPushApplication(String inum) {
	              ^
/home/jenkins/.jenkins/jobs/oxTrust_4.2.1/workspace/server/src/main/java/org/gluu/oxtrust/service/push/PushDeviceService.java:68: error: @param name not found
	 * @param DN oxPush Device DN
	          ^
/home/jenkins/.jenkins/jobs/oxTrust_4.2.1/workspace/server/src/main/java/org/gluu/oxtrust/service/push/PushDeviceService.java:71: warning: no @param for dn
	public PushDevice getPushDeviceByDn(String dn) {
	                  ^
/home/jenkins/.jenkins/jobs/oxTrust_4.2.1/workspace/server/src/main/java/org/gluu/oxtrust/service/push/PushDeviceService.java:78: error: @param name not found
	 * @param PushDevice oxPush Device
	          ^
/home/jenkins/.jenkins/jobs/oxTrust_4.2.1/workspace/server/src/main/java/org/gluu/oxtrust/service/push/PushDeviceService.java:80: warning: no @param for pushDevice
	public void addPushDevice(PushDevice pushDevice) {
	            ^
/home/jenkins/.jenkins/jobs/oxTrust_4.2.1/workspace/server/src/main/java/org/gluu/oxtrust/service/push/PushDeviceService.java:87: error: @param name not found
	 * @param PushDevice oxPush Device
	          ^
/home/jenkins/.jenkins/jobs/oxTrust_4.2.1/workspace/server/src/main/java/org/gluu/oxtrust/service/push/PushDeviceService.java:89: warning: no @param for pushDevice
	public void updatePushDevice(PushDevice pushDevice) {
	            ^
/home/jenkins/.jenkins/jobs/oxTrust_4.2.1/workspace/server/src/main/java/org/gluu/oxtrust/service/push/PushDeviceService.java:96: error: @param name not found
	 * @param PushDevice oxPush Device
	          ^
/home/jenkins/.jenkins/jobs/oxTrust_4.2.1/workspace/server/src/main/java/org/gluu/oxtrust/service/push/PushDeviceService.java:98: warning: no @param for pushDevice
	public void removePushDevice(PushDevice pushDevice) {
	            ^
/home/jenkins/.jenkins/jobs/oxTrust_4.2.1/workspace/server/src/main/java/org/gluu/oxtrust/service/push/PushDeviceService.java:107: warning: no @param for dn
	public boolean containsPushDevice(String dn) {
	               ^
/home/jenkins/.jenkins/jobs/oxTrust_4.2.1/workspace/server/src/main/java/org/gluu/oxtrust/service/push/PushDeviceService.java:114: error: @param name not found
	 * @param PushDevice pushDevice
	          ^
/home/jenkins/.jenkins/jobs/oxTrust_4.2.1/workspace/server/src/main/java/org/gluu/oxtrust/service/push/PushDeviceService.java:117: warning: no @param for pushDevice
	public List<PushDevice> findPushDevices(PushDevice pushDevice) {
	                        ^
/home/jenkins/.jenkins/jobs/oxTrust_4.2.1/workspace/server/src/main/java/org/gluu/oxtrust/service/push/PushDeviceService.java:126: warning: no @param for ldapReturnAttributes
	public List<PushDevice> getAllPushDevices(String... ldapReturnAttributes) {
	                        ^
/home/jenkins/.jenkins/jobs/oxTrust_4.2.1/workspace/server/src/main/java/org/gluu/oxtrust/service/push/PushDeviceService.java:177: warning: no @param for inum
	public String getDnForPushDevice(String inum) {
	              ^
/home/jenkins/.jenkins/jobs/oxTrust_4.2.1/workspace/server/src/main/java/org/gluu/oxtrust/service/push/PushDeviceService.java:177: warning: no @return
	public String getDnForPushDevice(String inum) {
	              ^
/home/jenkins/.jenkins/jobs/oxTrust_4.2.1/workspace/server/src/main/java/org/gluu/oxtrust/util/KeystoreWrapper.java:113: warning: no description for @param
     * @param key 
       ^
/home/jenkins/.jenkins/jobs/oxTrust_4.2.1/workspace/server/src/main/java/org/gluu/oxtrust/util/KeystoreWrapper.java:114: warning: no description for @param
     * @param alias
       ^
/home/jenkins/.jenkins/jobs/oxTrust_4.2.1/workspace/server/src/main/java/org/gluu/oxtrust/util/KeystoreWrapper.java:115: warning: no description for @param
     * @param password
       ^
/home/jenkins/.jenkins/jobs/oxTrust_4.2.1/workspace/server/src/main/java/org/gluu/oxtrust/util/KeystoreWrapper.java:116: warning: no description for @throws
     * @throws KeyStoreException 
       ^
/home/jenkins/.jenkins/jobs/oxTrust_4.2.1/workspace/server/src/main/java/org/gluu/oxtrust/util/KeystoreWrapper.java:45: warning: no description for @param
     * @param filepath
       ^
/home/jenkins/.jenkins/jobs/oxTrust_4.2.1/workspace/server/src/main/java/org/gluu/oxtrust/util/KeystoreWrapper.java:46: warning: no description for @param
     * @param password
       ^
/home/jenkins/.jenkins/jobs/oxTrust_4.2.1/workspace/server/src/main/java/org/gluu/oxtrust/util/KeystoreWrapper.java:47: warning: no description for @param
     * @param type
       ^
/home/jenkins/.jenkins/jobs/oxTrust_4.2.1/workspace/server/src/main/java/org/gluu/oxtrust/util/KeystoreWrapper.java:48: warning: no description for @throws
     * @throws KeyStoreException
       ^
/home/jenkins/.jenkins/jobs/oxTrust_4.2.1/workspace/server/src/main/java/org/gluu/oxtrust/util/KeystoreWrapper.java:49: warning: no description for @throws
     * @throws IOException
       ^
/home/jenkins/.jenkins/jobs/oxTrust_4.2.1/workspace/server/src/main/java/org/gluu/oxtrust/util/KeystoreWrapper.java:50: warning: no description for @throws
     * @throws NoSuchAlgorithmException
       ^
/home/jenkins/.jenkins/jobs/oxTrust_4.2.1/workspace/server/src/main/java/org/gluu/oxtrust/util/KeystoreWrapper.java:51: warning: no description for @throws
     * @throws CertificateException 
       ^
/home/jenkins/.jenkins/jobs/oxTrust_4.2.1/workspace/server/src/main/java/org/gluu/oxtrust/util/MapperUtil.java:21: warning: no description for @param
	 * @param source
	   ^
/home/jenkins/.jenkins/jobs/oxTrust_4.2.1/workspace/server/src/main/java/org/gluu/oxtrust/util/MapperUtil.java:22: warning: no description for @param
	 * @param destination
	   ^
/home/jenkins/.jenkins/jobs/oxTrust_4.2.1/workspace/server/src/main/java/org/gluu/oxtrust/util/MapperUtil.java:23: warning: no description for @return
	 * @return
	   ^
/home/jenkins/.jenkins/jobs/oxTrust_4.2.1/workspace/server/src/main/java/org/gluu/oxtrust/util/MapperUtil.java:47: warning: no description for @param
	 * @param source
	   ^
/home/jenkins/.jenkins/jobs/oxTrust_4.2.1/workspace/server/src/main/java/org/gluu/oxtrust/util/MapperUtil.java:48: warning: no description for @param
	 * @param destination
	   ^
/home/jenkins/.jenkins/jobs/oxTrust_4.2.1/workspace/server/src/main/java/org/gluu/oxtrust/util/MapperUtil.java:49: warning: no description for @return
	 * @return
	   ^
/home/jenkins/.jenkins/jobs/oxTrust_4.2.1/workspace/server/src/main/java/org/gluu/oxtrust/util/velocity/ClasspathPathResourceLoader.java:49: error: @param name not found
	 * @param name     name of template to get
	          ^

Command line was: /usr/lib/jvm/java-1.8.0-openjdk-1.8.0.222.b10-0.el7_6.x86_64/jre/../bin/javadoc @options @packages

Refer to the generated Javadoc files in '/home/jenkins/.jenkins/jobs/oxTrust_4.2.1/workspace/server/target/site/apidocs' dir.

	at org.apache.maven.plugins.javadoc.AbstractJavadocMojo.executeJavadocCommandLine(AbstractJavadocMojo.java:5298)
	at org.apache.maven.plugins.javadoc.AbstractJavadocMojo.executeReport(AbstractJavadocMojo.java:2134)
	at org.apache.maven.plugins.javadoc.JavadocReport.generate(JavadocReport.java:134)
	at org.apache.maven.plugins.javadoc.JavadocReport.doExecute(JavadocReport.java:329)
	at org.apache.maven.plugins.javadoc.AbstractJavadocMojo.execute(AbstractJavadocMojo.java:1912)
	at org.apache.maven.plugin.DefaultBuildPluginManager.executeMojo(DefaultBuildPluginManager.java:134)
	at org.apache.maven.lifecycle.internal.MojoExecutor.execute(MojoExecutor.java:207)
	at org.apache.maven.lifecycle.internal.MojoExecutor.execute(MojoExecutor.java:153)
	at org.apache.maven.lifecycle.internal.MojoExecutor.execute(MojoExecutor.java:145)
	at org.apache.maven.lifecycle.internal.LifecycleModuleBuilder.buildProject(LifecycleModuleBuilder.java:116)
	at org.apache.maven.lifecycle.internal.LifecycleModuleBuilder.buildProject(LifecycleModuleBuilder.java:80)
	at org.apache.maven.lifecycle.internal.builder.singlethreaded.SingleThreadedBuilder.build(SingleThreadedBuilder.java:51)
	at org.apache.maven.lifecycle.internal.LifecycleStarter.execute(LifecycleStarter.java:128)
	at org.apache.maven.DefaultMaven.doExecute(DefaultMaven.java:307)
	at org.apache.maven.DefaultMaven.doExecute(DefaultMaven.java:193)
	at org.apache.maven.DefaultMaven.execute(DefaultMaven.java:106)
	at org.apache.maven.cli.MavenCli.execute(MavenCli.java:863)
	at org.apache.maven.cli.MavenCli.doMain(MavenCli.java:288)
	at org.apache.maven.cli.MavenCli.main(MavenCli.java:199)
	at sun.reflect.NativeMethodAccessorImpl.invoke0(Native Method)
	at sun.reflect.NativeMethodAccessorImpl.invoke(NativeMethodAccessorImpl.java:62)
	at sun.reflect.DelegatingMethodAccessorImpl.invoke(DelegatingMethodAccessorImpl.java:43)
	at java.lang.reflect.Method.invoke(Method.java:498)
	at org.codehaus.plexus.classworlds.launcher.Launcher.launchEnhanced(Launcher.java:289)
	at org.codehaus.plexus.classworlds.launcher.Launcher.launch(Launcher.java:229)
	at org.codehaus.plexus.classworlds.launcher.Launcher.mainWithExitCode(Launcher.java:415)
	at org.codehaus.plexus.classworlds.launcher.Launcher.main(Launcher.java:356)
[INFO] 
[INFO] --- findbugs-maven-plugin:3.0.4:findbugs (default-cli) @ oxtrust-server ---
[INFO] Fork Value is true
     [java] Warnings generated: 307
[INFO] Done FindBugs Analysis....
[INFO] 
[INFO] --- maven-site-plugin:2.1.1:site (default-site) @ oxtrust-server ---
[INFO]                                                                         
[INFO] ------------------------------------------------------------------------
[INFO] Building OpenId authentication module for Saml 4.2.1.Final
[INFO] ------------------------------------------------------------------------
[INFO] 
[INFO] --- maven-clean-plugin:2.5:clean (default-clean) @ oxtrust-saml-openid-auth-client ---
[INFO] Deleting /home/jenkins/.jenkins/jobs/oxTrust_4.2.1/workspace/saml-openid-auth-client/target
[INFO] 
[INFO] --- maven-resources-plugin:2.6:resources (default-resources) @ oxtrust-saml-openid-auth-client ---
[INFO] Using 'UTF-8' encoding to copy filtered resources.
[INFO] skip non existing resourceDirectory /home/jenkins/.jenkins/jobs/oxTrust_4.2.1/workspace/saml-openid-auth-client/src/main/resources
[INFO] 
[INFO] --- maven-compiler-plugin:2.3.2:compile (default-compile) @ oxtrust-saml-openid-auth-client ---
[INFO] Compiling 15 source files to /home/jenkins/.jenkins/jobs/oxTrust_4.2.1/workspace/saml-openid-auth-client/target/classes
[INFO] 
[INFO] --- maven-resources-plugin:2.6:resources (default-resources) @ oxtrust-saml-openid-auth-client ---
[INFO] Using 'UTF-8' encoding to copy filtered resources.
[INFO] skip non existing resourceDirectory /home/jenkins/.jenkins/jobs/oxTrust_4.2.1/workspace/saml-openid-auth-client/src/main/resources
[INFO] 
[INFO] --- maven-compiler-plugin:2.3.2:compile (default-compile) @ oxtrust-saml-openid-auth-client ---
[INFO] Nothing to compile - all classes are up to date
[INFO] 
[INFO] --- maven-resources-plugin:2.6:testResources (default-testResources) @ oxtrust-saml-openid-auth-client ---
[INFO] Using 'UTF-8' encoding to copy filtered resources.
[INFO] skip non existing resourceDirectory /home/jenkins/.jenkins/jobs/oxTrust_4.2.1/workspace/saml-openid-auth-client/src/test/resources
[INFO] 
[INFO] --- maven-compiler-plugin:2.3.2:testCompile (default-testCompile) @ oxtrust-saml-openid-auth-client ---
[INFO] No sources to compile
[INFO] 
[INFO] --- maven-surefire-plugin:2.19.1:test (default-test) @ oxtrust-saml-openid-auth-client ---
[INFO] No tests to run.
[INFO] 
[INFO] --- maven-jar-plugin:2.4:jar (default-jar) @ oxtrust-saml-openid-auth-client ---
[INFO] Building jar: /home/jenkins/.jenkins/jobs/oxTrust_4.2.1/workspace/saml-openid-auth-client/target/oxtrust-saml-openid-auth-client-4.2.1.Final.jar
[INFO] 
[INFO] --- maven-jar-plugin:2.4:test-jar (default) @ oxtrust-saml-openid-auth-client ---
[WARNING] JAR will be empty - no content was marked for inclusion!
[INFO] Building jar: /home/jenkins/.jenkins/jobs/oxTrust_4.2.1/workspace/saml-openid-auth-client/target/oxtrust-saml-openid-auth-client-4.2.1.Final-tests.jar
[INFO] 
[INFO] --- maven-install-plugin:2.3.1:install (default-install) @ oxtrust-saml-openid-auth-client ---
[INFO] Installing /home/jenkins/.jenkins/jobs/oxTrust_4.2.1/workspace/saml-openid-auth-client/target/oxtrust-saml-openid-auth-client-4.2.1.Final.jar to /var/www/html/maven/org/gluu/oxtrust-saml-openid-auth-client/4.2.1.Final/oxtrust-saml-openid-auth-client-4.2.1.Final.jar
[INFO] Installing /home/jenkins/.jenkins/jobs/oxTrust_4.2.1/workspace/saml-openid-auth-client/pom.xml to /var/www/html/maven/org/gluu/oxtrust-saml-openid-auth-client/4.2.1.Final/oxtrust-saml-openid-auth-client-4.2.1.Final.pom
[INFO] Installing /home/jenkins/.jenkins/jobs/oxTrust_4.2.1/workspace/saml-openid-auth-client/target/oxtrust-saml-openid-auth-client-4.2.1.Final-tests.jar to /var/www/html/maven/org/gluu/oxtrust-saml-openid-auth-client/4.2.1.Final/oxtrust-saml-openid-auth-client-4.2.1.Final-tests.jar
[INFO] 
[INFO] >>> maven-javadoc-plugin:3.0.1:javadoc (default-cli) > generate-sources @ oxtrust-saml-openid-auth-client >>>
[INFO] 
[INFO] <<< maven-javadoc-plugin:3.0.1:javadoc (default-cli) < generate-sources @ oxtrust-saml-openid-auth-client <<<
[INFO] 
[INFO] --- maven-javadoc-plugin:3.0.1:javadoc (default-cli) @ oxtrust-saml-openid-auth-client ---
[INFO] 
Loading source files for package org.gluu.oxauth.client.authentication...
Loading source files for package org.gluu.oxauth.client.exception...
Loading source files for package org.gluu.oxauth.client.logout...
Loading source files for package org.gluu.oxauth.client.session...
Loading source files for package org.gluu.oxauth.client.util...
Loading source files for package org.gluu.oxauth.client.validation...
Constructing Javadoc information...
Standard Doclet version 1.8.0_222
Building tree for all the packages and classes...
Generating /home/jenkins/.jenkins/jobs/oxTrust_4.2.1/workspace/saml-openid-auth-client/target/site/apidocs/org/gluu/oxauth/client/authentication/AuthenticationFilter.html...
Generating /home/jenkins/.jenkins/jobs/oxTrust_4.2.1/workspace/saml-openid-auth-client/target/site/apidocs/org/gluu/oxauth/client/authentication/SimplePrincipal.html...
Generating /home/jenkins/.jenkins/jobs/oxTrust_4.2.1/workspace/saml-openid-auth-client/target/site/apidocs/org/gluu/oxauth/client/exception/ConfigurationException.html...
Generating /home/jenkins/.jenkins/jobs/oxTrust_4.2.1/workspace/saml-openid-auth-client/target/site/apidocs/org/gluu/oxauth/client/logout/LogoutFilter.html...
Generating /home/jenkins/.jenkins/jobs/oxTrust_4.2.1/workspace/saml-openid-auth-client/target/site/apidocs/org/gluu/oxauth/client/session/AbstractOAuthFilter.html...
Generating /home/jenkins/.jenkins/jobs/oxTrust_4.2.1/workspace/saml-openid-auth-client/target/site/apidocs/org/gluu/oxauth/client/session/OAuthData.html...
Generating /home/jenkins/.jenkins/jobs/oxTrust_4.2.1/workspace/saml-openid-auth-client/target/site/apidocs/org/gluu/oxauth/client/session/OAuthThreadLocalFilter.html...
Generating /home/jenkins/.jenkins/jobs/oxTrust_4.2.1/workspace/saml-openid-auth-client/target/site/apidocs/org/gluu/oxauth/client/session/SignOutHandler.html...
Generating /home/jenkins/.jenkins/jobs/oxTrust_4.2.1/workspace/saml-openid-auth-client/target/site/apidocs/org/gluu/oxauth/client/util/AbstractConfigurationFilter.html...
Generating /home/jenkins/.jenkins/jobs/oxTrust_4.2.1/workspace/saml-openid-auth-client/target/site/apidocs/org/gluu/oxauth/client/util/Configuration.html...
Generating /home/jenkins/.jenkins/jobs/oxTrust_4.2.1/workspace/saml-openid-auth-client/target/site/apidocs/org/gluu/oxauth/client/util/HttpServletRequestWrapperFilter.html...
Generating /home/jenkins/.jenkins/jobs/oxTrust_4.2.1/workspace/saml-openid-auth-client/target/site/apidocs/org/gluu/oxauth/client/util/OAuthDataHolder.html...
Generating /home/jenkins/.jenkins/jobs/oxTrust_4.2.1/workspace/saml-openid-auth-client/target/site/apidocs/org/gluu/oxauth/client/util/SamlConfiguration.html...
Generating /home/jenkins/.jenkins/jobs/oxTrust_4.2.1/workspace/saml-openid-auth-client/target/site/apidocs/org/gluu/oxauth/client/validation/CustomHttpServletRequest.html...
Generating /home/jenkins/.jenkins/jobs/oxTrust_4.2.1/workspace/saml-openid-auth-client/target/site/apidocs/org/gluu/oxauth/client/validation/OAuthValidationFilter.html...
Generating /home/jenkins/.jenkins/jobs/oxTrust_4.2.1/workspace/saml-openid-auth-client/target/site/apidocs/overview-frame.html...
Generating /home/jenkins/.jenkins/jobs/oxTrust_4.2.1/workspace/saml-openid-auth-client/target/site/apidocs/org/gluu/oxauth/client/authentication/package-frame.html...
Generating /home/jenkins/.jenkins/jobs/oxTrust_4.2.1/workspace/saml-openid-auth-client/target/site/apidocs/org/gluu/oxauth/client/authentication/package-summary.html...
Generating /home/jenkins/.jenkins/jobs/oxTrust_4.2.1/workspace/saml-openid-auth-client/target/site/apidocs/org/gluu/oxauth/client/authentication/package-tree.html...
Generating /home/jenkins/.jenkins/jobs/oxTrust_4.2.1/workspace/saml-openid-auth-client/target/site/apidocs/org/gluu/oxauth/client/exception/package-frame.html...
Generating /home/jenkins/.jenkins/jobs/oxTrust_4.2.1/workspace/saml-openid-auth-client/target/site/apidocs/org/gluu/oxauth/client/exception/package-summary.html...
Generating /home/jenkins/.jenkins/jobs/oxTrust_4.2.1/workspace/saml-openid-auth-client/target/site/apidocs/org/gluu/oxauth/client/exception/package-tree.html...
Generating /home/jenkins/.jenkins/jobs/oxTrust_4.2.1/workspace/saml-openid-auth-client/target/site/apidocs/org/gluu/oxauth/client/logout/package-frame.html...
Generating /home/jenkins/.jenkins/jobs/oxTrust_4.2.1/workspace/saml-openid-auth-client/target/site/apidocs/org/gluu/oxauth/client/logout/package-summary.html...
Generating /home/jenkins/.jenkins/jobs/oxTrust_4.2.1/workspace/saml-openid-auth-client/target/site/apidocs/org/gluu/oxauth/client/logout/package-tree.html...
Generating /home/jenkins/.jenkins/jobs/oxTrust_4.2.1/workspace/saml-openid-auth-client/target/site/apidocs/org/gluu/oxauth/client/session/package-frame.html...
Generating /home/jenkins/.jenkins/jobs/oxTrust_4.2.1/workspace/saml-openid-auth-client/target/site/apidocs/org/gluu/oxauth/client/session/package-summary.html...
Generating /home/jenkins/.jenkins/jobs/oxTrust_4.2.1/workspace/saml-openid-auth-client/target/site/apidocs/org/gluu/oxauth/client/session/package-tree.html...
Generating /home/jenkins/.jenkins/jobs/oxTrust_4.2.1/workspace/saml-openid-auth-client/target/site/apidocs/org/gluu/oxauth/client/util/package-frame.html...
Generating /home/jenkins/.jenkins/jobs/oxTrust_4.2.1/workspace/saml-openid-auth-client/target/site/apidocs/org/gluu/oxauth/client/util/package-summary.html...
Generating /home/jenkins/.jenkins/jobs/oxTrust_4.2.1/workspace/saml-openid-auth-client/target/site/apidocs/org/gluu/oxauth/client/util/package-tree.html...
Generating /home/jenkins/.jenkins/jobs/oxTrust_4.2.1/workspace/saml-openid-auth-client/target/site/apidocs/org/gluu/oxauth/client/validation/package-frame.html...
Generating /home/jenkins/.jenkins/jobs/oxTrust_4.2.1/workspace/saml-openid-auth-client/target/site/apidocs/org/gluu/oxauth/client/validation/package-summary.html...
Generating /home/jenkins/.jenkins/jobs/oxTrust_4.2.1/workspace/saml-openid-auth-client/target/site/apidocs/org/gluu/oxauth/client/validation/package-tree.html...
Generating /home/jenkins/.jenkins/jobs/oxTrust_4.2.1/workspace/saml-openid-auth-client/target/site/apidocs/constant-values.html...
Generating /home/jenkins/.jenkins/jobs/oxTrust_4.2.1/workspace/saml-openid-auth-client/target/site/apidocs/serialized-form.html...
Generating /home/jenkins/.jenkins/jobs/oxTrust_4.2.1/workspace/saml-openid-auth-client/target/site/apidocs/org/gluu/oxauth/client/authentication/class-use/SimplePrincipal.html...
Generating /home/jenkins/.jenkins/jobs/oxTrust_4.2.1/workspace/saml-openid-auth-client/target/site/apidocs/org/gluu/oxauth/client/authentication/class-use/AuthenticationFilter.html...
Generating /home/jenkins/.jenkins/jobs/oxTrust_4.2.1/workspace/saml-openid-auth-client/target/site/apidocs/org/gluu/oxauth/client/exception/class-use/ConfigurationException.html...
Generating /home/jenkins/.jenkins/jobs/oxTrust_4.2.1/workspace/saml-openid-auth-client/target/site/apidocs/org/gluu/oxauth/client/logout/class-use/LogoutFilter.html...
Generating /home/jenkins/.jenkins/jobs/oxTrust_4.2.1/workspace/saml-openid-auth-client/target/site/apidocs/org/gluu/oxauth/client/session/class-use/SignOutHandler.html...
Generating /home/jenkins/.jenkins/jobs/oxTrust_4.2.1/workspace/saml-openid-auth-client/target/site/apidocs/org/gluu/oxauth/client/session/class-use/OAuthThreadLocalFilter.html...
Generating /home/jenkins/.jenkins/jobs/oxTrust_4.2.1/workspace/saml-openid-auth-client/target/site/apidocs/org/gluu/oxauth/client/session/class-use/OAuthData.html...
Generating /home/jenkins/.jenkins/jobs/oxTrust_4.2.1/workspace/saml-openid-auth-client/target/site/apidocs/org/gluu/oxauth/client/session/class-use/AbstractOAuthFilter.html...
Generating /home/jenkins/.jenkins/jobs/oxTrust_4.2.1/workspace/saml-openid-auth-client/target/site/apidocs/org/gluu/oxauth/client/util/class-use/SamlConfiguration.html...
Generating /home/jenkins/.jenkins/jobs/oxTrust_4.2.1/workspace/saml-openid-auth-client/target/site/apidocs/org/gluu/oxauth/client/util/class-use/Configuration.html...
Generating /home/jenkins/.jenkins/jobs/oxTrust_4.2.1/workspace/saml-openid-auth-client/target/site/apidocs/org/gluu/oxauth/client/util/class-use/OAuthDataHolder.html...
Generating /home/jenkins/.jenkins/jobs/oxTrust_4.2.1/workspace/saml-openid-auth-client/target/site/apidocs/org/gluu/oxauth/client/util/class-use/HttpServletRequestWrapperFilter.html...
Generating /home/jenkins/.jenkins/jobs/oxTrust_4.2.1/workspace/saml-openid-auth-client/target/site/apidocs/org/gluu/oxauth/client/util/class-use/AbstractConfigurationFilter.html...
Generating /home/jenkins/.jenkins/jobs/oxTrust_4.2.1/workspace/saml-openid-auth-client/target/site/apidocs/org/gluu/oxauth/client/validation/class-use/OAuthValidationFilter.html...
Generating /home/jenkins/.jenkins/jobs/oxTrust_4.2.1/workspace/saml-openid-auth-client/target/site/apidocs/org/gluu/oxauth/client/validation/class-use/CustomHttpServletRequest.html...
Generating /home/jenkins/.jenkins/jobs/oxTrust_4.2.1/workspace/saml-openid-auth-client/target/site/apidocs/org/gluu/oxauth/client/authentication/package-use.html...
Generating /home/jenkins/.jenkins/jobs/oxTrust_4.2.1/workspace/saml-openid-auth-client/target/site/apidocs/org/gluu/oxauth/client/exception/package-use.html...
Generating /home/jenkins/.jenkins/jobs/oxTrust_4.2.1/workspace/saml-openid-auth-client/target/site/apidocs/org/gluu/oxauth/client/logout/package-use.html...
Generating /home/jenkins/.jenkins/jobs/oxTrust_4.2.1/workspace/saml-openid-auth-client/target/site/apidocs/org/gluu/oxauth/client/session/package-use.html...
Generating /home/jenkins/.jenkins/jobs/oxTrust_4.2.1/workspace/saml-openid-auth-client/target/site/apidocs/org/gluu/oxauth/client/util/package-use.html...
Generating /home/jenkins/.jenkins/jobs/oxTrust_4.2.1/workspace/saml-openid-auth-client/target/site/apidocs/org/gluu/oxauth/client/validation/package-use.html...
Building index for all the packages and classes...
Generating /home/jenkins/.jenkins/jobs/oxTrust_4.2.1/workspace/saml-openid-auth-client/target/site/apidocs/overview-tree.html...
Generating /home/jenkins/.jenkins/jobs/oxTrust_4.2.1/workspace/saml-openid-auth-client/target/site/apidocs/index-all.html...
Generating /home/jenkins/.jenkins/jobs/oxTrust_4.2.1/workspace/saml-openid-auth-client/target/site/apidocs/deprecated-list.html...
Building index for all classes...
Generating /home/jenkins/.jenkins/jobs/oxTrust_4.2.1/workspace/saml-openid-auth-client/target/site/apidocs/allclasses-frame.html...
Generating /home/jenkins/.jenkins/jobs/oxTrust_4.2.1/workspace/saml-openid-auth-client/target/site/apidocs/allclasses-noframe.html...
Generating /home/jenkins/.jenkins/jobs/oxTrust_4.2.1/workspace/saml-openid-auth-client/target/site/apidocs/index.html...
Generating /home/jenkins/.jenkins/jobs/oxTrust_4.2.1/workspace/saml-openid-auth-client/target/site/apidocs/overview-summary.html...
Generating /home/jenkins/.jenkins/jobs/oxTrust_4.2.1/workspace/saml-openid-auth-client/target/site/apidocs/help-doc.html...
1 error
12 warnings
[ERROR] Error while creating javadoc report: 
Exit code: 1 - /home/jenkins/.jenkins/jobs/oxTrust_4.2.1/workspace/saml-openid-auth-client/src/main/java/org/gluu/oxauth/client/authentication/AuthenticationFilter.java:113: warning: no @param for servletRequest
    protected final boolean preFilter(final ServletRequest servletRequest, final ServletResponse servletResponse, final FilterChain filterChain)
                            ^
/home/jenkins/.jenkins/jobs/oxTrust_4.2.1/workspace/saml-openid-auth-client/src/main/java/org/gluu/oxauth/client/authentication/AuthenticationFilter.java:113: warning: no @param for servletResponse
    protected final boolean preFilter(final ServletRequest servletRequest, final ServletResponse servletResponse, final FilterChain filterChain)
                            ^
/home/jenkins/.jenkins/jobs/oxTrust_4.2.1/workspace/saml-openid-auth-client/src/main/java/org/gluu/oxauth/client/authentication/AuthenticationFilter.java:113: warning: no @param for filterChain
    protected final boolean preFilter(final ServletRequest servletRequest, final ServletResponse servletResponse, final FilterChain filterChain)
                            ^
/home/jenkins/.jenkins/jobs/oxTrust_4.2.1/workspace/saml-openid-auth-client/src/main/java/org/gluu/oxauth/client/authentication/AuthenticationFilter.java:113: warning: no @return
    protected final boolean preFilter(final ServletRequest servletRequest, final ServletResponse servletResponse, final FilterChain filterChain)
                            ^
/home/jenkins/.jenkins/jobs/oxTrust_4.2.1/workspace/saml-openid-auth-client/src/main/java/org/gluu/oxauth/client/authentication/AuthenticationFilter.java:113: warning: no @throws for java.io.IOException
    protected final boolean preFilter(final ServletRequest servletRequest, final ServletResponse servletResponse, final FilterChain filterChain)
                            ^
/home/jenkins/.jenkins/jobs/oxTrust_4.2.1/workspace/saml-openid-auth-client/src/main/java/org/gluu/oxauth/client/authentication/AuthenticationFilter.java:113: warning: no @throws for javax.servlet.ServletException
    protected final boolean preFilter(final ServletRequest servletRequest, final ServletResponse servletResponse, final FilterChain filterChain)
                            ^
/home/jenkins/.jenkins/jobs/oxTrust_4.2.1/workspace/saml-openid-auth-client/src/main/java/org/gluu/oxauth/client/util/HttpServletRequestWrapperFilter.java:32: error: self-closing element not allowed
 * <p/>
   ^
/home/jenkins/.jenkins/jobs/oxTrust_4.2.1/workspace/saml-openid-auth-client/src/main/java/org/gluu/oxauth/client/validation/OAuthValidationFilter.java:107: warning: no @param for servletRequest
    protected final boolean preFilter(final ServletRequest servletRequest, final ServletResponse servletResponse,
                            ^
/home/jenkins/.jenkins/jobs/oxTrust_4.2.1/workspace/saml-openid-auth-client/src/main/java/org/gluu/oxauth/client/validation/OAuthValidationFilter.java:107: warning: no @param for servletResponse
    protected final boolean preFilter(final ServletRequest servletRequest, final ServletResponse servletResponse,
                            ^
/home/jenkins/.jenkins/jobs/oxTrust_4.2.1/workspace/saml-openid-auth-client/src/main/java/org/gluu/oxauth/client/validation/OAuthValidationFilter.java:107: warning: no @param for filterChain
    protected final boolean preFilter(final ServletRequest servletRequest, final ServletResponse servletResponse,
                            ^
/home/jenkins/.jenkins/jobs/oxTrust_4.2.1/workspace/saml-openid-auth-client/src/main/java/org/gluu/oxauth/client/validation/OAuthValidationFilter.java:107: warning: no @return
    protected final boolean preFilter(final ServletRequest servletRequest, final ServletResponse servletResponse,
                            ^
/home/jenkins/.jenkins/jobs/oxTrust_4.2.1/workspace/saml-openid-auth-client/src/main/java/org/gluu/oxauth/client/validation/OAuthValidationFilter.java:107: warning: no @throws for java.io.IOException
    protected final boolean preFilter(final ServletRequest servletRequest, final ServletResponse servletResponse,
                            ^
/home/jenkins/.jenkins/jobs/oxTrust_4.2.1/workspace/saml-openid-auth-client/src/main/java/org/gluu/oxauth/client/validation/OAuthValidationFilter.java:107: warning: no @throws for javax.servlet.ServletException
    protected final boolean preFilter(final ServletRequest servletRequest, final ServletResponse servletResponse,
                            ^

Command line was: /usr/lib/jvm/java-1.8.0-openjdk-1.8.0.222.b10-0.el7_6.x86_64/jre/../bin/javadoc @options @packages

Refer to the generated Javadoc files in '/home/jenkins/.jenkins/jobs/oxTrust_4.2.1/workspace/saml-openid-auth-client/target/site/apidocs' dir.

org.apache.maven.reporting.MavenReportException: 
Exit code: 1 - /home/jenkins/.jenkins/jobs/oxTrust_4.2.1/workspace/saml-openid-auth-client/src/main/java/org/gluu/oxauth/client/authentication/AuthenticationFilter.java:113: warning: no @param for servletRequest
    protected final boolean preFilter(final ServletRequest servletRequest, final ServletResponse servletResponse, final FilterChain filterChain)
                            ^
/home/jenkins/.jenkins/jobs/oxTrust_4.2.1/workspace/saml-openid-auth-client/src/main/java/org/gluu/oxauth/client/authentication/AuthenticationFilter.java:113: warning: no @param for servletResponse
    protected final boolean preFilter(final ServletRequest servletRequest, final ServletResponse servletResponse, final FilterChain filterChain)
                            ^
/home/jenkins/.jenkins/jobs/oxTrust_4.2.1/workspace/saml-openid-auth-client/src/main/java/org/gluu/oxauth/client/authentication/AuthenticationFilter.java:113: warning: no @param for filterChain
    protected final boolean preFilter(final ServletRequest servletRequest, final ServletResponse servletResponse, final FilterChain filterChain)
                            ^
/home/jenkins/.jenkins/jobs/oxTrust_4.2.1/workspace/saml-openid-auth-client/src/main/java/org/gluu/oxauth/client/authentication/AuthenticationFilter.java:113: warning: no @return
    protected final boolean preFilter(final ServletRequest servletRequest, final ServletResponse servletResponse, final FilterChain filterChain)
                            ^
/home/jenkins/.jenkins/jobs/oxTrust_4.2.1/workspace/saml-openid-auth-client/src/main/java/org/gluu/oxauth/client/authentication/AuthenticationFilter.java:113: warning: no @throws for java.io.IOException
    protected final boolean preFilter(final ServletRequest servletRequest, final ServletResponse servletResponse, final FilterChain filterChain)
                            ^
/home/jenkins/.jenkins/jobs/oxTrust_4.2.1/workspace/saml-openid-auth-client/src/main/java/org/gluu/oxauth/client/authentication/AuthenticationFilter.java:113: warning: no @throws for javax.servlet.ServletException
    protected final boolean preFilter(final ServletRequest servletRequest, final ServletResponse servletResponse, final FilterChain filterChain)
                            ^
/home/jenkins/.jenkins/jobs/oxTrust_4.2.1/workspace/saml-openid-auth-client/src/main/java/org/gluu/oxauth/client/util/HttpServletRequestWrapperFilter.java:32: error: self-closing element not allowed
 * <p/>
   ^
/home/jenkins/.jenkins/jobs/oxTrust_4.2.1/workspace/saml-openid-auth-client/src/main/java/org/gluu/oxauth/client/validation/OAuthValidationFilter.java:107: warning: no @param for servletRequest
    protected final boolean preFilter(final ServletRequest servletRequest, final ServletResponse servletResponse,
                            ^
/home/jenkins/.jenkins/jobs/oxTrust_4.2.1/workspace/saml-openid-auth-client/src/main/java/org/gluu/oxauth/client/validation/OAuthValidationFilter.java:107: warning: no @param for servletResponse
    protected final boolean preFilter(final ServletRequest servletRequest, final ServletResponse servletResponse,
                            ^
/home/jenkins/.jenkins/jobs/oxTrust_4.2.1/workspace/saml-openid-auth-client/src/main/java/org/gluu/oxauth/client/validation/OAuthValidationFilter.java:107: warning: no @param for filterChain
    protected final boolean preFilter(final ServletRequest servletRequest, final ServletResponse servletResponse,
                            ^
/home/jenkins/.jenkins/jobs/oxTrust_4.2.1/workspace/saml-openid-auth-client/src/main/java/org/gluu/oxauth/client/validation/OAuthValidationFilter.java:107: warning: no @return
    protected final boolean preFilter(final ServletRequest servletRequest, final ServletResponse servletResponse,
                            ^
/home/jenkins/.jenkins/jobs/oxTrust_4.2.1/workspace/saml-openid-auth-client/src/main/java/org/gluu/oxauth/client/validation/OAuthValidationFilter.java:107: warning: no @throws for java.io.IOException
    protected final boolean preFilter(final ServletRequest servletRequest, final ServletResponse servletResponse,
                            ^
/home/jenkins/.jenkins/jobs/oxTrust_4.2.1/workspace/saml-openid-auth-client/src/main/java/org/gluu/oxauth/client/validation/OAuthValidationFilter.java:107: warning: no @throws for javax.servlet.ServletException
    protected final boolean preFilter(final ServletRequest servletRequest, final ServletResponse servletResponse,
                            ^

Command line was: /usr/lib/jvm/java-1.8.0-openjdk-1.8.0.222.b10-0.el7_6.x86_64/jre/../bin/javadoc @options @packages

Refer to the generated Javadoc files in '/home/jenkins/.jenkins/jobs/oxTrust_4.2.1/workspace/saml-openid-auth-client/target/site/apidocs' dir.

	at org.apache.maven.plugins.javadoc.AbstractJavadocMojo.executeJavadocCommandLine(AbstractJavadocMojo.java:5298)
	at org.apache.maven.plugins.javadoc.AbstractJavadocMojo.executeReport(AbstractJavadocMojo.java:2134)
	at org.apache.maven.plugins.javadoc.JavadocReport.generate(JavadocReport.java:134)
	at org.apache.maven.plugins.javadoc.JavadocReport.doExecute(JavadocReport.java:329)
	at org.apache.maven.plugins.javadoc.AbstractJavadocMojo.execute(AbstractJavadocMojo.java:1912)
	at org.apache.maven.plugin.DefaultBuildPluginManager.executeMojo(DefaultBuildPluginManager.java:134)
	at org.apache.maven.lifecycle.internal.MojoExecutor.execute(MojoExecutor.java:207)
	at org.apache.maven.lifecycle.internal.MojoExecutor.execute(MojoExecutor.java:153)
	at org.apache.maven.lifecycle.internal.MojoExecutor.execute(MojoExecutor.java:145)
	at org.apache.maven.lifecycle.internal.LifecycleModuleBuilder.buildProject(LifecycleModuleBuilder.java:116)
	at org.apache.maven.lifecycle.internal.LifecycleModuleBuilder.buildProject(LifecycleModuleBuilder.java:80)
	at org.apache.maven.lifecycle.internal.builder.singlethreaded.SingleThreadedBuilder.build(SingleThreadedBuilder.java:51)
	at org.apache.maven.lifecycle.internal.LifecycleStarter.execute(LifecycleStarter.java:128)
	at org.apache.maven.DefaultMaven.doExecute(DefaultMaven.java:307)
	at org.apache.maven.DefaultMaven.doExecute(DefaultMaven.java:193)
	at org.apache.maven.DefaultMaven.execute(DefaultMaven.java:106)
	at org.apache.maven.cli.MavenCli.execute(MavenCli.java:863)
	at org.apache.maven.cli.MavenCli.doMain(MavenCli.java:288)
	at org.apache.maven.cli.MavenCli.main(MavenCli.java:199)
	at sun.reflect.NativeMethodAccessorImpl.invoke0(Native Method)
	at sun.reflect.NativeMethodAccessorImpl.invoke(NativeMethodAccessorImpl.java:62)
	at sun.reflect.DelegatingMethodAccessorImpl.invoke(DelegatingMethodAccessorImpl.java:43)
	at java.lang.reflect.Method.invoke(Method.java:498)
	at org.codehaus.plexus.classworlds.launcher.Launcher.launchEnhanced(Launcher.java:289)
	at org.codehaus.plexus.classworlds.launcher.Launcher.launch(Launcher.java:229)
	at org.codehaus.plexus.classworlds.launcher.Launcher.mainWithExitCode(Launcher.java:415)
	at org.codehaus.plexus.classworlds.launcher.Launcher.main(Launcher.java:356)
[INFO] 
[INFO] --- findbugs-maven-plugin:3.0.4:findbugs (default-cli) @ oxtrust-saml-openid-auth-client ---
[INFO] Fork Value is true
     [java] Warnings generated: 1
[INFO] Done FindBugs Analysis....
[INFO] 
[INFO] --- maven-site-plugin:2.1.1:site (default-site) @ oxtrust-saml-openid-auth-client ---
[INFO]                                                                         
[INFO] ------------------------------------------------------------------------
[INFO] Building OpenId authentication module for CAS 4.2.1.Final
[INFO] ------------------------------------------------------------------------
[INFO] 
[INFO] --- maven-clean-plugin:2.5:clean (default-clean) @ oxtrust-cas-openid-auth-client ---
[INFO] Deleting /home/jenkins/.jenkins/jobs/oxTrust_4.2.1/workspace/cas-openid-auth-client/target
[INFO] 
[INFO] --- maven-resources-plugin:2.6:resources (default-resources) @ oxtrust-cas-openid-auth-client ---
[INFO] Using 'UTF-8' encoding to copy filtered resources.
[INFO] skip non existing resourceDirectory /home/jenkins/.jenkins/jobs/oxTrust_4.2.1/workspace/cas-openid-auth-client/src/main/resources
[INFO] 
[INFO] --- maven-compiler-plugin:2.3.2:compile (default-compile) @ oxtrust-cas-openid-auth-client ---
[INFO] Compiling 8 source files to /home/jenkins/.jenkins/jobs/oxTrust_4.2.1/workspace/cas-openid-auth-client/target/classes
[INFO] 
[INFO] --- maven-resources-plugin:2.6:resources (default-resources) @ oxtrust-cas-openid-auth-client ---
[INFO] Using 'UTF-8' encoding to copy filtered resources.
[INFO] skip non existing resourceDirectory /home/jenkins/.jenkins/jobs/oxTrust_4.2.1/workspace/cas-openid-auth-client/src/main/resources
[INFO] 
[INFO] --- maven-compiler-plugin:2.3.2:compile (default-compile) @ oxtrust-cas-openid-auth-client ---
[INFO] Nothing to compile - all classes are up to date
[INFO] 
[INFO] --- maven-resources-plugin:2.6:testResources (default-testResources) @ oxtrust-cas-openid-auth-client ---
[INFO] Using 'UTF-8' encoding to copy filtered resources.
[INFO] skip non existing resourceDirectory /home/jenkins/.jenkins/jobs/oxTrust_4.2.1/workspace/cas-openid-auth-client/src/test/resources
[INFO] 
[INFO] --- maven-compiler-plugin:2.3.2:testCompile (default-testCompile) @ oxtrust-cas-openid-auth-client ---
[INFO] Compiling 1 source file to /home/jenkins/.jenkins/jobs/oxTrust_4.2.1/workspace/cas-openid-auth-client/target/test-classes
[INFO] 
[INFO] --- maven-surefire-plugin:2.19.1:test (default-test) @ oxtrust-cas-openid-auth-client ---

-------------------------------------------------------
 T E S T S
-------------------------------------------------------

Results :

Tests run: 0, Failures: 0, Errors: 0, Skipped: 0

[INFO] 
[INFO] --- maven-jar-plugin:2.4:jar (default-jar) @ oxtrust-cas-openid-auth-client ---
[INFO] Building jar: /home/jenkins/.jenkins/jobs/oxTrust_4.2.1/workspace/cas-openid-auth-client/target/oxtrust-cas-openid-auth-client-4.2.1.Final.jar
[INFO] 
[INFO] --- maven-jar-plugin:2.4:test-jar (default) @ oxtrust-cas-openid-auth-client ---
[INFO] Building jar: /home/jenkins/.jenkins/jobs/oxTrust_4.2.1/workspace/cas-openid-auth-client/target/oxtrust-cas-openid-auth-client-4.2.1.Final-tests.jar
[INFO] 
[INFO] --- maven-install-plugin:2.3.1:install (default-install) @ oxtrust-cas-openid-auth-client ---
[INFO] Installing /home/jenkins/.jenkins/jobs/oxTrust_4.2.1/workspace/cas-openid-auth-client/target/oxtrust-cas-openid-auth-client-4.2.1.Final.jar to /var/www/html/maven/org/gluu/oxtrust-cas-openid-auth-client/4.2.1.Final/oxtrust-cas-openid-auth-client-4.2.1.Final.jar
[INFO] Installing /home/jenkins/.jenkins/jobs/oxTrust_4.2.1/workspace/cas-openid-auth-client/pom.xml to /var/www/html/maven/org/gluu/oxtrust-cas-openid-auth-client/4.2.1.Final/oxtrust-cas-openid-auth-client-4.2.1.Final.pom
[INFO] Installing /home/jenkins/.jenkins/jobs/oxTrust_4.2.1/workspace/cas-openid-auth-client/target/oxtrust-cas-openid-auth-client-4.2.1.Final-tests.jar to /var/www/html/maven/org/gluu/oxtrust-cas-openid-auth-client/4.2.1.Final/oxtrust-cas-openid-auth-client-4.2.1.Final-tests.jar
[INFO] 
[INFO] >>> maven-javadoc-plugin:3.0.1:javadoc (default-cli) > generate-sources @ oxtrust-cas-openid-auth-client >>>
[INFO] 
[INFO] <<< maven-javadoc-plugin:3.0.1:javadoc (default-cli) < generate-sources @ oxtrust-cas-openid-auth-client <<<
[INFO] 
[INFO] --- maven-javadoc-plugin:3.0.1:javadoc (default-cli) @ oxtrust-cas-openid-auth-client ---
[INFO] 
Loading source files for package org.gluu.oxauth.cas.auth.client...
Loading source files for package org.gluu.oxauth.cas.auth.conf...
Loading source files for package org.gluu.oxauth.cas.auth.handler...
Loading source files for package org.gluu.oxauth.cas.auth.login.flow...
Loading source files for package org.gluu.oxauth.cas.auth.principal...
Constructing Javadoc information...
Standard Doclet version 1.8.0_222
Building tree for all the packages and classes...
Generating /home/jenkins/.jenkins/jobs/oxTrust_4.2.1/workspace/cas-openid-auth-client/target/site/apidocs/org/gluu/oxauth/cas/auth/client/AuthClient.html...
Generating /home/jenkins/.jenkins/jobs/oxTrust_4.2.1/workspace/cas-openid-auth-client/target/site/apidocs/org/gluu/oxauth/cas/auth/conf/CasAppConfiguration.html...
Generating /home/jenkins/.jenkins/jobs/oxTrust_4.2.1/workspace/cas-openid-auth-client/target/site/apidocs/org/gluu/oxauth/cas/auth/conf/CasConfigurationFactory.html...
Generating /home/jenkins/.jenkins/jobs/oxTrust_4.2.1/workspace/cas-openid-auth-client/target/site/apidocs/org/gluu/oxauth/cas/auth/conf/CasLdapAppConfiguration.html...
Generating /home/jenkins/.jenkins/jobs/oxTrust_4.2.1/workspace/cas-openid-auth-client/target/site/apidocs/org/gluu/oxauth/cas/auth/handler/ClientAuthenticationHandler.html...
Generating /home/jenkins/.jenkins/jobs/oxTrust_4.2.1/workspace/cas-openid-auth-client/target/site/apidocs/org/gluu/oxauth/cas/auth/handler/ClientAuthenticationMetaDataPopulator.html...
Generating /home/jenkins/.jenkins/jobs/oxTrust_4.2.1/workspace/cas-openid-auth-client/target/site/apidocs/org/gluu/oxauth/cas/auth/login/flow/ClientAction.html...
Generating /home/jenkins/.jenkins/jobs/oxTrust_4.2.1/workspace/cas-openid-auth-client/target/site/apidocs/org/gluu/oxauth/cas/auth/principal/ClientCredential.html...
Generating /home/jenkins/.jenkins/jobs/oxTrust_4.2.1/workspace/cas-openid-auth-client/target/site/apidocs/overview-frame.html...
Generating /home/jenkins/.jenkins/jobs/oxTrust_4.2.1/workspace/cas-openid-auth-client/target/site/apidocs/org/gluu/oxauth/cas/auth/client/package-frame.html...
Generating /home/jenkins/.jenkins/jobs/oxTrust_4.2.1/workspace/cas-openid-auth-client/target/site/apidocs/org/gluu/oxauth/cas/auth/client/package-summary.html...
Generating /home/jenkins/.jenkins/jobs/oxTrust_4.2.1/workspace/cas-openid-auth-client/target/site/apidocs/org/gluu/oxauth/cas/auth/client/package-tree.html...
Generating /home/jenkins/.jenkins/jobs/oxTrust_4.2.1/workspace/cas-openid-auth-client/target/site/apidocs/org/gluu/oxauth/cas/auth/conf/package-frame.html...
Generating /home/jenkins/.jenkins/jobs/oxTrust_4.2.1/workspace/cas-openid-auth-client/target/site/apidocs/org/gluu/oxauth/cas/auth/conf/package-summary.html...
Generating /home/jenkins/.jenkins/jobs/oxTrust_4.2.1/workspace/cas-openid-auth-client/target/site/apidocs/org/gluu/oxauth/cas/auth/conf/package-tree.html...
Generating /home/jenkins/.jenkins/jobs/oxTrust_4.2.1/workspace/cas-openid-auth-client/target/site/apidocs/org/gluu/oxauth/cas/auth/handler/package-frame.html...
Generating /home/jenkins/.jenkins/jobs/oxTrust_4.2.1/workspace/cas-openid-auth-client/target/site/apidocs/org/gluu/oxauth/cas/auth/handler/package-summary.html...
Generating /home/jenkins/.jenkins/jobs/oxTrust_4.2.1/workspace/cas-openid-auth-client/target/site/apidocs/org/gluu/oxauth/cas/auth/handler/package-tree.html...
Generating /home/jenkins/.jenkins/jobs/oxTrust_4.2.1/workspace/cas-openid-auth-client/target/site/apidocs/org/gluu/oxauth/cas/auth/login/flow/package-frame.html...
Generating /home/jenkins/.jenkins/jobs/oxTrust_4.2.1/workspace/cas-openid-auth-client/target/site/apidocs/org/gluu/oxauth/cas/auth/login/flow/package-summary.html...
Generating /home/jenkins/.jenkins/jobs/oxTrust_4.2.1/workspace/cas-openid-auth-client/target/site/apidocs/org/gluu/oxauth/cas/auth/login/flow/package-tree.html...
Generating /home/jenkins/.jenkins/jobs/oxTrust_4.2.1/workspace/cas-openid-auth-client/target/site/apidocs/org/gluu/oxauth/cas/auth/principal/package-frame.html...
Generating /home/jenkins/.jenkins/jobs/oxTrust_4.2.1/workspace/cas-openid-auth-client/target/site/apidocs/org/gluu/oxauth/cas/auth/principal/package-summary.html...
Generating /home/jenkins/.jenkins/jobs/oxTrust_4.2.1/workspace/cas-openid-auth-client/target/site/apidocs/org/gluu/oxauth/cas/auth/principal/package-tree.html...
Generating /home/jenkins/.jenkins/jobs/oxTrust_4.2.1/workspace/cas-openid-auth-client/target/site/apidocs/constant-values.html...
Generating /home/jenkins/.jenkins/jobs/oxTrust_4.2.1/workspace/cas-openid-auth-client/target/site/apidocs/serialized-form.html...
Generating /home/jenkins/.jenkins/jobs/oxTrust_4.2.1/workspace/cas-openid-auth-client/target/site/apidocs/org/gluu/oxauth/cas/auth/client/class-use/AuthClient.html...
Generating /home/jenkins/.jenkins/jobs/oxTrust_4.2.1/workspace/cas-openid-auth-client/target/site/apidocs/org/gluu/oxauth/cas/auth/conf/class-use/CasLdapAppConfiguration.html...
Generating /home/jenkins/.jenkins/jobs/oxTrust_4.2.1/workspace/cas-openid-auth-client/target/site/apidocs/org/gluu/oxauth/cas/auth/conf/class-use/CasConfigurationFactory.html...
Generating /home/jenkins/.jenkins/jobs/oxTrust_4.2.1/workspace/cas-openid-auth-client/target/site/apidocs/org/gluu/oxauth/cas/auth/conf/class-use/CasAppConfiguration.html...
Generating /home/jenkins/.jenkins/jobs/oxTrust_4.2.1/workspace/cas-openid-auth-client/target/site/apidocs/org/gluu/oxauth/cas/auth/handler/class-use/ClientAuthenticationMetaDataPopulator.html...
Generating /home/jenkins/.jenkins/jobs/oxTrust_4.2.1/workspace/cas-openid-auth-client/target/site/apidocs/org/gluu/oxauth/cas/auth/handler/class-use/ClientAuthenticationHandler.html...
Generating /home/jenkins/.jenkins/jobs/oxTrust_4.2.1/workspace/cas-openid-auth-client/target/site/apidocs/org/gluu/oxauth/cas/auth/login/flow/class-use/ClientAction.html...
Generating /home/jenkins/.jenkins/jobs/oxTrust_4.2.1/workspace/cas-openid-auth-client/target/site/apidocs/org/gluu/oxauth/cas/auth/principal/class-use/ClientCredential.html...
Generating /home/jenkins/.jenkins/jobs/oxTrust_4.2.1/workspace/cas-openid-auth-client/target/site/apidocs/org/gluu/oxauth/cas/auth/client/package-use.html...
Generating /home/jenkins/.jenkins/jobs/oxTrust_4.2.1/workspace/cas-openid-auth-client/target/site/apidocs/org/gluu/oxauth/cas/auth/conf/package-use.html...
Generating /home/jenkins/.jenkins/jobs/oxTrust_4.2.1/workspace/cas-openid-auth-client/target/site/apidocs/org/gluu/oxauth/cas/auth/handler/package-use.html...
Generating /home/jenkins/.jenkins/jobs/oxTrust_4.2.1/workspace/cas-openid-auth-client/target/site/apidocs/org/gluu/oxauth/cas/auth/login/flow/package-use.html...
Generating /home/jenkins/.jenkins/jobs/oxTrust_4.2.1/workspace/cas-openid-auth-client/target/site/apidocs/org/gluu/oxauth/cas/auth/principal/package-use.html...
Building index for all the packages and classes...
Generating /home/jenkins/.jenkins/jobs/oxTrust_4.2.1/workspace/cas-openid-auth-client/target/site/apidocs/overview-tree.html...
Generating /home/jenkins/.jenkins/jobs/oxTrust_4.2.1/workspace/cas-openid-auth-client/target/site/apidocs/index-all.html...
Generating /home/jenkins/.jenkins/jobs/oxTrust_4.2.1/workspace/cas-openid-auth-client/target/site/apidocs/deprecated-list.html...
Building index for all classes...
Generating /home/jenkins/.jenkins/jobs/oxTrust_4.2.1/workspace/cas-openid-auth-client/target/site/apidocs/allclasses-frame.html...
Generating /home/jenkins/.jenkins/jobs/oxTrust_4.2.1/workspace/cas-openid-auth-client/target/site/apidocs/allclasses-noframe.html...
Generating /home/jenkins/.jenkins/jobs/oxTrust_4.2.1/workspace/cas-openid-auth-client/target/site/apidocs/index.html...
Generating /home/jenkins/.jenkins/jobs/oxTrust_4.2.1/workspace/cas-openid-auth-client/target/site/apidocs/overview-summary.html...
Generating /home/jenkins/.jenkins/jobs/oxTrust_4.2.1/workspace/cas-openid-auth-client/target/site/apidocs/help-doc.html...
6 errors
2 warnings
[ERROR] Error while creating javadoc report: 
Exit code: 1 - /home/jenkins/.jenkins/jobs/oxTrust_4.2.1/workspace/cas-openid-auth-client/src/main/java/org/gluu/oxauth/cas/auth/handler/ClientAuthenticationHandler.java:46: error: unknown tag: InheritDoc
	 * {@InheritDoc}
	   ^
/home/jenkins/.jenkins/jobs/oxTrust_4.2.1/workspace/cas-openid-auth-client/src/main/java/org/gluu/oxauth/cas/auth/handler/ClientAuthenticationHandler.java:54: error: unknown tag: InheritDoc
	 * {@InheritDoc}
	   ^
/home/jenkins/.jenkins/jobs/oxTrust_4.2.1/workspace/cas-openid-auth-client/src/main/java/org/gluu/oxauth/cas/auth/handler/ClientAuthenticationMetaDataPopulator.java:27: error: unknown tag: InheritDoc
	 * {@InheritDoc}
	   ^
/home/jenkins/.jenkins/jobs/oxTrust_4.2.1/workspace/cas-openid-auth-client/src/main/java/org/gluu/oxauth/cas/auth/login/flow/ClientAction.java:66: error: unknown tag: InheritDoc
	 * {@InheritDoc}
	   ^
/home/jenkins/.jenkins/jobs/oxTrust_4.2.1/workspace/cas-openid-auth-client/src/main/java/org/gluu/oxauth/cas/auth/login/flow/ClientAction.java:55: error: @param name not found
	 * @param theCentralAuthenticationService
	          ^
/home/jenkins/.jenkins/jobs/oxTrust_4.2.1/workspace/cas-openid-auth-client/src/main/java/org/gluu/oxauth/cas/auth/login/flow/ClientAction.java:57: error: @param name not found
	 * @param theClients
	          ^
/home/jenkins/.jenkins/jobs/oxTrust_4.2.1/workspace/cas-openid-auth-client/src/main/java/org/gluu/oxauth/cas/auth/login/flow/ClientAction.java:60: warning: no @param for client
	public ClientAction(final AuthClient client, final CentralAuthenticationService centralAuthenticationService) {
	       ^
/home/jenkins/.jenkins/jobs/oxTrust_4.2.1/workspace/cas-openid-auth-client/src/main/java/org/gluu/oxauth/cas/auth/login/flow/ClientAction.java:60: warning: no @param for centralAuthenticationService
	public ClientAction(final AuthClient client, final CentralAuthenticationService centralAuthenticationService) {
	       ^

Command line was: /usr/lib/jvm/java-1.8.0-openjdk-1.8.0.222.b10-0.el7_6.x86_64/jre/../bin/javadoc @options @packages

Refer to the generated Javadoc files in '/home/jenkins/.jenkins/jobs/oxTrust_4.2.1/workspace/cas-openid-auth-client/target/site/apidocs' dir.

org.apache.maven.reporting.MavenReportException: 
Exit code: 1 - /home/jenkins/.jenkins/jobs/oxTrust_4.2.1/workspace/cas-openid-auth-client/src/main/java/org/gluu/oxauth/cas/auth/handler/ClientAuthenticationHandler.java:46: error: unknown tag: InheritDoc
	 * {@InheritDoc}
	   ^
/home/jenkins/.jenkins/jobs/oxTrust_4.2.1/workspace/cas-openid-auth-client/src/main/java/org/gluu/oxauth/cas/auth/handler/ClientAuthenticationHandler.java:54: error: unknown tag: InheritDoc
	 * {@InheritDoc}
	   ^
/home/jenkins/.jenkins/jobs/oxTrust_4.2.1/workspace/cas-openid-auth-client/src/main/java/org/gluu/oxauth/cas/auth/handler/ClientAuthenticationMetaDataPopulator.java:27: error: unknown tag: InheritDoc
	 * {@InheritDoc}
	   ^
/home/jenkins/.jenkins/jobs/oxTrust_4.2.1/workspace/cas-openid-auth-client/src/main/java/org/gluu/oxauth/cas/auth/login/flow/ClientAction.java:66: error: unknown tag: InheritDoc
	 * {@InheritDoc}
	   ^
/home/jenkins/.jenkins/jobs/oxTrust_4.2.1/workspace/cas-openid-auth-client/src/main/java/org/gluu/oxauth/cas/auth/login/flow/ClientAction.java:55: error: @param name not found
	 * @param theCentralAuthenticationService
	          ^
/home/jenkins/.jenkins/jobs/oxTrust_4.2.1/workspace/cas-openid-auth-client/src/main/java/org/gluu/oxauth/cas/auth/login/flow/ClientAction.java:57: error: @param name not found
	 * @param theClients
	          ^
/home/jenkins/.jenkins/jobs/oxTrust_4.2.1/workspace/cas-openid-auth-client/src/main/java/org/gluu/oxauth/cas/auth/login/flow/ClientAction.java:60: warning: no @param for client
	public ClientAction(final AuthClient client, final CentralAuthenticationService centralAuthenticationService) {
	       ^
/home/jenkins/.jenkins/jobs/oxTrust_4.2.1/workspace/cas-openid-auth-client/src/main/java/org/gluu/oxauth/cas/auth/login/flow/ClientAction.java:60: warning: no @param for centralAuthenticationService
	public ClientAction(final AuthClient client, final CentralAuthenticationService centralAuthenticationService) {
	       ^

Command line was: /usr/lib/jvm/java-1.8.0-openjdk-1.8.0.222.b10-0.el7_6.x86_64/jre/../bin/javadoc @options @packages

Refer to the generated Javadoc files in '/home/jenkins/.jenkins/jobs/oxTrust_4.2.1/workspace/cas-openid-auth-client/target/site/apidocs' dir.

	at org.apache.maven.plugins.javadoc.AbstractJavadocMojo.executeJavadocCommandLine(AbstractJavadocMojo.java:5298)
	at org.apache.maven.plugins.javadoc.AbstractJavadocMojo.executeReport(AbstractJavadocMojo.java:2134)
	at org.apache.maven.plugins.javadoc.JavadocReport.generate(JavadocReport.java:134)
	at org.apache.maven.plugins.javadoc.JavadocReport.doExecute(JavadocReport.java:329)
	at org.apache.maven.plugins.javadoc.AbstractJavadocMojo.execute(AbstractJavadocMojo.java:1912)
	at org.apache.maven.plugin.DefaultBuildPluginManager.executeMojo(DefaultBuildPluginManager.java:134)
	at org.apache.maven.lifecycle.internal.MojoExecutor.execute(MojoExecutor.java:207)
	at org.apache.maven.lifecycle.internal.MojoExecutor.execute(MojoExecutor.java:153)
	at org.apache.maven.lifecycle.internal.MojoExecutor.execute(MojoExecutor.java:145)
	at org.apache.maven.lifecycle.internal.LifecycleModuleBuilder.buildProject(LifecycleModuleBuilder.java:116)
	at org.apache.maven.lifecycle.internal.LifecycleModuleBuilder.buildProject(LifecycleModuleBuilder.java:80)
	at org.apache.maven.lifecycle.internal.builder.singlethreaded.SingleThreadedBuilder.build(SingleThreadedBuilder.java:51)
	at org.apache.maven.lifecycle.internal.LifecycleStarter.execute(LifecycleStarter.java:128)
	at org.apache.maven.DefaultMaven.doExecute(DefaultMaven.java:307)
	at org.apache.maven.DefaultMaven.doExecute(DefaultMaven.java:193)
	at org.apache.maven.DefaultMaven.execute(DefaultMaven.java:106)
	at org.apache.maven.cli.MavenCli.execute(MavenCli.java:863)
	at org.apache.maven.cli.MavenCli.doMain(MavenCli.java:288)
	at org.apache.maven.cli.MavenCli.main(MavenCli.java:199)
	at sun.reflect.NativeMethodAccessorImpl.invoke0(Native Method)
	at sun.reflect.NativeMethodAccessorImpl.invoke(NativeMethodAccessorImpl.java:62)
	at sun.reflect.DelegatingMethodAccessorImpl.invoke(DelegatingMethodAccessorImpl.java:43)
	at java.lang.reflect.Method.invoke(Method.java:498)
	at org.codehaus.plexus.classworlds.launcher.Launcher.launchEnhanced(Launcher.java:289)
	at org.codehaus.plexus.classworlds.launcher.Launcher.launch(Launcher.java:229)
	at org.codehaus.plexus.classworlds.launcher.Launcher.mainWithExitCode(Launcher.java:415)
	at org.codehaus.plexus.classworlds.launcher.Launcher.main(Launcher.java:356)
[INFO] 
[INFO] --- findbugs-maven-plugin:3.0.4:findbugs (default-cli) @ oxtrust-cas-openid-auth-client ---
[INFO] Fork Value is true
[INFO] Done FindBugs Analysis....
[INFO] 
[INFO] --- maven-site-plugin:2.1.1:site (default-site) @ oxtrust-cas-openid-auth-client ---
[INFO]                                                                         
[INFO] ------------------------------------------------------------------------
[INFO] Building oxtrust-qa 4.2.1.Final
[INFO] ------------------------------------------------------------------------
[INFO] 
[INFO] --- maven-clean-plugin:2.5:clean (default-clean) @ oxtrust-qa ---
[INFO] Deleting /home/jenkins/.jenkins/jobs/oxTrust_4.2.1/workspace/oxtrust-qa/target
[INFO] 
[INFO] --- maven-resources-plugin:2.6:resources (default-resources) @ oxtrust-qa ---
[INFO] Using 'UTF-8' encoding to copy filtered resources.
[INFO] Copying 3 resources
[INFO] 
[INFO] --- maven-compiler-plugin:3.1:compile (default-compile) @ oxtrust-qa ---
[INFO] No sources to compile
[INFO] 
[INFO] --- maven-resources-plugin:2.6:resources (default-resources) @ oxtrust-qa ---
[INFO] Using 'UTF-8' encoding to copy filtered resources.
[INFO] Copying 3 resources
[INFO] 
[INFO] --- maven-compiler-plugin:3.1:compile (default-compile) @ oxtrust-qa ---
[INFO] No sources to compile
[INFO] 
[INFO] --- maven-resources-plugin:2.6:testResources (default-testResources) @ oxtrust-qa ---
[INFO] Using 'UTF-8' encoding to copy filtered resources.
[INFO] Copying 2 resources
[INFO] 
[INFO] --- maven-compiler-plugin:3.1:testCompile (default-testCompile) @ oxtrust-qa ---
[INFO] Changes detected - recompiling the module!
[INFO] Compiling 83 source files to /home/jenkins/.jenkins/jobs/oxTrust_4.2.1/workspace/oxtrust-qa/target/test-classes
[INFO] 
[INFO] --- maven-surefire-plugin:2.12.4:test (default-test) @ oxtrust-qa ---
[INFO] Tests are skipped.
[INFO] 
[INFO] --- maven-jar-plugin:2.4:jar (default-jar) @ oxtrust-qa ---
[INFO] Building jar: /home/jenkins/.jenkins/jobs/oxTrust_4.2.1/workspace/oxtrust-qa/target/oxtrust-qa.jar
[INFO] 
[INFO] --- maven-install-plugin:2.4:install (default-install) @ oxtrust-qa ---
[INFO] Installing /home/jenkins/.jenkins/jobs/oxTrust_4.2.1/workspace/oxtrust-qa/target/oxtrust-qa.jar to /var/www/html/maven/org/gluu/oxtrust-qa/4.2.1.Final/oxtrust-qa-4.2.1.Final.jar
[INFO] Installing /home/jenkins/.jenkins/jobs/oxTrust_4.2.1/workspace/oxtrust-qa/pom.xml to /var/www/html/maven/org/gluu/oxtrust-qa/4.2.1.Final/oxtrust-qa-4.2.1.Final.pom
[INFO] 
[INFO] >>> maven-javadoc-plugin:3.0.1:javadoc (default-cli) > generate-sources @ oxtrust-qa >>>
[INFO] 
[INFO] <<< maven-javadoc-plugin:3.0.1:javadoc (default-cli) < generate-sources @ oxtrust-qa <<<
[INFO] 
[INFO] --- maven-javadoc-plugin:3.0.1:javadoc (default-cli) @ oxtrust-qa ---
[INFO] 
[INFO] --- findbugs-maven-plugin:3.0.5:findbugs (default-cli) @ oxtrust-qa ---
[INFO] 
[INFO] --- maven-site-plugin:3.7.1:site (default-site) @ oxtrust-qa ---
[INFO] configuring report plugin org.apache.maven.plugins:maven-project-info-reports-plugin:3.0.0
[INFO] 15 reports detected for maven-project-info-reports-plugin:3.0.0: ci-management, dependencies, dependency-info, dependency-management, distribution-management, index, issue-management, licenses, mailing-lists, modules, plugin-management, plugins, scm, summary, team
[INFO] Rendering site with default locale English (en)
[INFO] Relativizing decoration links with respect to localized project URL: http://maven.apache.org
[INFO] Rendering content with org.apache.maven.skins:maven-default-skin:jar:1.2 skin.
[INFO] Generating "Dependencies" report         --- maven-project-info-reports-plugin:3.0.0:dependencies
[INFO] Generating "Dependency Information" report --- maven-project-info-reports-plugin:3.0.0:dependency-info
[INFO] Generating "About" report                --- maven-project-info-reports-plugin:3.0.0:index
[INFO] Generating "Plugin Management" report    --- maven-project-info-reports-plugin:3.0.0:plugin-management
[INFO] Generating "Plugins" report              --- maven-project-info-reports-plugin:3.0.0:plugins
[INFO] Generating "Summary" report              --- maven-project-info-reports-plugin:3.0.0:summary
[INFO]                                                                         
[INFO] ------------------------------------------------------------------------
[INFO] Building oxTrust Server Test 4.2.1.Final
[INFO] ------------------------------------------------------------------------
[INFO] 
[INFO] --- maven-clean-plugin:2.5:clean (default-clean) @ oxtrust-server-test ---
[INFO] Deleting /home/jenkins/.jenkins/jobs/oxTrust_4.2.1/workspace/server-test/target
[INFO] 
[INFO] --- maven-resources-plugin:2.6:resources (default-resources) @ oxtrust-server-test ---
[INFO] Using 'UTF-8' encoding to copy filtered resources.
[INFO] skip non existing resourceDirectory /home/jenkins/.jenkins/jobs/oxTrust_4.2.1/workspace/server-test/src/main/resources
[INFO] 
[INFO] --- maven-compiler-plugin:2.3.2:compile (default-compile) @ oxtrust-server-test ---
[INFO] No sources to compile
[INFO] 
[INFO] --- maven-resources-plugin:2.6:resources (default-resources) @ oxtrust-server-test ---
[INFO] Using 'UTF-8' encoding to copy filtered resources.
[INFO] skip non existing resourceDirectory /home/jenkins/.jenkins/jobs/oxTrust_4.2.1/workspace/server-test/src/main/resources
[INFO] 
[INFO] --- maven-compiler-plugin:2.3.2:compile (default-compile) @ oxtrust-server-test ---
[INFO] No sources to compile
[INFO] 
[INFO] --- maven-resources-plugin:2.6:testResources (default-testResources) @ oxtrust-server-test ---
[INFO] Using 'UTF-8' encoding to copy filtered resources.
[INFO] skip non existing resourceDirectory /home/jenkins/.jenkins/jobs/oxTrust_4.2.1/workspace/server-test/src/test/resources
[INFO] 
[INFO] --- maven-compiler-plugin:2.3.2:testCompile (default-testCompile) @ oxtrust-server-test ---
[INFO] No sources to compile
[INFO] 
[INFO] --- maven-surefire-plugin:2.19.1:test (default-test) @ oxtrust-server-test ---
[INFO] No tests to run.
[INFO] 
[INFO] --- maven-war-plugin:2.3:exploded (prepare-war) @ oxtrust-server-test ---
[INFO] Exploding webapp
[INFO] Assembling webapp [oxtrust-server-test] in [/home/jenkins/.jenkins/jobs/oxTrust_4.2.1/workspace/server-test/target/oxtrust-server-test]
[INFO] Processing war project
[INFO] Processing overlay [ id org.gluu:oxtrust-server]
[INFO] Webapp assembled in [12885 msecs]
[INFO] 
[INFO] --- maven-war-plugin:2.3:war (default-war) @ oxtrust-server-test ---
[INFO] Packaging webapp
[INFO] Assembling webapp [oxtrust-server-test] in [/home/jenkins/.jenkins/jobs/oxTrust_4.2.1/workspace/server-test/target/oxtrust-server-test]
[INFO] Processing war project
[INFO] Processing overlay [ id org.gluu:oxtrust-server]
[INFO] Webapp assembled in [771 msecs]
[INFO] Building war: /home/jenkins/.jenkins/jobs/oxTrust_4.2.1/workspace/server-test/target/oxtrust-server-test.war
[INFO] 
[INFO] --- maven-install-plugin:2.3.1:install (default-install) @ oxtrust-server-test ---
[INFO] Installing /home/jenkins/.jenkins/jobs/oxTrust_4.2.1/workspace/server-test/target/oxtrust-server-test.war to /var/www/html/maven/org/gluu/oxtrust-server-test/4.2.1.Final/oxtrust-server-test-4.2.1.Final.war
[INFO] Installing /home/jenkins/.jenkins/jobs/oxTrust_4.2.1/workspace/server-test/pom.xml to /var/www/html/maven/org/gluu/oxtrust-server-test/4.2.1.Final/oxtrust-server-test-4.2.1.Final.pom
[INFO] 
[INFO] >>> maven-javadoc-plugin:3.0.1:javadoc (default-cli) > generate-sources @ oxtrust-server-test >>>
[INFO] 
[INFO] <<< maven-javadoc-plugin:3.0.1:javadoc (default-cli) < generate-sources @ oxtrust-server-test <<<
[INFO] 
[INFO] --- maven-javadoc-plugin:3.0.1:javadoc (default-cli) @ oxtrust-server-test ---
[INFO] 
[INFO] --- findbugs-maven-plugin:3.0.4:findbugs (default-cli) @ oxtrust-server-test ---
[INFO] 
[INFO] --- maven-site-plugin:2.1.1:site (default-site) @ oxtrust-server-test ---
[INFO]                                                                         
[INFO] ------------------------------------------------------------------------
[INFO] Building API Server 4.2.1.Final
[INFO] ------------------------------------------------------------------------
[INFO] 
[INFO] --- maven-clean-plugin:2.5:clean (default-clean) @ oxtrust-api-server ---
[INFO] Deleting /home/jenkins/.jenkins/jobs/oxTrust_4.2.1/workspace/api-server/target
[INFO] 
[INFO] --- maven-resources-plugin:2.6:resources (default-resources) @ oxtrust-api-server ---
[INFO] Using 'UTF-8' encoding to copy filtered resources.
[INFO] Copying 1 resource
[INFO] 
[INFO] --- maven-compiler-plugin:2.3.2:compile (default-compile) @ oxtrust-api-server ---
[INFO] Compiling 52 source files to /home/jenkins/.jenkins/jobs/oxTrust_4.2.1/workspace/api-server/target/classes
[INFO] 
[INFO] --- swagger-maven-plugin:2.0.8:resolve (default) @ oxtrust-api-server ---
[INFO] Resolving OpenAPI specification..
[INFO] 
[INFO] --- maven-resources-plugin:2.6:resources (default-resources) @ oxtrust-api-server ---
[INFO] Using 'UTF-8' encoding to copy filtered resources.
[INFO] Copying 1 resource
[INFO] 
[INFO] --- maven-compiler-plugin:2.3.2:compile (default-compile) @ oxtrust-api-server ---
[INFO] Nothing to compile - all classes are up to date
[INFO] 
[INFO] --- swagger-maven-plugin:2.0.8:resolve (default) @ oxtrust-api-server ---
[INFO] Resolving OpenAPI specification..
[INFO] 
[INFO] --- maven-resources-plugin:2.6:testResources (default-testResources) @ oxtrust-api-server ---
[INFO] Using 'UTF-8' encoding to copy filtered resources.
[INFO] skip non existing resourceDirectory /home/jenkins/.jenkins/jobs/oxTrust_4.2.1/workspace/api-server/src/test/resources
[INFO] 
[INFO] --- maven-compiler-plugin:2.3.2:testCompile (default-testCompile) @ oxtrust-api-server ---
[INFO] Compiling 20 source files to /home/jenkins/.jenkins/jobs/oxTrust_4.2.1/workspace/api-server/target/test-classes
[INFO] -------------------------------------------------------------
[ERROR] COMPILATION ERROR : 
[INFO] -------------------------------------------------------------
[ERROR] /home/jenkins/.jenkins/jobs/oxTrust_4.2.1/workspace/api-server/src/test/java/org/api/server/ClientWebResourceTest.java:[130,8] error: cannot find symbol
[INFO] 1 error
[INFO] -------------------------------------------------------------
[INFO] ------------------------------------------------------------------------
[INFO] Reactor Summary:
[INFO] 
[INFO] oxTrust ............................................ SUCCESS [  4.361 s]
[INFO] oxTrust static resources ........................... SUCCESS [  2.348 s]
[INFO] oxTrust configuration .............................. SUCCESS [  0.614 s]
[INFO] oxTrust Model library .............................. SUCCESS [ 25.998 s]
[INFO] oxTrust Client library ............................. SUCCESS [  0.238 s]
[INFO] oxTrust Service .................................... SUCCESS [ 29.440 s]
[INFO] OpenId authentication module ....................... SUCCESS [ 15.509 s]
[INFO] oxTrust Server ..................................... SUCCESS [02:42 min]
[INFO] OpenId authentication module for Saml .............. SUCCESS [ 20.752 s]
[INFO] OpenId authentication module for CAS ............... SUCCESS [ 19.178 s]
[INFO] oxtrust-qa ......................................... SUCCESS [ 24.303 s]
[INFO] oxTrust Server Test ................................ SUCCESS [ 16.443 s]
[INFO] API Server ......................................... FAILURE [ 17.971 s]
[INFO] ------------------------------------------------------------------------
[INFO] BUILD FAILURE
[INFO] ------------------------------------------------------------------------
[INFO] Total time: 05:41 min
[INFO] Finished at: 2020-09-23T09:15:56+00:00
[INFO] Final Memory: 264M/1655M
[INFO] ------------------------------------------------------------------------
[ERROR] Failed to execute goal org.apache.maven.plugins:maven-compiler-plugin:2.3.2:testCompile (default-testCompile) on project oxtrust-api-server: Compilation failure
[ERROR] /home/jenkins/.jenkins/jobs/oxTrust_4.2.1/workspace/api-server/src/test/java/org/api/server/ClientWebResourceTest.java:[130,8] error: cannot find symbol
[ERROR] -> [Help 1]
[ERROR] 
[ERROR] To see the full stack trace of the errors, re-run Maven with the -e switch.
[ERROR] Re-run Maven using the -X switch to enable full debug logging.
[ERROR] 
[ERROR] For more information about the errors and possible solutions, please read the following articles:
[ERROR] [Help 1] http://cwiki.apache.org/confluence/display/MAVEN/MojoFailureException
[ERROR] 
[ERROR] After correcting the problems, you can resume the build with the command
[ERROR]   mvn <goals> -rf :oxtrust-api-server
Build step 'Invoke top-level Maven targets' marked build as failure
[FINDBUGS] Skipping publisher since build result is FAILURE
Publishing Javadoc
TestNG Reports Processing: START
Looking for TestNG results report in workspace using pattern: **/testng-results.xml
Saving reports...
Processing '/home/jenkins/.jenkins/jobs/oxTrust_4.2.1/builds/2211/testng/testng-results.xml'
TestNG Reports Processing: FINISH
Sending e-mails to: support@gluu.org
[Boolean condition] checking [true] against [^(1|y|yes|t|true|on|run)$] (origin token: $DEPLOY_BUILD)
Run condition [Boolean condition] enabling perform for step [Builder to mark whether executed]
Finished: FAILURE