FailedConsole Output

Started by an SCM change
Running as SYSTEM
Building on master in workspace /home/jenkins/.jenkins/jobs/oxTrust_4.2.1/workspace
The recommended git tool is: NONE
No credentials specified
 > git rev-parse --is-inside-work-tree # timeout=10
Fetching changes from the remote Git repository
 > git config remote.origin.url https://github.com/GluuFederation/oxTrust # timeout=10
Fetching upstream changes from https://github.com/GluuFederation/oxTrust
 > git --version # timeout=10
 > git --version # 'git version 1.8.3.1'
 > git fetch --tags --progress https://github.com/GluuFederation/oxTrust +refs/heads/*:refs/remotes/origin/* # timeout=10
 > git rev-parse refs/remotes/origin/version_4.2.1^{commit} # timeout=10
 > git rev-parse refs/remotes/origin/origin/version_4.2.1^{commit} # timeout=10
Checking out Revision db9937b68d8950a99e44a6c5bb1b9f695f069f9e (refs/remotes/origin/version_4.2.1)
 > git config core.sparsecheckout # timeout=10
 > git checkout -f db9937b68d8950a99e44a6c5bb1b9f695f069f9e # timeout=10
Commit message: "Version 4.2.1.Final"
 > git rev-list --no-walk 96ac34479105db51f013c9da79f227b086b47b3f # timeout=10
Run condition [Boolean condition] enabling prebuild for step [Trigger/call builds on other projects]
[workspace] $ /bin/bash /opt/jetty/temp/jenkins3999583413300746078.sh
Cloning into 'oxHudsonProfiles'...
[workspace] $ /home/jenkins/.jenkins/tools/hudson.tasks.Maven_MavenInstallation/maven_3.3.9/bin/mvn -DDEPLOY_BUILD=true -DVERSION_NAME=version_4.2.1 -DPROFILE_NAME=ce-dev5.gluu.org -DDEVELOPMENT_BUILD=false -DMAVEN_SKIP_TESTS=false -Dpython.import.site=false -DPYTHON_HOME=/opt/jython -Dcfg=ce-dev5.gluu.org -Dmaven.test.skip=false -Ddevelopment-build=false -Dskip.qa.test=true clean compile install javadoc:javadoc findbugs:findbugs site
[INFO] Scanning for projects...
[WARNING] 
[WARNING] Some problems were encountered while building the effective model for org.gluu:oxtrust-model:jar:4.2.1.Final
[WARNING] 'dependencies.dependency.(groupId:artifactId:type:classifier)' must be unique: com.fasterxml.jackson.core:jackson-annotations:jar -> duplicate declaration of version (?) @ org.gluu:oxtrust-model:[unknown-version], /home/jenkins/.jenkins/jobs/oxTrust_4.2.1/workspace/model/pom.xml, line 85, column 15
[WARNING] 'dependencies.dependency.(groupId:artifactId:type:classifier)' must be unique: com.fasterxml.jackson.core:jackson-core:jar -> duplicate declaration of version (?) @ org.gluu:oxtrust-model:[unknown-version], /home/jenkins/.jenkins/jobs/oxTrust_4.2.1/workspace/model/pom.xml, line 89, column 15
[WARNING] 'dependencies.dependency.(groupId:artifactId:type:classifier)' must be unique: com.fasterxml.jackson.core:jackson-databind:jar -> duplicate declaration of version (?) @ org.gluu:oxtrust-model:[unknown-version], /home/jenkins/.jenkins/jobs/oxTrust_4.2.1/workspace/model/pom.xml, line 93, column 15
[WARNING] 
[WARNING] Some problems were encountered while building the effective model for org.gluu:oxtrust-service:jar:4.2.1.Final
[WARNING] 'build.plugins.plugin.version' for org.apache.maven.plugins:maven-javadoc-plugin is missing. @ org.gluu:oxtrust-service:[unknown-version], /home/jenkins/.jenkins/jobs/oxTrust_4.2.1/workspace/service/pom.xml, line 42, column 12
[WARNING] 
[WARNING] Some problems were encountered while building the effective model for org.gluu:oxtrust-server:war:4.2.1.Final
[WARNING] 'build.plugins.plugin.version' for org.apache.maven.plugins:maven-javadoc-plugin is missing. @ org.gluu:oxtrust-server:[unknown-version], /home/jenkins/.jenkins/jobs/oxTrust_4.2.1/workspace/server/pom.xml, line 69, column 12
[WARNING] 
[WARNING] Some problems were encountered while building the effective model for org.gluu:oxtrust-openid-auth-client:jar:4.2.1.Final
[WARNING] 'build.plugins.plugin.version' for org.apache.maven.plugins:maven-javadoc-plugin is missing. @ org.gluu:oxtrust-openid-auth-client:[unknown-version], /home/jenkins/.jenkins/jobs/oxTrust_4.2.1/workspace/openid-auth-client/pom.xml, line 22, column 21
[WARNING] 
[WARNING] Some problems were encountered while building the effective model for org.gluu:oxtrust-saml-openid-auth-client:jar:4.2.1.Final
[WARNING] 'build.plugins.plugin.version' for org.apache.maven.plugins:maven-javadoc-plugin is missing. @ org.gluu:oxtrust-saml-openid-auth-client:[unknown-version], /home/jenkins/.jenkins/jobs/oxTrust_4.2.1/workspace/saml-openid-auth-client/pom.xml, line 22, column 21
[WARNING] 
[WARNING] Some problems were encountered while building the effective model for org.gluu:oxtrust-cas-openid-auth-client:jar:4.2.1.Final
[WARNING] 'build.plugins.plugin.version' for org.apache.maven.plugins:maven-javadoc-plugin is missing. @ org.gluu:oxtrust-cas-openid-auth-client:[unknown-version], /home/jenkins/.jenkins/jobs/oxTrust_4.2.1/workspace/cas-openid-auth-client/pom.xml, line 27, column 12
[WARNING] 
[WARNING] Some problems were encountered while building the effective model for org.gluu:oxtrust-qa:jar:4.2.1.Final
[WARNING] 'build.plugins.plugin.version' for org.apache.maven.plugins:maven-compiler-plugin is missing. @ line 107, column 12
[WARNING] 'build.plugins.plugin.version' for org.apache.maven.plugins:maven-surefire-plugin is missing. @ line 90, column 12
[WARNING] 
[WARNING] It is highly recommended to fix these problems because they threaten the stability of your build.
[WARNING] 
[WARNING] For this reason, future Maven versions might no longer support building such malformed projects.
[WARNING] 
[INFO] ------------------------------------------------------------------------
[INFO] Reactor Build Order:
[INFO] 
[INFO] oxTrust
[INFO] oxTrust static resources
[INFO] oxTrust configuration
[INFO] oxTrust Model library
[INFO] oxTrust Client library
[INFO] oxTrust Service
[INFO] OpenId authentication module
[INFO] oxTrust Server
[INFO] OpenId authentication module for Saml
[INFO] OpenId authentication module for CAS
[INFO] oxtrust-qa
[INFO] oxTrust Server Test
[INFO] API Server
[INFO]                                                                         
[INFO] ------------------------------------------------------------------------
[INFO] Building oxTrust 4.2.1.Final
[INFO] ------------------------------------------------------------------------
[INFO] 
[INFO] --- maven-clean-plugin:2.5:clean (default-clean) @ oxtrust ---
[INFO] Deleting /home/jenkins/.jenkins/jobs/oxTrust_4.2.1/workspace/target
[INFO] 
[INFO] --- maven-install-plugin:2.3.1:install (default-install) @ oxtrust ---
[INFO] Installing /home/jenkins/.jenkins/jobs/oxTrust_4.2.1/workspace/pom.xml to /var/www/html/maven/org/gluu/oxtrust/4.2.1.Final/oxtrust-4.2.1.Final.pom
[INFO] 
[INFO] >>> maven-javadoc-plugin:3.0.1:javadoc (default-cli) > generate-sources @ oxtrust >>>
[INFO] 
[INFO] <<< maven-javadoc-plugin:3.0.1:javadoc (default-cli) < generate-sources @ oxtrust <<<
[INFO] 
[INFO] --- maven-javadoc-plugin:3.0.1:javadoc (default-cli) @ oxtrust ---
[INFO] 
[INFO] --- findbugs-maven-plugin:3.0.4:findbugs (default-cli) @ oxtrust ---
[INFO] 
[INFO] --- maven-site-plugin:2.1.1:site (default-site) @ oxtrust ---
[INFO]                                                                         
[INFO] ------------------------------------------------------------------------
[INFO] Building oxTrust static resources 4.2.1.Final
[INFO] ------------------------------------------------------------------------
[INFO] 
[INFO] --- maven-clean-plugin:2.5:clean (default-clean) @ oxtrust-static ---
[INFO] Deleting /home/jenkins/.jenkins/jobs/oxTrust_4.2.1/workspace/static/target
[INFO] 
[INFO] --- maven-resources-plugin:2.6:resources (default-resources) @ oxtrust-static ---
[INFO] Using 'UTF-8' encoding to copy filtered resources.
[INFO] Copying 337 resources
[INFO] 
[INFO] --- maven-compiler-plugin:2.3.2:compile (default-compile) @ oxtrust-static ---
[INFO] No sources to compile
[INFO] 
[INFO] --- maven-resources-plugin:2.6:resources (default-resources) @ oxtrust-static ---
[INFO] Using 'UTF-8' encoding to copy filtered resources.
[INFO] Copying 337 resources
[INFO] 
[INFO] --- maven-compiler-plugin:2.3.2:compile (default-compile) @ oxtrust-static ---
[INFO] No sources to compile
[INFO] 
[INFO] --- maven-resources-plugin:2.6:testResources (default-testResources) @ oxtrust-static ---
[INFO] Using 'UTF-8' encoding to copy filtered resources.
[INFO] skip non existing resourceDirectory /home/jenkins/.jenkins/jobs/oxTrust_4.2.1/workspace/static/src/test/resources
[INFO] 
[INFO] --- maven-compiler-plugin:2.3.2:testCompile (default-testCompile) @ oxtrust-static ---
[INFO] No sources to compile
[INFO] 
[INFO] --- maven-surefire-plugin:2.19.1:test (default-test) @ oxtrust-static ---
[INFO] No tests to run.
[INFO] 
[INFO] --- maven-jar-plugin:2.4:jar (default-jar) @ oxtrust-static ---
[INFO] Building jar: /home/jenkins/.jenkins/jobs/oxTrust_4.2.1/workspace/static/target/oxtrust-static-4.2.1.Final.jar
[INFO] 
[INFO] --- maven-jar-plugin:2.4:test-jar (default) @ oxtrust-static ---
[WARNING] JAR will be empty - no content was marked for inclusion!
[INFO] Building jar: /home/jenkins/.jenkins/jobs/oxTrust_4.2.1/workspace/static/target/oxtrust-static-4.2.1.Final-tests.jar
[INFO] 
[INFO] --- maven-install-plugin:2.3.1:install (default-install) @ oxtrust-static ---
[INFO] Installing /home/jenkins/.jenkins/jobs/oxTrust_4.2.1/workspace/static/target/oxtrust-static-4.2.1.Final.jar to /var/www/html/maven/org/gluu/oxtrust-static/4.2.1.Final/oxtrust-static-4.2.1.Final.jar
[INFO] Installing /home/jenkins/.jenkins/jobs/oxTrust_4.2.1/workspace/static/pom.xml to /var/www/html/maven/org/gluu/oxtrust-static/4.2.1.Final/oxtrust-static-4.2.1.Final.pom
[INFO] Installing /home/jenkins/.jenkins/jobs/oxTrust_4.2.1/workspace/static/target/oxtrust-static-4.2.1.Final-tests.jar to /var/www/html/maven/org/gluu/oxtrust-static/4.2.1.Final/oxtrust-static-4.2.1.Final-tests.jar
[INFO] 
[INFO] >>> maven-javadoc-plugin:3.0.1:javadoc (default-cli) > generate-sources @ oxtrust-static >>>
[INFO] 
[INFO] <<< maven-javadoc-plugin:3.0.1:javadoc (default-cli) < generate-sources @ oxtrust-static <<<
[INFO] 
[INFO] --- maven-javadoc-plugin:3.0.1:javadoc (default-cli) @ oxtrust-static ---
[INFO] 
[INFO] --- findbugs-maven-plugin:3.0.4:findbugs (default-cli) @ oxtrust-static ---
[INFO] 
[INFO] --- maven-site-plugin:2.1.1:site (default-site) @ oxtrust-static ---
[INFO]                                                                         
[INFO] ------------------------------------------------------------------------
[INFO] Building oxTrust configuration 4.2.1.Final
[INFO] ------------------------------------------------------------------------
[INFO] 
[INFO] --- maven-clean-plugin:2.5:clean (default-clean) @ oxtrust-configuration ---
[INFO] Deleting /home/jenkins/.jenkins/jobs/oxTrust_4.2.1/workspace/configuration/target
[INFO] 
[INFO] --- maven-resources-plugin:2.6:resources (default-resources) @ oxtrust-configuration ---
[INFO] Using 'UTF-8' encoding to copy filtered resources.
[INFO] Copying 3 resources
[INFO] Copying 31 resources
[INFO] 
[INFO] --- maven-compiler-plugin:2.3.2:compile (default-compile) @ oxtrust-configuration ---
[INFO] No sources to compile
[INFO] 
[INFO] --- maven-resources-plugin:2.6:resources (default-resources) @ oxtrust-configuration ---
[INFO] Using 'UTF-8' encoding to copy filtered resources.
[INFO] Copying 3 resources
[INFO] Copying 31 resources
[INFO] 
[INFO] --- maven-compiler-plugin:2.3.2:compile (default-compile) @ oxtrust-configuration ---
[INFO] No sources to compile
[INFO] 
[INFO] --- maven-resources-plugin:2.6:testResources (default-testResources) @ oxtrust-configuration ---
[INFO] Using 'UTF-8' encoding to copy filtered resources.
[INFO] skip non existing resourceDirectory /home/jenkins/.jenkins/jobs/oxTrust_4.2.1/workspace/configuration/src/test/resources
[INFO] 
[INFO] --- maven-compiler-plugin:2.3.2:testCompile (default-testCompile) @ oxtrust-configuration ---
[INFO] No sources to compile
[INFO] 
[INFO] --- maven-surefire-plugin:2.19.1:test (default-test) @ oxtrust-configuration ---
[INFO] No tests to run.
[INFO] 
[INFO] --- maven-jar-plugin:2.4:jar (default-jar) @ oxtrust-configuration ---
[INFO] Building jar: /home/jenkins/.jenkins/jobs/oxTrust_4.2.1/workspace/configuration/target/oxtrust-configuration-4.2.1.Final.jar
[INFO] 
[INFO] --- maven-jar-plugin:2.4:test-jar (default) @ oxtrust-configuration ---
[WARNING] JAR will be empty - no content was marked for inclusion!
[INFO] Building jar: /home/jenkins/.jenkins/jobs/oxTrust_4.2.1/workspace/configuration/target/oxtrust-configuration-4.2.1.Final-tests.jar
[INFO] 
[INFO] --- maven-install-plugin:2.3.1:install (default-install) @ oxtrust-configuration ---
[INFO] Installing /home/jenkins/.jenkins/jobs/oxTrust_4.2.1/workspace/configuration/target/oxtrust-configuration-4.2.1.Final.jar to /var/www/html/maven/org/gluu/oxtrust-configuration/4.2.1.Final/oxtrust-configuration-4.2.1.Final.jar
[INFO] Installing /home/jenkins/.jenkins/jobs/oxTrust_4.2.1/workspace/configuration/pom.xml to /var/www/html/maven/org/gluu/oxtrust-configuration/4.2.1.Final/oxtrust-configuration-4.2.1.Final.pom
[INFO] Installing /home/jenkins/.jenkins/jobs/oxTrust_4.2.1/workspace/configuration/target/oxtrust-configuration-4.2.1.Final-tests.jar to /var/www/html/maven/org/gluu/oxtrust-configuration/4.2.1.Final/oxtrust-configuration-4.2.1.Final-tests.jar
[INFO] 
[INFO] >>> maven-javadoc-plugin:3.0.1:javadoc (default-cli) > generate-sources @ oxtrust-configuration >>>
[INFO] 
[INFO] <<< maven-javadoc-plugin:3.0.1:javadoc (default-cli) < generate-sources @ oxtrust-configuration <<<
[INFO] 
[INFO] --- maven-javadoc-plugin:3.0.1:javadoc (default-cli) @ oxtrust-configuration ---
[INFO] 
[INFO] --- findbugs-maven-plugin:3.0.4:findbugs (default-cli) @ oxtrust-configuration ---
[INFO] 
[INFO] --- maven-site-plugin:2.1.1:site (default-site) @ oxtrust-configuration ---
[INFO]                                                                         
[INFO] ------------------------------------------------------------------------
[INFO] Building oxTrust Model library 4.2.1.Final
[INFO] ------------------------------------------------------------------------
Downloading: https://repository.jboss.org/nexus/content/groups/public-jboss/org/gluu/oxcore-model/4.2.1.Final/oxcore-model-4.2.1.Final.pom

Downloading: https://ox.gluu.org/maven/org/gluu/oxcore-model/4.2.1.Final/oxcore-model-4.2.1.Final.pom

Downloading: https://repo1.maven.org/maven2/org/gluu/oxcore-model/4.2.1.Final/oxcore-model-4.2.1.Final.pom

Downloading: https://build.shibboleth.net/nexus/content/repositories/releases/org/gluu/oxcore-model/4.2.1.Final/oxcore-model-4.2.1.Final.pom

Downloading: https://repo.maven.apache.org/maven2/org/gluu/oxcore-model/4.2.1.Final/oxcore-model-4.2.1.Final.pom

[WARNING] The POM for org.gluu:oxcore-model:jar:4.2.1.Final is missing, no dependency information available
Downloading: https://repository.jboss.org/nexus/content/groups/public-jboss/org/gluu/oxcore-util/4.2.1.Final/oxcore-util-4.2.1.Final.pom

Downloading: https://ox.gluu.org/maven/org/gluu/oxcore-util/4.2.1.Final/oxcore-util-4.2.1.Final.pom

Downloading: https://repo1.maven.org/maven2/org/gluu/oxcore-util/4.2.1.Final/oxcore-util-4.2.1.Final.pom

Downloading: https://build.shibboleth.net/nexus/content/repositories/releases/org/gluu/oxcore-util/4.2.1.Final/oxcore-util-4.2.1.Final.pom

Downloading: https://repo.maven.apache.org/maven2/org/gluu/oxcore-util/4.2.1.Final/oxcore-util-4.2.1.Final.pom

[WARNING] The POM for org.gluu:oxcore-util:jar:4.2.1.Final is missing, no dependency information available
Downloading: https://repository.jboss.org/nexus/content/groups/public-jboss/org/gluu/oxcore-persistence-annotation/4.2.1.Final/oxcore-persistence-annotation-4.2.1.Final.pom

Downloading: https://ox.gluu.org/maven/org/gluu/oxcore-persistence-annotation/4.2.1.Final/oxcore-persistence-annotation-4.2.1.Final.pom

Downloading: https://repo1.maven.org/maven2/org/gluu/oxcore-persistence-annotation/4.2.1.Final/oxcore-persistence-annotation-4.2.1.Final.pom

Downloading: https://build.shibboleth.net/nexus/content/repositories/releases/org/gluu/oxcore-persistence-annotation/4.2.1.Final/oxcore-persistence-annotation-4.2.1.Final.pom

Downloading: https://repo.maven.apache.org/maven2/org/gluu/oxcore-persistence-annotation/4.2.1.Final/oxcore-persistence-annotation-4.2.1.Final.pom

[WARNING] The POM for org.gluu:oxcore-persistence-annotation:jar:4.2.1.Final is missing, no dependency information available
Downloading: https://repository.jboss.org/nexus/content/groups/public-jboss/org/gluu/oxcore-persistence-ldap/4.2.1.Final/oxcore-persistence-ldap-4.2.1.Final.pom

Downloading: https://ox.gluu.org/maven/org/gluu/oxcore-persistence-ldap/4.2.1.Final/oxcore-persistence-ldap-4.2.1.Final.pom

Downloading: https://repo1.maven.org/maven2/org/gluu/oxcore-persistence-ldap/4.2.1.Final/oxcore-persistence-ldap-4.2.1.Final.pom

Downloading: https://build.shibboleth.net/nexus/content/repositories/releases/org/gluu/oxcore-persistence-ldap/4.2.1.Final/oxcore-persistence-ldap-4.2.1.Final.pom

Downloading: https://repo.maven.apache.org/maven2/org/gluu/oxcore-persistence-ldap/4.2.1.Final/oxcore-persistence-ldap-4.2.1.Final.pom

[WARNING] The POM for org.gluu:oxcore-persistence-ldap:jar:4.2.1.Final is missing, no dependency information available
Downloading: https://repository.jboss.org/nexus/content/groups/public-jboss/org/gluu/oxcore-service/4.2.1.Final/oxcore-service-4.2.1.Final.pom

Downloading: https://ox.gluu.org/maven/org/gluu/oxcore-service/4.2.1.Final/oxcore-service-4.2.1.Final.pom

Downloading: https://repo1.maven.org/maven2/org/gluu/oxcore-service/4.2.1.Final/oxcore-service-4.2.1.Final.pom

Downloading: https://build.shibboleth.net/nexus/content/repositories/releases/org/gluu/oxcore-service/4.2.1.Final/oxcore-service-4.2.1.Final.pom

Downloading: https://repo.maven.apache.org/maven2/org/gluu/oxcore-service/4.2.1.Final/oxcore-service-4.2.1.Final.pom

[WARNING] The POM for org.gluu:oxcore-service:jar:4.2.1.Final is missing, no dependency information available
Downloading: https://repository.jboss.org/nexus/content/groups/public-jboss/org/gluu/oxcore-server/4.2.1.Final/oxcore-server-4.2.1.Final.pom

Downloading: https://ox.gluu.org/maven/org/gluu/oxcore-server/4.2.1.Final/oxcore-server-4.2.1.Final.pom

Downloading: https://repo1.maven.org/maven2/org/gluu/oxcore-server/4.2.1.Final/oxcore-server-4.2.1.Final.pom

Downloading: https://build.shibboleth.net/nexus/content/repositories/releases/org/gluu/oxcore-server/4.2.1.Final/oxcore-server-4.2.1.Final.pom

Downloading: https://repo.maven.apache.org/maven2/org/gluu/oxcore-server/4.2.1.Final/oxcore-server-4.2.1.Final.pom

[WARNING] The POM for org.gluu:oxcore-server:jar:4.2.1.Final is missing, no dependency information available
Downloading: https://repository.jboss.org/nexus/content/groups/public-jboss/org/gluu/oxcore-saml/4.2.1.Final/oxcore-saml-4.2.1.Final.pom

Downloading: https://ox.gluu.org/maven/org/gluu/oxcore-saml/4.2.1.Final/oxcore-saml-4.2.1.Final.pom

Downloading: https://repo1.maven.org/maven2/org/gluu/oxcore-saml/4.2.1.Final/oxcore-saml-4.2.1.Final.pom

Downloading: https://build.shibboleth.net/nexus/content/repositories/releases/org/gluu/oxcore-saml/4.2.1.Final/oxcore-saml-4.2.1.Final.pom

Downloading: https://repo.maven.apache.org/maven2/org/gluu/oxcore-saml/4.2.1.Final/oxcore-saml-4.2.1.Final.pom

[WARNING] The POM for org.gluu:oxcore-saml:jar:4.2.1.Final is missing, no dependency information available
Downloading: https://repository.jboss.org/nexus/content/groups/public-jboss/org/gluu/oxcore-document-store/4.2.1.Final/oxcore-document-store-4.2.1.Final.pom

Downloading: https://ox.gluu.org/maven/org/gluu/oxcore-document-store/4.2.1.Final/oxcore-document-store-4.2.1.Final.pom

Downloading: https://repo1.maven.org/maven2/org/gluu/oxcore-document-store/4.2.1.Final/oxcore-document-store-4.2.1.Final.pom

Downloading: https://build.shibboleth.net/nexus/content/repositories/releases/org/gluu/oxcore-document-store/4.2.1.Final/oxcore-document-store-4.2.1.Final.pom

Downloading: https://repo.maven.apache.org/maven2/org/gluu/oxcore-document-store/4.2.1.Final/oxcore-document-store-4.2.1.Final.pom

[WARNING] The POM for org.gluu:oxcore-document-store:jar:4.2.1.Final is missing, no dependency information available
Downloading: https://repository.jboss.org/nexus/content/groups/public-jboss/org/gluu/oxauth-model/4.2.1.Final/oxauth-model-4.2.1.Final.pom

Downloading: https://ox.gluu.org/maven/org/gluu/oxauth-model/4.2.1.Final/oxauth-model-4.2.1.Final.pom

Downloading: https://repo1.maven.org/maven2/org/gluu/oxauth-model/4.2.1.Final/oxauth-model-4.2.1.Final.pom

Downloading: https://build.shibboleth.net/nexus/content/repositories/releases/org/gluu/oxauth-model/4.2.1.Final/oxauth-model-4.2.1.Final.pom

Downloading: https://repo.maven.apache.org/maven2/org/gluu/oxauth-model/4.2.1.Final/oxauth-model-4.2.1.Final.pom

[WARNING] The POM for org.gluu:oxauth-model:jar:4.2.1.Final is missing, no dependency information available
Downloading: https://repository.jboss.org/nexus/content/groups/public-jboss/org/gluu/oxauth-persistence-model/4.2.1.Final/oxauth-persistence-model-4.2.1.Final.pom

Downloading: https://ox.gluu.org/maven/org/gluu/oxauth-persistence-model/4.2.1.Final/oxauth-persistence-model-4.2.1.Final.pom

Downloading: https://repo1.maven.org/maven2/org/gluu/oxauth-persistence-model/4.2.1.Final/oxauth-persistence-model-4.2.1.Final.pom

Downloading: https://build.shibboleth.net/nexus/content/repositories/releases/org/gluu/oxauth-persistence-model/4.2.1.Final/oxauth-persistence-model-4.2.1.Final.pom

Downloading: https://repo.maven.apache.org/maven2/org/gluu/oxauth-persistence-model/4.2.1.Final/oxauth-persistence-model-4.2.1.Final.pom

[WARNING] The POM for org.gluu:oxauth-persistence-model:jar:4.2.1.Final is missing, no dependency information available
Downloading: https://repository.jboss.org/nexus/content/groups/public-jboss/org/gluu/oxcore-model/4.2.1.Final/oxcore-model-4.2.1.Final.jar
Downloading: https://repository.jboss.org/nexus/content/groups/public-jboss/org/gluu/oxcore-util/4.2.1.Final/oxcore-util-4.2.1.Final.jar
Downloading: https://repository.jboss.org/nexus/content/groups/public-jboss/org/gluu/oxcore-persistence-annotation/4.2.1.Final/oxcore-persistence-annotation-4.2.1.Final.jar
Downloading: https://repository.jboss.org/nexus/content/groups/public-jboss/org/gluu/oxcore-persistence-ldap/4.2.1.Final/oxcore-persistence-ldap-4.2.1.Final.jar
Downloading: https://repository.jboss.org/nexus/content/groups/public-jboss/org/gluu/oxcore-service/4.2.1.Final/oxcore-service-4.2.1.Final.jar

Downloading: https://repository.jboss.org/nexus/content/groups/public-jboss/org/gluu/oxcore-server/4.2.1.Final/oxcore-server-4.2.1.Final.jar

Downloading: https://repository.jboss.org/nexus/content/groups/public-jboss/org/gluu/oxcore-saml/4.2.1.Final/oxcore-saml-4.2.1.Final.jar

Downloading: https://repository.jboss.org/nexus/content/groups/public-jboss/org/gluu/oxcore-document-store/4.2.1.Final/oxcore-document-store-4.2.1.Final.jar

Downloading: https://repository.jboss.org/nexus/content/groups/public-jboss/org/gluu/oxauth-model/4.2.1.Final/oxauth-model-4.2.1.Final.jar

Downloading: https://repository.jboss.org/nexus/content/groups/public-jboss/org/gluu/oxauth-persistence-model/4.2.1.Final/oxauth-persistence-model-4.2.1.Final.jar





Downloading: https://ox.gluu.org/maven/org/gluu/oxcore-model/4.2.1.Final/oxcore-model-4.2.1.Final.jar
Downloading: https://ox.gluu.org/maven/org/gluu/oxcore-util/4.2.1.Final/oxcore-util-4.2.1.Final.jar
Downloading: https://ox.gluu.org/maven/org/gluu/oxcore-persistence-annotation/4.2.1.Final/oxcore-persistence-annotation-4.2.1.Final.jar
Downloading: https://ox.gluu.org/maven/org/gluu/oxcore-persistence-ldap/4.2.1.Final/oxcore-persistence-ldap-4.2.1.Final.jar
Downloading: https://ox.gluu.org/maven/org/gluu/oxcore-service/4.2.1.Final/oxcore-service-4.2.1.Final.jar

Downloading: https://ox.gluu.org/maven/org/gluu/oxcore-server/4.2.1.Final/oxcore-server-4.2.1.Final.jar

Downloading: https://ox.gluu.org/maven/org/gluu/oxcore-saml/4.2.1.Final/oxcore-saml-4.2.1.Final.jar

Downloading: https://ox.gluu.org/maven/org/gluu/oxcore-document-store/4.2.1.Final/oxcore-document-store-4.2.1.Final.jar

Downloading: https://ox.gluu.org/maven/org/gluu/oxauth-model/4.2.1.Final/oxauth-model-4.2.1.Final.jar

Downloading: https://ox.gluu.org/maven/org/gluu/oxauth-persistence-model/4.2.1.Final/oxauth-persistence-model-4.2.1.Final.jar





Downloading: https://repo1.maven.org/maven2/org/gluu/oxcore-model/4.2.1.Final/oxcore-model-4.2.1.Final.jar
Downloading: https://repo1.maven.org/maven2/org/gluu/oxcore-util/4.2.1.Final/oxcore-util-4.2.1.Final.jar
Downloading: https://repo1.maven.org/maven2/org/gluu/oxcore-persistence-annotation/4.2.1.Final/oxcore-persistence-annotation-4.2.1.Final.jar
Downloading: https://repo1.maven.org/maven2/org/gluu/oxcore-persistence-ldap/4.2.1.Final/oxcore-persistence-ldap-4.2.1.Final.jar
Downloading: https://repo1.maven.org/maven2/org/gluu/oxcore-service/4.2.1.Final/oxcore-service-4.2.1.Final.jar

Downloading: https://repo1.maven.org/maven2/org/gluu/oxcore-server/4.2.1.Final/oxcore-server-4.2.1.Final.jar

Downloading: https://repo1.maven.org/maven2/org/gluu/oxcore-saml/4.2.1.Final/oxcore-saml-4.2.1.Final.jar

Downloading: https://repo1.maven.org/maven2/org/gluu/oxcore-document-store/4.2.1.Final/oxcore-document-store-4.2.1.Final.jar

Downloading: https://repo1.maven.org/maven2/org/gluu/oxauth-model/4.2.1.Final/oxauth-model-4.2.1.Final.jar

Downloading: https://repo1.maven.org/maven2/org/gluu/oxauth-persistence-model/4.2.1.Final/oxauth-persistence-model-4.2.1.Final.jar





Downloading: https://build.shibboleth.net/nexus/content/repositories/releases/org/gluu/oxcore-model/4.2.1.Final/oxcore-model-4.2.1.Final.jar
Downloading: https://build.shibboleth.net/nexus/content/repositories/releases/org/gluu/oxcore-util/4.2.1.Final/oxcore-util-4.2.1.Final.jar
Downloading: https://build.shibboleth.net/nexus/content/repositories/releases/org/gluu/oxcore-persistence-annotation/4.2.1.Final/oxcore-persistence-annotation-4.2.1.Final.jar
Downloading: https://build.shibboleth.net/nexus/content/repositories/releases/org/gluu/oxcore-persistence-ldap/4.2.1.Final/oxcore-persistence-ldap-4.2.1.Final.jar
Downloading: https://build.shibboleth.net/nexus/content/repositories/releases/org/gluu/oxcore-service/4.2.1.Final/oxcore-service-4.2.1.Final.jar

Downloading: https://build.shibboleth.net/nexus/content/repositories/releases/org/gluu/oxcore-server/4.2.1.Final/oxcore-server-4.2.1.Final.jar

Downloading: https://build.shibboleth.net/nexus/content/repositories/releases/org/gluu/oxcore-saml/4.2.1.Final/oxcore-saml-4.2.1.Final.jar

Downloading: https://build.shibboleth.net/nexus/content/repositories/releases/org/gluu/oxcore-document-store/4.2.1.Final/oxcore-document-store-4.2.1.Final.jar

Downloading: https://build.shibboleth.net/nexus/content/repositories/releases/org/gluu/oxauth-model/4.2.1.Final/oxauth-model-4.2.1.Final.jar

Downloading: https://build.shibboleth.net/nexus/content/repositories/releases/org/gluu/oxauth-persistence-model/4.2.1.Final/oxauth-persistence-model-4.2.1.Final.jar





Downloading: https://repo.maven.apache.org/maven2/org/gluu/oxcore-model/4.2.1.Final/oxcore-model-4.2.1.Final.jar
Downloading: https://repo.maven.apache.org/maven2/org/gluu/oxcore-util/4.2.1.Final/oxcore-util-4.2.1.Final.jar
Downloading: https://repo.maven.apache.org/maven2/org/gluu/oxcore-persistence-annotation/4.2.1.Final/oxcore-persistence-annotation-4.2.1.Final.jar
Downloading: https://repo.maven.apache.org/maven2/org/gluu/oxcore-persistence-ldap/4.2.1.Final/oxcore-persistence-ldap-4.2.1.Final.jar
Downloading: https://repo.maven.apache.org/maven2/org/gluu/oxcore-service/4.2.1.Final/oxcore-service-4.2.1.Final.jar

Downloading: https://repo.maven.apache.org/maven2/org/gluu/oxcore-server/4.2.1.Final/oxcore-server-4.2.1.Final.jar

Downloading: https://repo.maven.apache.org/maven2/org/gluu/oxcore-saml/4.2.1.Final/oxcore-saml-4.2.1.Final.jar

Downloading: https://repo.maven.apache.org/maven2/org/gluu/oxcore-document-store/4.2.1.Final/oxcore-document-store-4.2.1.Final.jar

Downloading: https://repo.maven.apache.org/maven2/org/gluu/oxauth-model/4.2.1.Final/oxauth-model-4.2.1.Final.jar

Downloading: https://repo.maven.apache.org/maven2/org/gluu/oxauth-persistence-model/4.2.1.Final/oxauth-persistence-model-4.2.1.Final.jar





[INFO] ------------------------------------------------------------------------
[INFO] Reactor Summary:
[INFO] 
[INFO] oxTrust ............................................ SUCCESS [  3.147 s]
[INFO] oxTrust static resources ........................... SUCCESS [  1.879 s]
[INFO] oxTrust configuration .............................. SUCCESS [  0.456 s]
[INFO] oxTrust Model library .............................. FAILURE [  6.133 s]
[INFO] oxTrust Client library ............................. SKIPPED
[INFO] oxTrust Service .................................... SKIPPED
[INFO] OpenId authentication module ....................... SKIPPED
[INFO] oxTrust Server ..................................... SKIPPED
[INFO] OpenId authentication module for Saml .............. SKIPPED
[INFO] OpenId authentication module for CAS ............... SKIPPED
[INFO] oxtrust-qa ......................................... SKIPPED
[INFO] oxTrust Server Test ................................ SKIPPED
[INFO] API Server ......................................... SKIPPED
[INFO] ------------------------------------------------------------------------
[INFO] BUILD FAILURE
[INFO] ------------------------------------------------------------------------
[INFO] Total time: 12.966 s
[INFO] Finished at: 2020-09-15T16:05:30+00:00
[INFO] Final Memory: 45M/582M
[INFO] ------------------------------------------------------------------------
[ERROR] Failed to execute goal on project oxtrust-model: Could not resolve dependencies for project org.gluu:oxtrust-model:jar:4.2.1.Final: The following artifacts could not be resolved: org.gluu:oxcore-model:jar:4.2.1.Final, org.gluu:oxcore-util:jar:4.2.1.Final, org.gluu:oxcore-persistence-annotation:jar:4.2.1.Final, org.gluu:oxcore-persistence-ldap:jar:4.2.1.Final, org.gluu:oxcore-service:jar:4.2.1.Final, org.gluu:oxcore-server:jar:4.2.1.Final, org.gluu:oxcore-saml:jar:4.2.1.Final, org.gluu:oxcore-document-store:jar:4.2.1.Final, org.gluu:oxauth-model:jar:4.2.1.Final, org.gluu:oxauth-persistence-model:jar:4.2.1.Final: Could not find artifact org.gluu:oxcore-model:jar:4.2.1.Final in repository.jboss.org (https://repository.jboss.org/nexus/content/groups/public-jboss/) -> [Help 1]
[ERROR] 
[ERROR] To see the full stack trace of the errors, re-run Maven with the -e switch.
[ERROR] Re-run Maven using the -X switch to enable full debug logging.
[ERROR] 
[ERROR] For more information about the errors and possible solutions, please read the following articles:
[ERROR] [Help 1] http://cwiki.apache.org/confluence/display/MAVEN/DependencyResolutionException
[ERROR] 
[ERROR] After correcting the problems, you can resume the build with the command
[ERROR]   mvn <goals> -rf :oxtrust-model
Build step 'Invoke top-level Maven targets' marked build as failure
[FINDBUGS] Skipping publisher since build result is FAILURE
Publishing Javadoc
TestNG Reports Processing: START
Looking for TestNG results report in workspace using pattern: **/testng-results.xml
testng-results.xml was last modified before this build started. Ignoring it.
Saving reports...
Found matching files but did not find any TestNG results.
Not sending mail to unregistered user Yuriy.Movchan@gmail.com
Sending e-mails to: support@gluu.org
[Boolean condition] checking [true] against [^(1|y|yes|t|true|on|run)$] (origin token: $DEPLOY_BUILD)
Run condition [Boolean condition] enabling perform for step [Builder to mark whether executed]
Finished: FAILURE