FailedConsole Output

Started by user Yuriy Movchan
Building on master in workspace /home/tomcat/.jenkins/jobs/oxTrust_3.1.6/workspace
No credentials specified
 > git rev-parse --is-inside-work-tree # timeout=10
Fetching changes from the remote Git repository
 > git config remote.origin.url https://github.com/GluuFederation/oxTrust # timeout=10
Fetching upstream changes from https://github.com/GluuFederation/oxTrust
 > git --version # timeout=10
 > git fetch --tags --progress https://github.com/GluuFederation/oxTrust +refs/heads/*:refs/remotes/origin/*
 > git rev-parse refs/remotes/origin/version_3.1.6.sp2^{commit} # timeout=10
 > git rev-parse refs/remotes/origin/origin/version_3.1.6.sp2^{commit} # timeout=10
Checking out Revision 9ac73df3de3a50037a7ec2f5c8f411588f2d5776 (refs/remotes/origin/version_3.1.6.sp2)
 > git config core.sparsecheckout # timeout=10
 > git checkout -f 9ac73df3de3a50037a7ec2f5c8f411588f2d5776
Commit message: "Fix merging issue"
 > git rev-list --no-walk 9ac73df3de3a50037a7ec2f5c8f411588f2d5776 # timeout=10
Run condition [Boolean condition] enabling prebuild for step [Trigger/call builds on other projects]
[workspace] $ /bin/bash /opt/tomcat/temp/jenkins6226348707378269734.sh
Cloning into 'oxHudsonProfiles'...
[workspace] $ /home/tomcat/.jenkins/tools/hudson.tasks.Maven_MavenInstallation/maven_3.3.9/bin/mvn -DDEPLOY_BUILD=true -DVERSION_NAME=version_3.1.6.sp2 -DPROFILE_NAME=ce-dev3 -DDEVELOPMENT_BUILD=false -DMAVEN_SKIP_TESTS=false -Dpython.import.site=false -DPYTHON_HOME=/opt/jython -Dcfg=ce-dev3 -Dmaven.test.skip=false -Ddevelopment-build=false clean compile install findbugs:findbugs javadoc:javadoc site
[INFO] Scanning for projects...
[WARNING] 
[WARNING] Some problems were encountered while building the effective model for org.xdi:oxtrust-static:jar:3.1.6.sp2
[WARNING] 'dependencyManagement.dependencies.dependency.(groupId:artifactId:type:classifier)' must be unique: org.xdi:oxtrust-model:jar -> duplicate declaration of version ${project.version} @ org.xdi:oxtrust:3.1.6.sp2, /home/tomcat/.jenkins/jobs/oxTrust_3.1.6/workspace/pom.xml, line 146, column 25
[WARNING] 
[WARNING] Some problems were encountered while building the effective model for org.xdi:oxtrust-configuration:jar:3.1.6.sp2
[WARNING] 'dependencyManagement.dependencies.dependency.(groupId:artifactId:type:classifier)' must be unique: org.xdi:oxtrust-model:jar -> duplicate declaration of version ${project.version} @ org.xdi:oxtrust:3.1.6.sp2, /home/tomcat/.jenkins/jobs/oxTrust_3.1.6/workspace/pom.xml, line 146, column 25
[WARNING] 
[WARNING] Some problems were encountered while building the effective model for org.xdi:oxtrust-model:jar:3.1.6.sp2
[WARNING] 'dependencyManagement.dependencies.dependency.(groupId:artifactId:type:classifier)' must be unique: org.xdi:oxtrust-model:jar -> duplicate declaration of version ${project.version} @ org.xdi:oxtrust:3.1.6.sp2, /home/tomcat/.jenkins/jobs/oxTrust_3.1.6/workspace/pom.xml, line 146, column 25
[WARNING] 
[WARNING] Some problems were encountered while building the effective model for org.xdi:oxtrust-server:war:3.1.6.sp2
[WARNING] 'dependencies.dependency.(groupId:artifactId:type:classifier)' must be unique: org.jboss.resteasy:jaxrs-api:jar -> duplicate declaration of version (?) @ org.xdi:oxtrust-server:[unknown-version], /home/tomcat/.jenkins/jobs/oxTrust_3.1.6/workspace/server/pom.xml, line 439, column 15
[WARNING] 'dependencyManagement.dependencies.dependency.(groupId:artifactId:type:classifier)' must be unique: org.xdi:oxtrust-model:jar -> duplicate declaration of version ${project.version} @ org.xdi:oxtrust:3.1.6.sp2, /home/tomcat/.jenkins/jobs/oxTrust_3.1.6/workspace/pom.xml, line 146, column 25
[WARNING] 'build.plugins.plugin.version' for org.apache.maven.plugins:maven-javadoc-plugin is missing. @ org.xdi:oxtrust-server:[unknown-version], /home/tomcat/.jenkins/jobs/oxTrust_3.1.6/workspace/server/pom.xml, line 68, column 12
[WARNING] 
[WARNING] Some problems were encountered while building the effective model for org.xdi:oxtrust-scim:jar:3.1.6.sp2
[WARNING] 'dependencyManagement.dependencies.dependency.(groupId:artifactId:type:classifier)' must be unique: org.xdi:oxtrust-model:jar -> duplicate declaration of version ${project.version} @ org.xdi:oxtrust:3.1.6.sp2, /home/tomcat/.jenkins/jobs/oxTrust_3.1.6/workspace/pom.xml, line 146, column 25
[WARNING] 
[WARNING] Some problems were encountered while building the effective model for org.xdi:openid-auth-client:jar:3.1.6.sp2
[WARNING] 'dependencyManagement.dependencies.dependency.(groupId:artifactId:type:classifier)' must be unique: org.xdi:oxtrust-model:jar -> duplicate declaration of version ${project.version} @ org.xdi:oxtrust:3.1.6.sp2, /home/tomcat/.jenkins/jobs/oxTrust_3.1.6/workspace/pom.xml, line 146, column 25
[WARNING] 'build.plugins.plugin.version' for org.apache.maven.plugins:maven-javadoc-plugin is missing. @ org.xdi:openid-auth-client:[unknown-version], /home/tomcat/.jenkins/jobs/oxTrust_3.1.6/workspace/openid-auth-client/pom.xml, line 22, column 21
[WARNING] 
[WARNING] Some problems were encountered while building the effective model for org.xdi:saml-openid-auth-client:jar:3.1.6.sp2
[WARNING] 'dependencyManagement.dependencies.dependency.(groupId:artifactId:type:classifier)' must be unique: org.xdi:oxtrust-model:jar -> duplicate declaration of version ${project.version} @ org.xdi:oxtrust:3.1.6.sp2, /home/tomcat/.jenkins/jobs/oxTrust_3.1.6/workspace/pom.xml, line 146, column 25
[WARNING] 'build.plugins.plugin.version' for org.apache.maven.plugins:maven-javadoc-plugin is missing. @ org.xdi:saml-openid-auth-client:[unknown-version], /home/tomcat/.jenkins/jobs/oxTrust_3.1.6/workspace/saml-openid-auth-client/pom.xml, line 22, column 21
[WARNING] 
[WARNING] Some problems were encountered while building the effective model for org.xdi:cas-openid-auth-client:jar:3.1.6.sp2
[WARNING] 'dependencyManagement.dependencies.dependency.(groupId:artifactId:type:classifier)' must be unique: org.xdi:oxtrust-model:jar -> duplicate declaration of version ${project.version} @ org.xdi:oxtrust:3.1.6.sp2, /home/tomcat/.jenkins/jobs/oxTrust_3.1.6/workspace/pom.xml, line 146, column 25
[WARNING] 'build.plugins.plugin.version' for org.apache.maven.plugins:maven-javadoc-plugin is missing. @ org.xdi:cas-openid-auth-client:[unknown-version], /home/tomcat/.jenkins/jobs/oxTrust_3.1.6/workspace/cas-openid-auth-client/pom.xml, line 27, column 12
[WARNING] 
[WARNING] Some problems were encountered while building the effective model for org.xdi:oxtrust:pom:3.1.6.sp2
[WARNING] 'dependencyManagement.dependencies.dependency.(groupId:artifactId:type:classifier)' must be unique: org.xdi:oxtrust-model:jar -> duplicate declaration of version ${project.version} @ line 146, column 25
[WARNING] 
[WARNING] It is highly recommended to fix these problems because they threaten the stability of your build.
[WARNING] 
[WARNING] For this reason, future Maven versions might no longer support building such malformed projects.
[WARNING] 
[INFO] ------------------------------------------------------------------------
[INFO] Reactor Build Order:
[INFO] 
[INFO] oxTrust
[INFO] oxTrust static resources
[INFO] oxTrust configuration
[INFO] oxTrust Model library
[INFO] OpenId authentication module
[INFO] oxtrust-scim
[INFO] oxTrust Server
[INFO] OpenId authentication module for Saml
[INFO] OpenId authentication module for CAS
[INFO]                                                                         
[INFO] ------------------------------------------------------------------------
[INFO] Building oxTrust 3.1.6.sp2
[INFO] ------------------------------------------------------------------------
[INFO] 
[INFO] --- maven-clean-plugin:2.5:clean (default-clean) @ oxtrust ---
[INFO] Deleting /home/tomcat/.jenkins/jobs/oxTrust_3.1.6/workspace/target
[INFO] 
[INFO] --- maven-install-plugin:2.3.1:install (default-install) @ oxtrust ---
[INFO] Installing /home/tomcat/.jenkins/jobs/oxTrust_3.1.6/workspace/pom.xml to /var/www/html/maven/org/xdi/oxtrust/3.1.6.sp2/oxtrust-3.1.6.sp2.pom
[INFO] 
[INFO] --- findbugs-maven-plugin:3.0.4:findbugs (default-cli) @ oxtrust ---
[INFO] 
[INFO] >>> maven-javadoc-plugin:3.0.1:javadoc (default-cli) > generate-sources @ oxtrust >>>
[INFO] 
[INFO] <<< maven-javadoc-plugin:3.0.1:javadoc (default-cli) < generate-sources @ oxtrust <<<
[INFO] 
[INFO] --- maven-javadoc-plugin:3.0.1:javadoc (default-cli) @ oxtrust ---
[INFO] 
[INFO] --- maven-site-plugin:2.1.1:site (default-site) @ oxtrust ---
[INFO]                                                                         
[INFO] ------------------------------------------------------------------------
[INFO] Building oxTrust static resources 3.1.6.sp2
[INFO] ------------------------------------------------------------------------
[INFO] 
[INFO] --- maven-clean-plugin:2.5:clean (default-clean) @ oxtrust-static ---
[INFO] Deleting /home/tomcat/.jenkins/jobs/oxTrust_3.1.6/workspace/static/target
[INFO] 
[INFO] --- maven-resources-plugin:2.6:resources (default-resources) @ oxtrust-static ---
[INFO] Using 'UTF-8' encoding to copy filtered resources.
[INFO] Copying 347 resources
[INFO] 
[INFO] --- maven-compiler-plugin:2.3.2:compile (default-compile) @ oxtrust-static ---
[INFO] No sources to compile
[INFO] 
[INFO] --- maven-resources-plugin:2.6:resources (default-resources) @ oxtrust-static ---
[INFO] Using 'UTF-8' encoding to copy filtered resources.
[INFO] Copying 347 resources
[INFO] 
[INFO] --- maven-compiler-plugin:2.3.2:compile (default-compile) @ oxtrust-static ---
[INFO] No sources to compile
[INFO] 
[INFO] --- maven-resources-plugin:2.6:testResources (default-testResources) @ oxtrust-static ---
[INFO] Using 'UTF-8' encoding to copy filtered resources.
[INFO] skip non existing resourceDirectory /home/tomcat/.jenkins/jobs/oxTrust_3.1.6/workspace/static/src/test/resources
[INFO] 
[INFO] --- maven-compiler-plugin:2.3.2:testCompile (default-testCompile) @ oxtrust-static ---
[INFO] No sources to compile
[INFO] 
[INFO] --- maven-surefire-plugin:2.19.1:test (default-test) @ oxtrust-static ---
[INFO] No tests to run.
[INFO] 
[INFO] --- maven-jar-plugin:2.4:jar (default-jar) @ oxtrust-static ---
[INFO] Building jar: /home/tomcat/.jenkins/jobs/oxTrust_3.1.6/workspace/static/target/oxtrust-static-3.1.6.sp2.jar
[INFO] 
[INFO] --- maven-jar-plugin:2.4:test-jar (default) @ oxtrust-static ---
[WARNING] JAR will be empty - no content was marked for inclusion!
[INFO] Building jar: /home/tomcat/.jenkins/jobs/oxTrust_3.1.6/workspace/static/target/oxtrust-static-3.1.6.sp2-tests.jar
[INFO] 
[INFO] --- maven-install-plugin:2.3.1:install (default-install) @ oxtrust-static ---
[INFO] Installing /home/tomcat/.jenkins/jobs/oxTrust_3.1.6/workspace/static/target/oxtrust-static-3.1.6.sp2.jar to /var/www/html/maven/org/xdi/oxtrust-static/3.1.6.sp2/oxtrust-static-3.1.6.sp2.jar
[INFO] Installing /home/tomcat/.jenkins/jobs/oxTrust_3.1.6/workspace/static/pom.xml to /var/www/html/maven/org/xdi/oxtrust-static/3.1.6.sp2/oxtrust-static-3.1.6.sp2.pom
[INFO] Installing /home/tomcat/.jenkins/jobs/oxTrust_3.1.6/workspace/static/target/oxtrust-static-3.1.6.sp2-tests.jar to /var/www/html/maven/org/xdi/oxtrust-static/3.1.6.sp2/oxtrust-static-3.1.6.sp2-tests.jar
[INFO] 
[INFO] --- findbugs-maven-plugin:3.0.4:findbugs (default-cli) @ oxtrust-static ---
[INFO] 
[INFO] >>> maven-javadoc-plugin:3.0.1:javadoc (default-cli) > generate-sources @ oxtrust-static >>>
[INFO] 
[INFO] <<< maven-javadoc-plugin:3.0.1:javadoc (default-cli) < generate-sources @ oxtrust-static <<<
[INFO] 
[INFO] --- maven-javadoc-plugin:3.0.1:javadoc (default-cli) @ oxtrust-static ---
[INFO] 
[INFO] --- maven-site-plugin:2.1.1:site (default-site) @ oxtrust-static ---
[INFO]                                                                         
[INFO] ------------------------------------------------------------------------
[INFO] Building oxTrust configuration 3.1.6.sp2
[INFO] ------------------------------------------------------------------------
[INFO] 
[INFO] --- maven-clean-plugin:2.5:clean (default-clean) @ oxtrust-configuration ---
[INFO] Deleting /home/tomcat/.jenkins/jobs/oxTrust_3.1.6/workspace/configuration/target
[INFO] 
[INFO] --- maven-resources-plugin:2.6:resources (default-resources) @ oxtrust-configuration ---
[INFO] Using 'UTF-8' encoding to copy filtered resources.
[INFO] Copying 33 resources
[INFO] 
[INFO] --- maven-compiler-plugin:2.3.2:compile (default-compile) @ oxtrust-configuration ---
[INFO] No sources to compile
[INFO] 
[INFO] --- maven-resources-plugin:2.6:resources (default-resources) @ oxtrust-configuration ---
[INFO] Using 'UTF-8' encoding to copy filtered resources.
[INFO] Copying 33 resources
[INFO] 
[INFO] --- maven-compiler-plugin:2.3.2:compile (default-compile) @ oxtrust-configuration ---
[INFO] No sources to compile
[INFO] 
[INFO] --- maven-resources-plugin:2.6:testResources (default-testResources) @ oxtrust-configuration ---
[INFO] Using 'UTF-8' encoding to copy filtered resources.
[INFO] skip non existing resourceDirectory /home/tomcat/.jenkins/jobs/oxTrust_3.1.6/workspace/configuration/src/test/resources
[INFO] 
[INFO] --- maven-compiler-plugin:2.3.2:testCompile (default-testCompile) @ oxtrust-configuration ---
[INFO] No sources to compile
[INFO] 
[INFO] --- maven-surefire-plugin:2.19.1:test (default-test) @ oxtrust-configuration ---
[INFO] No tests to run.
[INFO] 
[INFO] --- maven-jar-plugin:2.4:jar (default-jar) @ oxtrust-configuration ---
[INFO] Building jar: /home/tomcat/.jenkins/jobs/oxTrust_3.1.6/workspace/configuration/target/oxtrust-configuration-3.1.6.sp2.jar
[INFO] 
[INFO] --- maven-jar-plugin:2.4:test-jar (default) @ oxtrust-configuration ---
[WARNING] JAR will be empty - no content was marked for inclusion!
[INFO] Building jar: /home/tomcat/.jenkins/jobs/oxTrust_3.1.6/workspace/configuration/target/oxtrust-configuration-3.1.6.sp2-tests.jar
[INFO] 
[INFO] --- maven-install-plugin:2.3.1:install (default-install) @ oxtrust-configuration ---
[INFO] Installing /home/tomcat/.jenkins/jobs/oxTrust_3.1.6/workspace/configuration/target/oxtrust-configuration-3.1.6.sp2.jar to /var/www/html/maven/org/xdi/oxtrust-configuration/3.1.6.sp2/oxtrust-configuration-3.1.6.sp2.jar
[INFO] Installing /home/tomcat/.jenkins/jobs/oxTrust_3.1.6/workspace/configuration/pom.xml to /var/www/html/maven/org/xdi/oxtrust-configuration/3.1.6.sp2/oxtrust-configuration-3.1.6.sp2.pom
[INFO] Installing /home/tomcat/.jenkins/jobs/oxTrust_3.1.6/workspace/configuration/target/oxtrust-configuration-3.1.6.sp2-tests.jar to /var/www/html/maven/org/xdi/oxtrust-configuration/3.1.6.sp2/oxtrust-configuration-3.1.6.sp2-tests.jar
[INFO] 
[INFO] --- findbugs-maven-plugin:3.0.4:findbugs (default-cli) @ oxtrust-configuration ---
[INFO] 
[INFO] >>> maven-javadoc-plugin:3.0.1:javadoc (default-cli) > generate-sources @ oxtrust-configuration >>>
[INFO] 
[INFO] <<< maven-javadoc-plugin:3.0.1:javadoc (default-cli) < generate-sources @ oxtrust-configuration <<<
[INFO] 
[INFO] --- maven-javadoc-plugin:3.0.1:javadoc (default-cli) @ oxtrust-configuration ---
[INFO] 
[INFO] --- maven-site-plugin:2.1.1:site (default-site) @ oxtrust-configuration ---
[INFO]                                                                         
[INFO] ------------------------------------------------------------------------
[INFO] Building oxTrust Model library 3.1.6.sp2
[INFO] ------------------------------------------------------------------------
[INFO] 
[INFO] --- maven-clean-plugin:2.5:clean (default-clean) @ oxtrust-model ---
[INFO] Deleting /home/tomcat/.jenkins/jobs/oxTrust_3.1.6/workspace/model/target
[INFO] 
[INFO] --- maven-resources-plugin:2.6:resources (default-resources) @ oxtrust-model ---
[INFO] Using 'UTF-8' encoding to copy filtered resources.
[INFO] skip non existing resourceDirectory /home/tomcat/.jenkins/jobs/oxTrust_3.1.6/workspace/model/src/main/resources
[INFO] 
[INFO] --- maven-compiler-plugin:2.3.2:compile (default-compile) @ oxtrust-model ---
[INFO] Compiling 4 source files to /home/tomcat/.jenkins/jobs/oxTrust_3.1.6/workspace/model/target/classes
[INFO] 
[INFO] --- maven-resources-plugin:2.6:resources (default-resources) @ oxtrust-model ---
[INFO] Using 'UTF-8' encoding to copy filtered resources.
[INFO] skip non existing resourceDirectory /home/tomcat/.jenkins/jobs/oxTrust_3.1.6/workspace/model/src/main/resources
[INFO] 
[INFO] --- maven-compiler-plugin:2.3.2:compile (default-compile) @ oxtrust-model ---
[INFO] Nothing to compile - all classes are up to date
[INFO] 
[INFO] --- maven-resources-plugin:2.6:testResources (default-testResources) @ oxtrust-model ---
[INFO] Using 'UTF-8' encoding to copy filtered resources.
[INFO] skip non existing resourceDirectory /home/tomcat/.jenkins/jobs/oxTrust_3.1.6/workspace/model/src/test/resources
[INFO] 
[INFO] --- maven-compiler-plugin:2.3.2:testCompile (default-testCompile) @ oxtrust-model ---
[INFO] No sources to compile
[INFO] 
[INFO] --- maven-surefire-plugin:2.19.1:test (default-test) @ oxtrust-model ---
[INFO] No tests to run.
[INFO] 
[INFO] --- maven-jar-plugin:2.4:jar (default-jar) @ oxtrust-model ---
[INFO] Building jar: /home/tomcat/.jenkins/jobs/oxTrust_3.1.6/workspace/model/target/oxtrust-model-3.1.6.sp2.jar
[INFO] 
[INFO] --- maven-jar-plugin:2.4:test-jar (default) @ oxtrust-model ---
[WARNING] JAR will be empty - no content was marked for inclusion!
[INFO] Building jar: /home/tomcat/.jenkins/jobs/oxTrust_3.1.6/workspace/model/target/oxtrust-model-3.1.6.sp2-tests.jar
[INFO] 
[INFO] --- maven-install-plugin:2.3.1:install (default-install) @ oxtrust-model ---
[INFO] Installing /home/tomcat/.jenkins/jobs/oxTrust_3.1.6/workspace/model/target/oxtrust-model-3.1.6.sp2.jar to /var/www/html/maven/org/xdi/oxtrust-model/3.1.6.sp2/oxtrust-model-3.1.6.sp2.jar
[INFO] Installing /home/tomcat/.jenkins/jobs/oxTrust_3.1.6/workspace/model/pom.xml to /var/www/html/maven/org/xdi/oxtrust-model/3.1.6.sp2/oxtrust-model-3.1.6.sp2.pom
[INFO] Installing /home/tomcat/.jenkins/jobs/oxTrust_3.1.6/workspace/model/target/oxtrust-model-3.1.6.sp2-tests.jar to /var/www/html/maven/org/xdi/oxtrust-model/3.1.6.sp2/oxtrust-model-3.1.6.sp2-tests.jar
[INFO] 
[INFO] --- findbugs-maven-plugin:3.0.4:findbugs (default-cli) @ oxtrust-model ---
[INFO] Fork Value is true
[INFO] Done FindBugs Analysis....
[INFO] 
[INFO] >>> maven-javadoc-plugin:3.0.1:javadoc (default-cli) > generate-sources @ oxtrust-model >>>
[INFO] 
[INFO] <<< maven-javadoc-plugin:3.0.1:javadoc (default-cli) < generate-sources @ oxtrust-model <<<
[INFO] 
[INFO] --- maven-javadoc-plugin:3.0.1:javadoc (default-cli) @ oxtrust-model ---
[INFO] 
Loading source files for package org.gluu.oxtrust.model...
Constructing Javadoc information...
Standard Doclet version 1.8.0_172
Building tree for all the packages and classes...
Generating /home/tomcat/.jenkins/jobs/oxTrust_3.1.6/workspace/model/target/site/apidocs/org/gluu/oxtrust/model/Device.html...
Generating /home/tomcat/.jenkins/jobs/oxTrust_3.1.6/workspace/model/target/site/apidocs/org/gluu/oxtrust/model/MobileDevice.html...
Generating /home/tomcat/.jenkins/jobs/oxTrust_3.1.6/workspace/model/target/site/apidocs/org/gluu/oxtrust/model/OTPDevice.html...
Generating /home/tomcat/.jenkins/jobs/oxTrust_3.1.6/workspace/model/target/site/apidocs/org/gluu/oxtrust/model/Phone.html...
Generating /home/tomcat/.jenkins/jobs/oxTrust_3.1.6/workspace/model/target/site/apidocs/org/gluu/oxtrust/model/package-frame.html...
Generating /home/tomcat/.jenkins/jobs/oxTrust_3.1.6/workspace/model/target/site/apidocs/org/gluu/oxtrust/model/package-summary.html...
Generating /home/tomcat/.jenkins/jobs/oxTrust_3.1.6/workspace/model/target/site/apidocs/org/gluu/oxtrust/model/package-tree.html...
Generating /home/tomcat/.jenkins/jobs/oxTrust_3.1.6/workspace/model/target/site/apidocs/constant-values.html...
Generating /home/tomcat/.jenkins/jobs/oxTrust_3.1.6/workspace/model/target/site/apidocs/org/gluu/oxtrust/model/class-use/MobileDevice.html...
Generating /home/tomcat/.jenkins/jobs/oxTrust_3.1.6/workspace/model/target/site/apidocs/org/gluu/oxtrust/model/class-use/OTPDevice.html...
Generating /home/tomcat/.jenkins/jobs/oxTrust_3.1.6/workspace/model/target/site/apidocs/org/gluu/oxtrust/model/class-use/Device.html...
Generating /home/tomcat/.jenkins/jobs/oxTrust_3.1.6/workspace/model/target/site/apidocs/org/gluu/oxtrust/model/class-use/Phone.html...
Generating /home/tomcat/.jenkins/jobs/oxTrust_3.1.6/workspace/model/target/site/apidocs/org/gluu/oxtrust/model/package-use.html...
Building index for all the packages and classes...
Generating /home/tomcat/.jenkins/jobs/oxTrust_3.1.6/workspace/model/target/site/apidocs/overview-tree.html...
Generating /home/tomcat/.jenkins/jobs/oxTrust_3.1.6/workspace/model/target/site/apidocs/index-all.html...
Generating /home/tomcat/.jenkins/jobs/oxTrust_3.1.6/workspace/model/target/site/apidocs/deprecated-list.html...
Building index for all classes...
Generating /home/tomcat/.jenkins/jobs/oxTrust_3.1.6/workspace/model/target/site/apidocs/allclasses-frame.html...
Generating /home/tomcat/.jenkins/jobs/oxTrust_3.1.6/workspace/model/target/site/apidocs/allclasses-noframe.html...
Generating /home/tomcat/.jenkins/jobs/oxTrust_3.1.6/workspace/model/target/site/apidocs/index.html...
Generating /home/tomcat/.jenkins/jobs/oxTrust_3.1.6/workspace/model/target/site/apidocs/help-doc.html...
[INFO] 
[INFO] --- maven-site-plugin:2.1.1:site (default-site) @ oxtrust-model ---
[INFO]                                                                         
[INFO] ------------------------------------------------------------------------
[INFO] Building OpenId authentication module 3.1.6.sp2
[INFO] ------------------------------------------------------------------------
[INFO] 
[INFO] --- maven-clean-plugin:2.5:clean (default-clean) @ openid-auth-client ---
[INFO] Deleting /home/tomcat/.jenkins/jobs/oxTrust_3.1.6/workspace/openid-auth-client/target
[INFO] 
[INFO] --- maven-resources-plugin:2.6:resources (default-resources) @ openid-auth-client ---
[INFO] Using 'UTF-8' encoding to copy filtered resources.
[INFO] skip non existing resourceDirectory /home/tomcat/.jenkins/jobs/oxTrust_3.1.6/workspace/openid-auth-client/src/main/resources
[INFO] 
[INFO] --- maven-compiler-plugin:2.3.2:compile (default-compile) @ openid-auth-client ---
[INFO] Compiling 10 source files to /home/tomcat/.jenkins/jobs/oxTrust_3.1.6/workspace/openid-auth-client/target/classes
[INFO] 
[INFO] --- maven-resources-plugin:2.6:resources (default-resources) @ openid-auth-client ---
[INFO] Using 'UTF-8' encoding to copy filtered resources.
[INFO] skip non existing resourceDirectory /home/tomcat/.jenkins/jobs/oxTrust_3.1.6/workspace/openid-auth-client/src/main/resources
[INFO] 
[INFO] --- maven-compiler-plugin:2.3.2:compile (default-compile) @ openid-auth-client ---
[INFO] Nothing to compile - all classes are up to date
[INFO] 
[INFO] --- maven-resources-plugin:2.6:testResources (default-testResources) @ openid-auth-client ---
[INFO] Using 'UTF-8' encoding to copy filtered resources.
[INFO] skip non existing resourceDirectory /home/tomcat/.jenkins/jobs/oxTrust_3.1.6/workspace/openid-auth-client/src/test/resources
[INFO] 
[INFO] --- maven-compiler-plugin:2.3.2:testCompile (default-testCompile) @ openid-auth-client ---
[INFO] No sources to compile
[INFO] 
[INFO] --- maven-surefire-plugin:2.19.1:test (default-test) @ openid-auth-client ---
[INFO] No tests to run.
[INFO] 
[INFO] --- maven-jar-plugin:2.4:jar (default-jar) @ openid-auth-client ---
[INFO] Building jar: /home/tomcat/.jenkins/jobs/oxTrust_3.1.6/workspace/openid-auth-client/target/openid-auth-client-3.1.6.sp2.jar
[INFO] 
[INFO] --- maven-jar-plugin:2.4:test-jar (default) @ openid-auth-client ---
[WARNING] JAR will be empty - no content was marked for inclusion!
[INFO] Building jar: /home/tomcat/.jenkins/jobs/oxTrust_3.1.6/workspace/openid-auth-client/target/openid-auth-client-3.1.6.sp2-tests.jar
[INFO] 
[INFO] --- maven-install-plugin:2.3.1:install (default-install) @ openid-auth-client ---
[INFO] Installing /home/tomcat/.jenkins/jobs/oxTrust_3.1.6/workspace/openid-auth-client/target/openid-auth-client-3.1.6.sp2.jar to /var/www/html/maven/org/xdi/openid-auth-client/3.1.6.sp2/openid-auth-client-3.1.6.sp2.jar
[INFO] Installing /home/tomcat/.jenkins/jobs/oxTrust_3.1.6/workspace/openid-auth-client/pom.xml to /var/www/html/maven/org/xdi/openid-auth-client/3.1.6.sp2/openid-auth-client-3.1.6.sp2.pom
[INFO] Installing /home/tomcat/.jenkins/jobs/oxTrust_3.1.6/workspace/openid-auth-client/target/openid-auth-client-3.1.6.sp2-tests.jar to /var/www/html/maven/org/xdi/openid-auth-client/3.1.6.sp2/openid-auth-client-3.1.6.sp2-tests.jar
[INFO] 
[INFO] --- findbugs-maven-plugin:3.0.4:findbugs (default-cli) @ openid-auth-client ---
[INFO] Fork Value is true
[INFO] Done FindBugs Analysis....
[INFO] 
[INFO] >>> maven-javadoc-plugin:3.0.1:javadoc (default-cli) > generate-sources @ openid-auth-client >>>
[INFO] 
[INFO] <<< maven-javadoc-plugin:3.0.1:javadoc (default-cli) < generate-sources @ openid-auth-client <<<
[INFO] 
[INFO] --- maven-javadoc-plugin:3.0.1:javadoc (default-cli) @ openid-auth-client ---
[INFO] 
Loading source files for package org.gluu.oxauth.client.exception...
Loading source files for package org.gluu.oxauth.client.conf...
Loading source files for package org.gluu.oxauth.client...
Loading source files for package org.gluu.oxauth.client.auth.principal...
Loading source files for package org.gluu.oxauth.client.auth.user...
Constructing Javadoc information...
Standard Doclet version 1.8.0_172
Building tree for all the packages and classes...
Generating /home/tomcat/.jenkins/jobs/oxTrust_3.1.6/workspace/openid-auth-client/target/site/apidocs/org/gluu/oxauth/client/exception/CommunicationException.html...
Generating /home/tomcat/.jenkins/jobs/oxTrust_3.1.6/workspace/openid-auth-client/target/site/apidocs/org/gluu/oxauth/client/conf/AppConfiguration.html...
Generating /home/tomcat/.jenkins/jobs/oxTrust_3.1.6/workspace/openid-auth-client/target/site/apidocs/org/gluu/oxauth/client/conf/ClaimToAttributeMapping.html...
Generating /home/tomcat/.jenkins/jobs/oxTrust_3.1.6/workspace/openid-auth-client/target/site/apidocs/org/gluu/oxauth/client/conf/Configuration.html...
Generating /home/tomcat/.jenkins/jobs/oxTrust_3.1.6/workspace/openid-auth-client/target/site/apidocs/org/gluu/oxauth/client/conf/LdapAppConfiguration.html...
Generating /home/tomcat/.jenkins/jobs/oxTrust_3.1.6/workspace/openid-auth-client/target/site/apidocs/org/gluu/oxauth/client/Client.html...
Generating /home/tomcat/.jenkins/jobs/oxTrust_3.1.6/workspace/openid-auth-client/target/site/apidocs/org/gluu/oxauth/client/OpenIdClient.html...
Generating /home/tomcat/.jenkins/jobs/oxTrust_3.1.6/workspace/openid-auth-client/target/site/apidocs/org/gluu/oxauth/client/auth/principal/OpenIdCredentials.html...
Generating /home/tomcat/.jenkins/jobs/oxTrust_3.1.6/workspace/openid-auth-client/target/site/apidocs/org/gluu/oxauth/client/auth/user/CommonProfile.html...
Generating /home/tomcat/.jenkins/jobs/oxTrust_3.1.6/workspace/openid-auth-client/target/site/apidocs/org/gluu/oxauth/client/auth/user/UserProfile.html...
Generating /home/tomcat/.jenkins/jobs/oxTrust_3.1.6/workspace/openid-auth-client/target/site/apidocs/overview-frame.html...
Generating /home/tomcat/.jenkins/jobs/oxTrust_3.1.6/workspace/openid-auth-client/target/site/apidocs/org/gluu/oxauth/client/package-frame.html...
Generating /home/tomcat/.jenkins/jobs/oxTrust_3.1.6/workspace/openid-auth-client/target/site/apidocs/org/gluu/oxauth/client/package-summary.html...
Generating /home/tomcat/.jenkins/jobs/oxTrust_3.1.6/workspace/openid-auth-client/target/site/apidocs/org/gluu/oxauth/client/package-tree.html...
Generating /home/tomcat/.jenkins/jobs/oxTrust_3.1.6/workspace/openid-auth-client/target/site/apidocs/org/gluu/oxauth/client/auth/principal/package-frame.html...
Generating /home/tomcat/.jenkins/jobs/oxTrust_3.1.6/workspace/openid-auth-client/target/site/apidocs/org/gluu/oxauth/client/auth/principal/package-summary.html...
Generating /home/tomcat/.jenkins/jobs/oxTrust_3.1.6/workspace/openid-auth-client/target/site/apidocs/org/gluu/oxauth/client/auth/principal/package-tree.html...
Generating /home/tomcat/.jenkins/jobs/oxTrust_3.1.6/workspace/openid-auth-client/target/site/apidocs/org/gluu/oxauth/client/auth/user/package-frame.html...
Generating /home/tomcat/.jenkins/jobs/oxTrust_3.1.6/workspace/openid-auth-client/target/site/apidocs/org/gluu/oxauth/client/auth/user/package-summary.html...
Generating /home/tomcat/.jenkins/jobs/oxTrust_3.1.6/workspace/openid-auth-client/target/site/apidocs/org/gluu/oxauth/client/auth/user/package-tree.html...
Generating /home/tomcat/.jenkins/jobs/oxTrust_3.1.6/workspace/openid-auth-client/target/site/apidocs/org/gluu/oxauth/client/conf/package-frame.html...
Generating /home/tomcat/.jenkins/jobs/oxTrust_3.1.6/workspace/openid-auth-client/target/site/apidocs/org/gluu/oxauth/client/conf/package-summary.html...
Generating /home/tomcat/.jenkins/jobs/oxTrust_3.1.6/workspace/openid-auth-client/target/site/apidocs/org/gluu/oxauth/client/conf/package-tree.html...
Generating /home/tomcat/.jenkins/jobs/oxTrust_3.1.6/workspace/openid-auth-client/target/site/apidocs/org/gluu/oxauth/client/exception/package-frame.html...
Generating /home/tomcat/.jenkins/jobs/oxTrust_3.1.6/workspace/openid-auth-client/target/site/apidocs/org/gluu/oxauth/client/exception/package-summary.html...
Generating /home/tomcat/.jenkins/jobs/oxTrust_3.1.6/workspace/openid-auth-client/target/site/apidocs/org/gluu/oxauth/client/exception/package-tree.html...
Generating /home/tomcat/.jenkins/jobs/oxTrust_3.1.6/workspace/openid-auth-client/target/site/apidocs/constant-values.html...
Generating /home/tomcat/.jenkins/jobs/oxTrust_3.1.6/workspace/openid-auth-client/target/site/apidocs/serialized-form.html...
Generating /home/tomcat/.jenkins/jobs/oxTrust_3.1.6/workspace/openid-auth-client/target/site/apidocs/org/gluu/oxauth/client/exception/class-use/CommunicationException.html...
Generating /home/tomcat/.jenkins/jobs/oxTrust_3.1.6/workspace/openid-auth-client/target/site/apidocs/org/gluu/oxauth/client/conf/class-use/Configuration.html...
Generating /home/tomcat/.jenkins/jobs/oxTrust_3.1.6/workspace/openid-auth-client/target/site/apidocs/org/gluu/oxauth/client/conf/class-use/AppConfiguration.html...
Generating /home/tomcat/.jenkins/jobs/oxTrust_3.1.6/workspace/openid-auth-client/target/site/apidocs/org/gluu/oxauth/client/conf/class-use/ClaimToAttributeMapping.html...
Generating /home/tomcat/.jenkins/jobs/oxTrust_3.1.6/workspace/openid-auth-client/target/site/apidocs/org/gluu/oxauth/client/conf/class-use/LdapAppConfiguration.html...
Generating /home/tomcat/.jenkins/jobs/oxTrust_3.1.6/workspace/openid-auth-client/target/site/apidocs/org/gluu/oxauth/client/class-use/Client.html...
Generating /home/tomcat/.jenkins/jobs/oxTrust_3.1.6/workspace/openid-auth-client/target/site/apidocs/org/gluu/oxauth/client/class-use/OpenIdClient.html...
Generating /home/tomcat/.jenkins/jobs/oxTrust_3.1.6/workspace/openid-auth-client/target/site/apidocs/org/gluu/oxauth/client/auth/principal/class-use/OpenIdCredentials.html...
Generating /home/tomcat/.jenkins/jobs/oxTrust_3.1.6/workspace/openid-auth-client/target/site/apidocs/org/gluu/oxauth/client/auth/user/class-use/CommonProfile.html...
Generating /home/tomcat/.jenkins/jobs/oxTrust_3.1.6/workspace/openid-auth-client/target/site/apidocs/org/gluu/oxauth/client/auth/user/class-use/UserProfile.html...
Generating /home/tomcat/.jenkins/jobs/oxTrust_3.1.6/workspace/openid-auth-client/target/site/apidocs/org/gluu/oxauth/client/package-use.html...
Generating /home/tomcat/.jenkins/jobs/oxTrust_3.1.6/workspace/openid-auth-client/target/site/apidocs/org/gluu/oxauth/client/auth/principal/package-use.html...
Generating /home/tomcat/.jenkins/jobs/oxTrust_3.1.6/workspace/openid-auth-client/target/site/apidocs/org/gluu/oxauth/client/auth/user/package-use.html...
Generating /home/tomcat/.jenkins/jobs/oxTrust_3.1.6/workspace/openid-auth-client/target/site/apidocs/org/gluu/oxauth/client/conf/package-use.html...
Generating /home/tomcat/.jenkins/jobs/oxTrust_3.1.6/workspace/openid-auth-client/target/site/apidocs/org/gluu/oxauth/client/exception/package-use.html...
Building index for all the packages and classes...
Generating /home/tomcat/.jenkins/jobs/oxTrust_3.1.6/workspace/openid-auth-client/target/site/apidocs/overview-tree.html...
Generating /home/tomcat/.jenkins/jobs/oxTrust_3.1.6/workspace/openid-auth-client/target/site/apidocs/index-all.html...
Generating /home/tomcat/.jenkins/jobs/oxTrust_3.1.6/workspace/openid-auth-client/target/site/apidocs/deprecated-list.html...
Building index for all classes...
Generating /home/tomcat/.jenkins/jobs/oxTrust_3.1.6/workspace/openid-auth-client/target/site/apidocs/allclasses-frame.html...
Generating /home/tomcat/.jenkins/jobs/oxTrust_3.1.6/workspace/openid-auth-client/target/site/apidocs/allclasses-noframe.html...
Generating /home/tomcat/.jenkins/jobs/oxTrust_3.1.6/workspace/openid-auth-client/target/site/apidocs/index.html...
Generating /home/tomcat/.jenkins/jobs/oxTrust_3.1.6/workspace/openid-auth-client/target/site/apidocs/overview-summary.html...
Generating /home/tomcat/.jenkins/jobs/oxTrust_3.1.6/workspace/openid-auth-client/target/site/apidocs/help-doc.html...
1 error
14 warnings
[ERROR] Error while creating javadoc report: 
Exit code: 1 - /home/tomcat/.jenkins/jobs/oxTrust_3.1.6/workspace/openid-auth-client/src/main/java/org/gluu/oxauth/client/Client.java:32: warning: no description for @param
	 * @param context
	   ^
/home/tomcat/.jenkins/jobs/oxTrust_3.1.6/workspace/openid-auth-client/src/main/java/org/gluu/oxauth/client/Client.java:40: warning: no description for @param
     * @param context
       ^
/home/tomcat/.jenkins/jobs/oxTrust_3.1.6/workspace/openid-auth-client/src/main/java/org/gluu/oxauth/client/Client.java:41: warning: no description for @param
     * @param customStateParameters
       ^
/home/tomcat/.jenkins/jobs/oxTrust_3.1.6/workspace/openid-auth-client/src/main/java/org/gluu/oxauth/client/Client.java:42: warning: no description for @param
     * @param customParameters
       ^
/home/tomcat/.jenkins/jobs/oxTrust_3.1.6/workspace/openid-auth-client/src/main/java/org/gluu/oxauth/client/Client.java:45: warning: no @param for force
	public String getRedirectionUrl(final WebContext context, Map<String, String> customStateParameters, final Map<String, String> customParameters, final boolean force);
	              ^
/home/tomcat/.jenkins/jobs/oxTrust_3.1.6/workspace/openid-auth-client/src/main/java/org/gluu/oxauth/client/Client.java:50: warning: no description for @param
     * @param context
       ^
/home/tomcat/.jenkins/jobs/oxTrust_3.1.6/workspace/openid-auth-client/src/main/java/org/gluu/oxauth/client/Client.java:58: warning: no description for @param
	 * @param context
	   ^
/home/tomcat/.jenkins/jobs/oxTrust_3.1.6/workspace/openid-auth-client/src/main/java/org/gluu/oxauth/client/Client.java:66: warning: no description for @param
     * @param context
       ^
/home/tomcat/.jenkins/jobs/oxTrust_3.1.6/workspace/openid-auth-client/src/main/java/org/gluu/oxauth/client/Client.java:74: warning: no description for @param
     * @param context
       ^
/home/tomcat/.jenkins/jobs/oxTrust_3.1.6/workspace/openid-auth-client/src/main/java/org/gluu/oxauth/client/Client.java:75: error: invalid use of @return
     * @return result of check
       ^
/home/tomcat/.jenkins/jobs/oxTrust_3.1.6/workspace/openid-auth-client/src/main/java/org/gluu/oxauth/client/Client.java:82: warning: no description for @param
	 * @param context
	   ^
/home/tomcat/.jenkins/jobs/oxTrust_3.1.6/workspace/openid-auth-client/src/main/java/org/gluu/oxauth/client/Client.java:90: warning: no description for @param
     * @param context
       ^
/home/tomcat/.jenkins/jobs/oxTrust_3.1.6/workspace/openid-auth-client/src/main/java/org/gluu/oxauth/client/Client.java:98: warning: no description for @param
	 * @param context
	   ^
/home/tomcat/.jenkins/jobs/oxTrust_3.1.6/workspace/openid-auth-client/src/main/java/org/gluu/oxauth/client/Client.java:106: warning: no description for @param
	 * @param credentials
	   ^
/home/tomcat/.jenkins/jobs/oxTrust_3.1.6/workspace/openid-auth-client/src/main/java/org/gluu/oxauth/client/Client.java:107: warning: no description for @param
	 * @param context
	   ^

Command line was: /home/tomcat/.jenkins/tools/hudson.model.JDK/jdk_1.8.0_172/jre/../bin/javadoc @options @packages

Refer to the generated Javadoc files in '/home/tomcat/.jenkins/jobs/oxTrust_3.1.6/workspace/openid-auth-client/target/site/apidocs' dir.

org.apache.maven.reporting.MavenReportException: 
Exit code: 1 - /home/tomcat/.jenkins/jobs/oxTrust_3.1.6/workspace/openid-auth-client/src/main/java/org/gluu/oxauth/client/Client.java:32: warning: no description for @param
	 * @param context
	   ^
/home/tomcat/.jenkins/jobs/oxTrust_3.1.6/workspace/openid-auth-client/src/main/java/org/gluu/oxauth/client/Client.java:40: warning: no description for @param
     * @param context
       ^
/home/tomcat/.jenkins/jobs/oxTrust_3.1.6/workspace/openid-auth-client/src/main/java/org/gluu/oxauth/client/Client.java:41: warning: no description for @param
     * @param customStateParameters
       ^
/home/tomcat/.jenkins/jobs/oxTrust_3.1.6/workspace/openid-auth-client/src/main/java/org/gluu/oxauth/client/Client.java:42: warning: no description for @param
     * @param customParameters
       ^
/home/tomcat/.jenkins/jobs/oxTrust_3.1.6/workspace/openid-auth-client/src/main/java/org/gluu/oxauth/client/Client.java:45: warning: no @param for force
	public String getRedirectionUrl(final WebContext context, Map<String, String> customStateParameters, final Map<String, String> customParameters, final boolean force);
	              ^
/home/tomcat/.jenkins/jobs/oxTrust_3.1.6/workspace/openid-auth-client/src/main/java/org/gluu/oxauth/client/Client.java:50: warning: no description for @param
     * @param context
       ^
/home/tomcat/.jenkins/jobs/oxTrust_3.1.6/workspace/openid-auth-client/src/main/java/org/gluu/oxauth/client/Client.java:58: warning: no description for @param
	 * @param context
	   ^
/home/tomcat/.jenkins/jobs/oxTrust_3.1.6/workspace/openid-auth-client/src/main/java/org/gluu/oxauth/client/Client.java:66: warning: no description for @param
     * @param context
       ^
/home/tomcat/.jenkins/jobs/oxTrust_3.1.6/workspace/openid-auth-client/src/main/java/org/gluu/oxauth/client/Client.java:74: warning: no description for @param
     * @param context
       ^
/home/tomcat/.jenkins/jobs/oxTrust_3.1.6/workspace/openid-auth-client/src/main/java/org/gluu/oxauth/client/Client.java:75: error: invalid use of @return
     * @return result of check
       ^
/home/tomcat/.jenkins/jobs/oxTrust_3.1.6/workspace/openid-auth-client/src/main/java/org/gluu/oxauth/client/Client.java:82: warning: no description for @param
	 * @param context
	   ^
/home/tomcat/.jenkins/jobs/oxTrust_3.1.6/workspace/openid-auth-client/src/main/java/org/gluu/oxauth/client/Client.java:90: warning: no description for @param
     * @param context
       ^
/home/tomcat/.jenkins/jobs/oxTrust_3.1.6/workspace/openid-auth-client/src/main/java/org/gluu/oxauth/client/Client.java:98: warning: no description for @param
	 * @param context
	   ^
/home/tomcat/.jenkins/jobs/oxTrust_3.1.6/workspace/openid-auth-client/src/main/java/org/gluu/oxauth/client/Client.java:106: warning: no description for @param
	 * @param credentials
	   ^
/home/tomcat/.jenkins/jobs/oxTrust_3.1.6/workspace/openid-auth-client/src/main/java/org/gluu/oxauth/client/Client.java:107: warning: no description for @param
	 * @param context
	   ^

Command line was: /home/tomcat/.jenkins/tools/hudson.model.JDK/jdk_1.8.0_172/jre/../bin/javadoc @options @packages

Refer to the generated Javadoc files in '/home/tomcat/.jenkins/jobs/oxTrust_3.1.6/workspace/openid-auth-client/target/site/apidocs' dir.

	at org.apache.maven.plugins.javadoc.AbstractJavadocMojo.executeJavadocCommandLine(AbstractJavadocMojo.java:5298)
	at org.apache.maven.plugins.javadoc.AbstractJavadocMojo.executeReport(AbstractJavadocMojo.java:2134)
	at org.apache.maven.plugins.javadoc.JavadocReport.generate(JavadocReport.java:134)
	at org.apache.maven.plugins.javadoc.JavadocReport.doExecute(JavadocReport.java:329)
	at org.apache.maven.plugins.javadoc.AbstractJavadocMojo.execute(AbstractJavadocMojo.java:1912)
	at org.apache.maven.plugin.DefaultBuildPluginManager.executeMojo(DefaultBuildPluginManager.java:134)
	at org.apache.maven.lifecycle.internal.MojoExecutor.execute(MojoExecutor.java:207)
	at org.apache.maven.lifecycle.internal.MojoExecutor.execute(MojoExecutor.java:153)
	at org.apache.maven.lifecycle.internal.MojoExecutor.execute(MojoExecutor.java:145)
	at org.apache.maven.lifecycle.internal.LifecycleModuleBuilder.buildProject(LifecycleModuleBuilder.java:116)
	at org.apache.maven.lifecycle.internal.LifecycleModuleBuilder.buildProject(LifecycleModuleBuilder.java:80)
	at org.apache.maven.lifecycle.internal.builder.singlethreaded.SingleThreadedBuilder.build(SingleThreadedBuilder.java:51)
	at org.apache.maven.lifecycle.internal.LifecycleStarter.execute(LifecycleStarter.java:128)
	at org.apache.maven.DefaultMaven.doExecute(DefaultMaven.java:307)
	at org.apache.maven.DefaultMaven.doExecute(DefaultMaven.java:193)
	at org.apache.maven.DefaultMaven.execute(DefaultMaven.java:106)
	at org.apache.maven.cli.MavenCli.execute(MavenCli.java:863)
	at org.apache.maven.cli.MavenCli.doMain(MavenCli.java:288)
	at org.apache.maven.cli.MavenCli.main(MavenCli.java:199)
	at sun.reflect.NativeMethodAccessorImpl.invoke0(Native Method)
	at sun.reflect.NativeMethodAccessorImpl.invoke(NativeMethodAccessorImpl.java:62)
	at sun.reflect.DelegatingMethodAccessorImpl.invoke(DelegatingMethodAccessorImpl.java:43)
	at java.lang.reflect.Method.invoke(Method.java:498)
	at org.codehaus.plexus.classworlds.launcher.Launcher.launchEnhanced(Launcher.java:289)
	at org.codehaus.plexus.classworlds.launcher.Launcher.launch(Launcher.java:229)
	at org.codehaus.plexus.classworlds.launcher.Launcher.mainWithExitCode(Launcher.java:415)
	at org.codehaus.plexus.classworlds.launcher.Launcher.main(Launcher.java:356)
[INFO] 
[INFO] --- maven-site-plugin:2.1.1:site (default-site) @ openid-auth-client ---
[INFO]                                                                         
[INFO] ------------------------------------------------------------------------
[INFO] Building oxtrust-scim 3.1.6.sp2
[INFO] ------------------------------------------------------------------------
[INFO] 
[INFO] --- maven-clean-plugin:2.5:clean (default-clean) @ oxtrust-scim ---
[INFO] Deleting /home/tomcat/.jenkins/jobs/oxTrust_3.1.6/workspace/scim/target
[INFO] 
[INFO] --- maven-resources-plugin:2.6:resources (default-resources) @ oxtrust-scim ---
[INFO] Using 'UTF-8' encoding to copy filtered resources.
[INFO] skip non existing resourceDirectory /home/tomcat/.jenkins/jobs/oxTrust_3.1.6/workspace/scim/src/main/resources
[INFO] 
[INFO] --- maven-compiler-plugin:2.3.2:compile (default-compile) @ oxtrust-scim ---
[INFO] Compiling 65 source files to /home/tomcat/.jenkins/jobs/oxTrust_3.1.6/workspace/scim/target/classes
[INFO] 
[INFO] --- maven-resources-plugin:2.6:resources (default-resources) @ oxtrust-scim ---
[INFO] Using 'UTF-8' encoding to copy filtered resources.
[INFO] skip non existing resourceDirectory /home/tomcat/.jenkins/jobs/oxTrust_3.1.6/workspace/scim/src/main/resources
[INFO] 
[INFO] --- maven-compiler-plugin:2.3.2:compile (default-compile) @ oxtrust-scim ---
[INFO] Compiling 6 source files to /home/tomcat/.jenkins/jobs/oxTrust_3.1.6/workspace/scim/target/classes
[INFO] 
[INFO] --- maven-resources-plugin:2.6:testResources (default-testResources) @ oxtrust-scim ---
[INFO] Using 'UTF-8' encoding to copy filtered resources.
[INFO] skip non existing resourceDirectory /home/tomcat/.jenkins/jobs/oxTrust_3.1.6/workspace/scim/src/test/resources
[INFO] 
[INFO] --- maven-compiler-plugin:2.3.2:testCompile (default-testCompile) @ oxtrust-scim ---
[INFO] No sources to compile
[INFO] 
[INFO] --- maven-surefire-plugin:2.19.1:test (default-test) @ oxtrust-scim ---
[INFO] No tests to run.
[INFO] 
[INFO] --- maven-jar-plugin:2.4:jar (default-jar) @ oxtrust-scim ---
[INFO] Building jar: /home/tomcat/.jenkins/jobs/oxTrust_3.1.6/workspace/scim/target/oxtrust-scim-3.1.6.sp2.jar
[INFO] 
[INFO] --- maven-jar-plugin:2.4:test-jar (default) @ oxtrust-scim ---
[WARNING] JAR will be empty - no content was marked for inclusion!
[INFO] Building jar: /home/tomcat/.jenkins/jobs/oxTrust_3.1.6/workspace/scim/target/oxtrust-scim-3.1.6.sp2-tests.jar
[INFO] 
[INFO] --- maven-install-plugin:2.3.1:install (default-install) @ oxtrust-scim ---
[INFO] Installing /home/tomcat/.jenkins/jobs/oxTrust_3.1.6/workspace/scim/target/oxtrust-scim-3.1.6.sp2.jar to /var/www/html/maven/org/xdi/oxtrust-scim/3.1.6.sp2/oxtrust-scim-3.1.6.sp2.jar
[INFO] Installing /home/tomcat/.jenkins/jobs/oxTrust_3.1.6/workspace/scim/pom.xml to /var/www/html/maven/org/xdi/oxtrust-scim/3.1.6.sp2/oxtrust-scim-3.1.6.sp2.pom
[INFO] Installing /home/tomcat/.jenkins/jobs/oxTrust_3.1.6/workspace/scim/target/oxtrust-scim-3.1.6.sp2-tests.jar to /var/www/html/maven/org/xdi/oxtrust-scim/3.1.6.sp2/oxtrust-scim-3.1.6.sp2-tests.jar
[INFO] 
[INFO] --- findbugs-maven-plugin:3.0.4:findbugs (default-cli) @ oxtrust-scim ---
[INFO] Fork Value is true
     [java] Warnings generated: 23
[INFO] Done FindBugs Analysis....
[INFO] 
[INFO] >>> maven-javadoc-plugin:3.0.1:javadoc (default-cli) > generate-sources @ oxtrust-scim >>>
[INFO] 
[INFO] <<< maven-javadoc-plugin:3.0.1:javadoc (default-cli) < generate-sources @ oxtrust-scim <<<
[INFO] 
[INFO] --- maven-javadoc-plugin:3.0.1:javadoc (default-cli) @ oxtrust-scim ---
[INFO] 
Loading source files for package org.xdi.model...
Loading source files for package org.gluu.oxtrust.ws.rs.scim2...
Loading source files for package org.gluu.oxtrust.model.exception...
Loading source files for package org.gluu.oxtrust.model.scim2...
Loading source files for package org.gluu.oxtrust.model.scim2.extensions...
Loading source files for package org.gluu.oxtrust.model.scim2.bulk...
Loading source files for package org.gluu.oxtrust.model.scim2.annotations...
Loading source files for package org.gluu.oxtrust.model.scim2.fido...
Loading source files for package org.gluu.oxtrust.model.scim2.patch...
Loading source files for package org.gluu.oxtrust.model.scim2.group...
Loading source files for package org.gluu.oxtrust.model.scim2.util...
Loading source files for package org.gluu.oxtrust.model.scim2.user...
Loading source files for package org.gluu.oxtrust.model.scim2.provider.schema...
Loading source files for package org.gluu.oxtrust.model.scim2.provider.config...
Loading source files for package org.gluu.oxtrust.model.scim2.provider.resourcetypes...
Constructing Javadoc information...
Standard Doclet version 1.8.0_172
Building tree for all the packages and classes...
Generating /home/tomcat/.jenkins/jobs/oxTrust_3.1.6/workspace/scim/target/site/apidocs/org/xdi/model/GluuAttributeDataType.html...
Generating /home/tomcat/.jenkins/jobs/oxTrust_3.1.6/workspace/scim/target/site/apidocs/org/gluu/oxtrust/ws/rs/scim2/IFidoDeviceWebService.html...
Generating /home/tomcat/.jenkins/jobs/oxTrust_3.1.6/workspace/scim/target/site/apidocs/org/gluu/oxtrust/ws/rs/scim2/IGroupWebService.html...
Generating /home/tomcat/.jenkins/jobs/oxTrust_3.1.6/workspace/scim/target/site/apidocs/org/gluu/oxtrust/ws/rs/scim2/IUserWebService.html...
Generating /home/tomcat/.jenkins/jobs/oxTrust_3.1.6/workspace/scim/target/site/apidocs/org/gluu/oxtrust/ws/rs/scim2/PATCH.html...
Generating /home/tomcat/.jenkins/jobs/oxTrust_3.1.6/workspace/scim/target/site/apidocs/org/gluu/oxtrust/model/exception/SCIMException.html...
Generating /home/tomcat/.jenkins/jobs/oxTrust_3.1.6/workspace/scim/target/site/apidocs/org/gluu/oxtrust/model/scim2/AttributeDefinition.html...
Generating /home/tomcat/.jenkins/jobs/oxTrust_3.1.6/workspace/scim/target/site/apidocs/org/gluu/oxtrust/model/scim2/AttributeDefinition.Mutability.html...
Generating /home/tomcat/.jenkins/jobs/oxTrust_3.1.6/workspace/scim/target/site/apidocs/org/gluu/oxtrust/model/scim2/AttributeDefinition.Returned.html...
Generating /home/tomcat/.jenkins/jobs/oxTrust_3.1.6/workspace/scim/target/site/apidocs/org/gluu/oxtrust/model/scim2/AttributeDefinition.Type.html...
Generating /home/tomcat/.jenkins/jobs/oxTrust_3.1.6/workspace/scim/target/site/apidocs/org/gluu/oxtrust/model/scim2/AttributeDefinition.Uniqueness.html...
Generating /home/tomcat/.jenkins/jobs/oxTrust_3.1.6/workspace/scim/target/site/apidocs/org/gluu/oxtrust/model/scim2/BaseScimResource.html...
Generating /home/tomcat/.jenkins/jobs/oxTrust_3.1.6/workspace/scim/target/site/apidocs/org/gluu/oxtrust/model/scim2/Constants.html...
Generating /home/tomcat/.jenkins/jobs/oxTrust_3.1.6/workspace/scim/target/site/apidocs/org/gluu/oxtrust/model/scim2/CustomAttributes.html...
Generating /home/tomcat/.jenkins/jobs/oxTrust_3.1.6/workspace/scim/target/site/apidocs/org/gluu/oxtrust/model/scim2/ErrorResponse.html...
Generating /home/tomcat/.jenkins/jobs/oxTrust_3.1.6/workspace/scim/target/site/apidocs/org/gluu/oxtrust/model/scim2/ErrorScimType.html...
Generating /home/tomcat/.jenkins/jobs/oxTrust_3.1.6/workspace/scim/target/site/apidocs/org/gluu/oxtrust/model/scim2/ListResponse.html...
Generating /home/tomcat/.jenkins/jobs/oxTrust_3.1.6/workspace/scim/target/site/apidocs/org/gluu/oxtrust/model/scim2/Meta.html...
Generating /home/tomcat/.jenkins/jobs/oxTrust_3.1.6/workspace/scim/target/site/apidocs/org/gluu/oxtrust/model/scim2/SearchRequest.html...
Generating /home/tomcat/.jenkins/jobs/oxTrust_3.1.6/workspace/scim/target/site/apidocs/org/gluu/oxtrust/model/scim2/Validations.html...
Generating /home/tomcat/.jenkins/jobs/oxTrust_3.1.6/workspace/scim/target/site/apidocs/org/gluu/oxtrust/model/scim2/extensions/Extension.html...
Generating /home/tomcat/.jenkins/jobs/oxTrust_3.1.6/workspace/scim/target/site/apidocs/org/gluu/oxtrust/model/scim2/extensions/ExtensionField.html...
Generating /home/tomcat/.jenkins/jobs/oxTrust_3.1.6/workspace/scim/target/site/apidocs/org/gluu/oxtrust/model/scim2/bulk/BulkBase.html...
Generating /home/tomcat/.jenkins/jobs/oxTrust_3.1.6/workspace/scim/target/site/apidocs/org/gluu/oxtrust/model/scim2/bulk/BulkOperation.html...
Generating /home/tomcat/.jenkins/jobs/oxTrust_3.1.6/workspace/scim/target/site/apidocs/org/gluu/oxtrust/model/scim2/bulk/BulkRequest.html...
Generating /home/tomcat/.jenkins/jobs/oxTrust_3.1.6/workspace/scim/target/site/apidocs/org/gluu/oxtrust/model/scim2/bulk/BulkResponse.html...
Generating /home/tomcat/.jenkins/jobs/oxTrust_3.1.6/workspace/scim/target/site/apidocs/org/gluu/oxtrust/model/scim2/annotations/Attribute.html...
Generating /home/tomcat/.jenkins/jobs/oxTrust_3.1.6/workspace/scim/target/site/apidocs/org/gluu/oxtrust/model/scim2/annotations/Schema.html...
Generating /home/tomcat/.jenkins/jobs/oxTrust_3.1.6/workspace/scim/target/site/apidocs/org/gluu/oxtrust/model/scim2/annotations/StoreReference.html...
Generating /home/tomcat/.jenkins/jobs/oxTrust_3.1.6/workspace/scim/target/site/apidocs/org/gluu/oxtrust/model/scim2/annotations/Validator.html...
Generating /home/tomcat/.jenkins/jobs/oxTrust_3.1.6/workspace/scim/target/site/apidocs/org/gluu/oxtrust/model/scim2/fido/FidoDeviceResource.html...
Generating /home/tomcat/.jenkins/jobs/oxTrust_3.1.6/workspace/scim/target/site/apidocs/org/gluu/oxtrust/model/scim2/patch/PatchOperation.html...
Generating /home/tomcat/.jenkins/jobs/oxTrust_3.1.6/workspace/scim/target/site/apidocs/org/gluu/oxtrust/model/scim2/patch/PatchOperationType.html...
Generating /home/tomcat/.jenkins/jobs/oxTrust_3.1.6/workspace/scim/target/site/apidocs/org/gluu/oxtrust/model/scim2/patch/PatchRequest.html...
Generating /home/tomcat/.jenkins/jobs/oxTrust_3.1.6/workspace/scim/target/site/apidocs/org/gluu/oxtrust/model/scim2/group/GroupResource.html...
Generating /home/tomcat/.jenkins/jobs/oxTrust_3.1.6/workspace/scim/target/site/apidocs/org/gluu/oxtrust/model/scim2/group/Member.html...
Generating /home/tomcat/.jenkins/jobs/oxTrust_3.1.6/workspace/scim/target/site/apidocs/org/gluu/oxtrust/model/scim2/util/DateUtil.html...
Generating /home/tomcat/.jenkins/jobs/oxTrust_3.1.6/workspace/scim/target/site/apidocs/org/gluu/oxtrust/model/scim2/util/IntrospectUtil.html...
Generating /home/tomcat/.jenkins/jobs/oxTrust_3.1.6/workspace/scim/target/site/apidocs/org/gluu/oxtrust/model/scim2/util/ResourceValidator.html...
Generating /home/tomcat/.jenkins/jobs/oxTrust_3.1.6/workspace/scim/target/site/apidocs/org/gluu/oxtrust/model/scim2/util/ScimResourceUtil.html...
Generating /home/tomcat/.jenkins/jobs/oxTrust_3.1.6/workspace/scim/target/site/apidocs/org/gluu/oxtrust/model/scim2/user/Address.html...
Generating /home/tomcat/.jenkins/jobs/oxTrust_3.1.6/workspace/scim/target/site/apidocs/org/gluu/oxtrust/model/scim2/user/Address.Type.html...
Generating /home/tomcat/.jenkins/jobs/oxTrust_3.1.6/workspace/scim/target/site/apidocs/org/gluu/oxtrust/model/scim2/user/Email.html...
Generating /home/tomcat/.jenkins/jobs/oxTrust_3.1.6/workspace/scim/target/site/apidocs/org/gluu/oxtrust/model/scim2/user/Email.Type.html...
Generating /home/tomcat/.jenkins/jobs/oxTrust_3.1.6/workspace/scim/target/site/apidocs/org/gluu/oxtrust/model/scim2/user/Entitlement.html...
Generating /home/tomcat/.jenkins/jobs/oxTrust_3.1.6/workspace/scim/target/site/apidocs/org/gluu/oxtrust/model/scim2/user/Group.html...
Generating /home/tomcat/.jenkins/jobs/oxTrust_3.1.6/workspace/scim/target/site/apidocs/org/gluu/oxtrust/model/scim2/user/Group.Type.html...
Generating /home/tomcat/.jenkins/jobs/oxTrust_3.1.6/workspace/scim/target/site/apidocs/org/gluu/oxtrust/model/scim2/user/InstantMessagingAddress.html...
Generating /home/tomcat/.jenkins/jobs/oxTrust_3.1.6/workspace/scim/target/site/apidocs/org/gluu/oxtrust/model/scim2/user/InstantMessagingAddress.Type.html...
Generating /home/tomcat/.jenkins/jobs/oxTrust_3.1.6/workspace/scim/target/site/apidocs/org/gluu/oxtrust/model/scim2/user/Name.html...
Generating /home/tomcat/.jenkins/jobs/oxTrust_3.1.6/workspace/scim/target/site/apidocs/org/gluu/oxtrust/model/scim2/user/PhoneNumber.html...
Generating /home/tomcat/.jenkins/jobs/oxTrust_3.1.6/workspace/scim/target/site/apidocs/org/gluu/oxtrust/model/scim2/user/PhoneNumber.Type.html...
Generating /home/tomcat/.jenkins/jobs/oxTrust_3.1.6/workspace/scim/target/site/apidocs/org/gluu/oxtrust/model/scim2/user/Photo.html...
Generating /home/tomcat/.jenkins/jobs/oxTrust_3.1.6/workspace/scim/target/site/apidocs/org/gluu/oxtrust/model/scim2/user/Photo.Type.html...
Generating /home/tomcat/.jenkins/jobs/oxTrust_3.1.6/workspace/scim/target/site/apidocs/org/gluu/oxtrust/model/scim2/user/Role.html...
Generating /home/tomcat/.jenkins/jobs/oxTrust_3.1.6/workspace/scim/target/site/apidocs/org/gluu/oxtrust/model/scim2/user/UserResource.html...
Generating /home/tomcat/.jenkins/jobs/oxTrust_3.1.6/workspace/scim/target/site/apidocs/org/gluu/oxtrust/model/scim2/user/X509Certificate.html...
Generating /home/tomcat/.jenkins/jobs/oxTrust_3.1.6/workspace/scim/target/site/apidocs/org/gluu/oxtrust/model/scim2/provider/schema/SchemaAttribute.html...
Generating /home/tomcat/.jenkins/jobs/oxTrust_3.1.6/workspace/scim/target/site/apidocs/org/gluu/oxtrust/model/scim2/provider/schema/SchemaResource.html...
Generating /home/tomcat/.jenkins/jobs/oxTrust_3.1.6/workspace/scim/target/site/apidocs/org/gluu/oxtrust/model/scim2/provider/config/AuthenticationScheme.html...
Generating /home/tomcat/.jenkins/jobs/oxTrust_3.1.6/workspace/scim/target/site/apidocs/org/gluu/oxtrust/model/scim2/provider/config/BulkConfig.html...
Generating /home/tomcat/.jenkins/jobs/oxTrust_3.1.6/workspace/scim/target/site/apidocs/org/gluu/oxtrust/model/scim2/provider/config/ChangePasswordConfig.html...
Generating /home/tomcat/.jenkins/jobs/oxTrust_3.1.6/workspace/scim/target/site/apidocs/org/gluu/oxtrust/model/scim2/provider/config/ETagConfig.html...
Generating /home/tomcat/.jenkins/jobs/oxTrust_3.1.6/workspace/scim/target/site/apidocs/org/gluu/oxtrust/model/scim2/provider/config/FilterConfig.html...
Generating /home/tomcat/.jenkins/jobs/oxTrust_3.1.6/workspace/scim/target/site/apidocs/org/gluu/oxtrust/model/scim2/provider/config/PatchConfig.html...
Generating /home/tomcat/.jenkins/jobs/oxTrust_3.1.6/workspace/scim/target/site/apidocs/org/gluu/oxtrust/model/scim2/provider/config/ServiceProviderConfig.html...
Generating /home/tomcat/.jenkins/jobs/oxTrust_3.1.6/workspace/scim/target/site/apidocs/org/gluu/oxtrust/model/scim2/provider/config/SortConfig.html...
Generating /home/tomcat/.jenkins/jobs/oxTrust_3.1.6/workspace/scim/target/site/apidocs/org/gluu/oxtrust/model/scim2/provider/resourcetypes/ResourceType.html...
Generating /home/tomcat/.jenkins/jobs/oxTrust_3.1.6/workspace/scim/target/site/apidocs/org/gluu/oxtrust/model/scim2/provider/resourcetypes/SchemaExtensionHolder.html...
Generating /home/tomcat/.jenkins/jobs/oxTrust_3.1.6/workspace/scim/target/site/apidocs/overview-frame.html...
Generating /home/tomcat/.jenkins/jobs/oxTrust_3.1.6/workspace/scim/target/site/apidocs/org/gluu/oxtrust/model/exception/package-frame.html...
Generating /home/tomcat/.jenkins/jobs/oxTrust_3.1.6/workspace/scim/target/site/apidocs/org/gluu/oxtrust/model/exception/package-summary.html...
Generating /home/tomcat/.jenkins/jobs/oxTrust_3.1.6/workspace/scim/target/site/apidocs/org/gluu/oxtrust/model/exception/package-tree.html...
Generating /home/tomcat/.jenkins/jobs/oxTrust_3.1.6/workspace/scim/target/site/apidocs/org/gluu/oxtrust/model/scim2/package-frame.html...
Generating /home/tomcat/.jenkins/jobs/oxTrust_3.1.6/workspace/scim/target/site/apidocs/org/gluu/oxtrust/model/scim2/package-summary.html...
Generating /home/tomcat/.jenkins/jobs/oxTrust_3.1.6/workspace/scim/target/site/apidocs/org/gluu/oxtrust/model/scim2/package-tree.html...
Generating /home/tomcat/.jenkins/jobs/oxTrust_3.1.6/workspace/scim/target/site/apidocs/org/gluu/oxtrust/model/scim2/annotations/package-frame.html...
Generating /home/tomcat/.jenkins/jobs/oxTrust_3.1.6/workspace/scim/target/site/apidocs/org/gluu/oxtrust/model/scim2/annotations/package-summary.html...
Generating /home/tomcat/.jenkins/jobs/oxTrust_3.1.6/workspace/scim/target/site/apidocs/org/gluu/oxtrust/model/scim2/annotations/package-tree.html...
Generating /home/tomcat/.jenkins/jobs/oxTrust_3.1.6/workspace/scim/target/site/apidocs/org/gluu/oxtrust/model/scim2/bulk/package-frame.html...
Generating /home/tomcat/.jenkins/jobs/oxTrust_3.1.6/workspace/scim/target/site/apidocs/org/gluu/oxtrust/model/scim2/bulk/package-summary.html...
Generating /home/tomcat/.jenkins/jobs/oxTrust_3.1.6/workspace/scim/target/site/apidocs/org/gluu/oxtrust/model/scim2/bulk/package-tree.html...
Generating /home/tomcat/.jenkins/jobs/oxTrust_3.1.6/workspace/scim/target/site/apidocs/org/gluu/oxtrust/model/scim2/extensions/package-frame.html...
Generating /home/tomcat/.jenkins/jobs/oxTrust_3.1.6/workspace/scim/target/site/apidocs/org/gluu/oxtrust/model/scim2/extensions/package-summary.html...
Generating /home/tomcat/.jenkins/jobs/oxTrust_3.1.6/workspace/scim/target/site/apidocs/org/gluu/oxtrust/model/scim2/extensions/package-tree.html...
Generating /home/tomcat/.jenkins/jobs/oxTrust_3.1.6/workspace/scim/target/site/apidocs/org/gluu/oxtrust/model/scim2/fido/package-frame.html...
Generating /home/tomcat/.jenkins/jobs/oxTrust_3.1.6/workspace/scim/target/site/apidocs/org/gluu/oxtrust/model/scim2/fido/package-summary.html...
Generating /home/tomcat/.jenkins/jobs/oxTrust_3.1.6/workspace/scim/target/site/apidocs/org/gluu/oxtrust/model/scim2/fido/package-tree.html...
Generating /home/tomcat/.jenkins/jobs/oxTrust_3.1.6/workspace/scim/target/site/apidocs/org/gluu/oxtrust/model/scim2/group/package-frame.html...
Generating /home/tomcat/.jenkins/jobs/oxTrust_3.1.6/workspace/scim/target/site/apidocs/org/gluu/oxtrust/model/scim2/group/package-summary.html...
Generating /home/tomcat/.jenkins/jobs/oxTrust_3.1.6/workspace/scim/target/site/apidocs/org/gluu/oxtrust/model/scim2/group/package-tree.html...
Generating /home/tomcat/.jenkins/jobs/oxTrust_3.1.6/workspace/scim/target/site/apidocs/org/gluu/oxtrust/model/scim2/patch/package-frame.html...
Generating /home/tomcat/.jenkins/jobs/oxTrust_3.1.6/workspace/scim/target/site/apidocs/org/gluu/oxtrust/model/scim2/patch/package-summary.html...
Generating /home/tomcat/.jenkins/jobs/oxTrust_3.1.6/workspace/scim/target/site/apidocs/org/gluu/oxtrust/model/scim2/patch/package-tree.html...
Generating /home/tomcat/.jenkins/jobs/oxTrust_3.1.6/workspace/scim/target/site/apidocs/org/gluu/oxtrust/model/scim2/provider/config/package-frame.html...
Generating /home/tomcat/.jenkins/jobs/oxTrust_3.1.6/workspace/scim/target/site/apidocs/org/gluu/oxtrust/model/scim2/provider/config/package-summary.html...
Generating /home/tomcat/.jenkins/jobs/oxTrust_3.1.6/workspace/scim/target/site/apidocs/org/gluu/oxtrust/model/scim2/provider/config/package-tree.html...
Generating /home/tomcat/.jenkins/jobs/oxTrust_3.1.6/workspace/scim/target/site/apidocs/org/gluu/oxtrust/model/scim2/provider/resourcetypes/package-frame.html...
Generating /home/tomcat/.jenkins/jobs/oxTrust_3.1.6/workspace/scim/target/site/apidocs/org/gluu/oxtrust/model/scim2/provider/resourcetypes/package-summary.html...
Generating /home/tomcat/.jenkins/jobs/oxTrust_3.1.6/workspace/scim/target/site/apidocs/org/gluu/oxtrust/model/scim2/provider/resourcetypes/package-tree.html...
Generating /home/tomcat/.jenkins/jobs/oxTrust_3.1.6/workspace/scim/target/site/apidocs/org/gluu/oxtrust/model/scim2/provider/schema/package-frame.html...
Generating /home/tomcat/.jenkins/jobs/oxTrust_3.1.6/workspace/scim/target/site/apidocs/org/gluu/oxtrust/model/scim2/provider/schema/package-summary.html...
Generating /home/tomcat/.jenkins/jobs/oxTrust_3.1.6/workspace/scim/target/site/apidocs/org/gluu/oxtrust/model/scim2/provider/schema/package-tree.html...
Generating /home/tomcat/.jenkins/jobs/oxTrust_3.1.6/workspace/scim/target/site/apidocs/org/gluu/oxtrust/model/scim2/user/package-frame.html...
Generating /home/tomcat/.jenkins/jobs/oxTrust_3.1.6/workspace/scim/target/site/apidocs/org/gluu/oxtrust/model/scim2/user/package-summary.html...
Generating /home/tomcat/.jenkins/jobs/oxTrust_3.1.6/workspace/scim/target/site/apidocs/org/gluu/oxtrust/model/scim2/user/package-tree.html...
Generating /home/tomcat/.jenkins/jobs/oxTrust_3.1.6/workspace/scim/target/site/apidocs/org/gluu/oxtrust/model/scim2/util/package-frame.html...
Generating /home/tomcat/.jenkins/jobs/oxTrust_3.1.6/workspace/scim/target/site/apidocs/org/gluu/oxtrust/model/scim2/util/package-summary.html...
Generating /home/tomcat/.jenkins/jobs/oxTrust_3.1.6/workspace/scim/target/site/apidocs/org/gluu/oxtrust/model/scim2/util/package-tree.html...
Generating /home/tomcat/.jenkins/jobs/oxTrust_3.1.6/workspace/scim/target/site/apidocs/org/gluu/oxtrust/ws/rs/scim2/package-frame.html...
Generating /home/tomcat/.jenkins/jobs/oxTrust_3.1.6/workspace/scim/target/site/apidocs/org/gluu/oxtrust/ws/rs/scim2/package-summary.html...
Generating /home/tomcat/.jenkins/jobs/oxTrust_3.1.6/workspace/scim/target/site/apidocs/org/gluu/oxtrust/ws/rs/scim2/package-tree.html...
Generating /home/tomcat/.jenkins/jobs/oxTrust_3.1.6/workspace/scim/target/site/apidocs/org/xdi/model/package-frame.html...
Generating /home/tomcat/.jenkins/jobs/oxTrust_3.1.6/workspace/scim/target/site/apidocs/org/xdi/model/package-summary.html...
Generating /home/tomcat/.jenkins/jobs/oxTrust_3.1.6/workspace/scim/target/site/apidocs/org/xdi/model/package-tree.html...
Generating /home/tomcat/.jenkins/jobs/oxTrust_3.1.6/workspace/scim/target/site/apidocs/constant-values.html...
Generating /home/tomcat/.jenkins/jobs/oxTrust_3.1.6/workspace/scim/target/site/apidocs/serialized-form.html...
Generating /home/tomcat/.jenkins/jobs/oxTrust_3.1.6/workspace/scim/target/site/apidocs/org/xdi/model/class-use/GluuAttributeDataType.html...
Generating /home/tomcat/.jenkins/jobs/oxTrust_3.1.6/workspace/scim/target/site/apidocs/org/gluu/oxtrust/ws/rs/scim2/class-use/PATCH.html...
Generating /home/tomcat/.jenkins/jobs/oxTrust_3.1.6/workspace/scim/target/site/apidocs/org/gluu/oxtrust/ws/rs/scim2/class-use/IFidoDeviceWebService.html...
Generating /home/tomcat/.jenkins/jobs/oxTrust_3.1.6/workspace/scim/target/site/apidocs/org/gluu/oxtrust/ws/rs/scim2/class-use/IGroupWebService.html...
Generating /home/tomcat/.jenkins/jobs/oxTrust_3.1.6/workspace/scim/target/site/apidocs/org/gluu/oxtrust/ws/rs/scim2/class-use/IUserWebService.html...
Generating /home/tomcat/.jenkins/jobs/oxTrust_3.1.6/workspace/scim/target/site/apidocs/org/gluu/oxtrust/model/exception/class-use/SCIMException.html...
Generating /home/tomcat/.jenkins/jobs/oxTrust_3.1.6/workspace/scim/target/site/apidocs/org/gluu/oxtrust/model/scim2/class-use/ErrorScimType.html...
Generating /home/tomcat/.jenkins/jobs/oxTrust_3.1.6/workspace/scim/target/site/apidocs/org/gluu/oxtrust/model/scim2/class-use/Constants.html...
Generating /home/tomcat/.jenkins/jobs/oxTrust_3.1.6/workspace/scim/target/site/apidocs/org/gluu/oxtrust/model/scim2/class-use/ListResponse.html...
Generating /home/tomcat/.jenkins/jobs/oxTrust_3.1.6/workspace/scim/target/site/apidocs/org/gluu/oxtrust/model/scim2/class-use/AttributeDefinition.html...
Generating /home/tomcat/.jenkins/jobs/oxTrust_3.1.6/workspace/scim/target/site/apidocs/org/gluu/oxtrust/model/scim2/class-use/AttributeDefinition.Type.html...
Generating /home/tomcat/.jenkins/jobs/oxTrust_3.1.6/workspace/scim/target/site/apidocs/org/gluu/oxtrust/model/scim2/class-use/AttributeDefinition.Mutability.html...
Generating /home/tomcat/.jenkins/jobs/oxTrust_3.1.6/workspace/scim/target/site/apidocs/org/gluu/oxtrust/model/scim2/class-use/AttributeDefinition.Returned.html...
Generating /home/tomcat/.jenkins/jobs/oxTrust_3.1.6/workspace/scim/target/site/apidocs/org/gluu/oxtrust/model/scim2/class-use/AttributeDefinition.Uniqueness.html...
Generating /home/tomcat/.jenkins/jobs/oxTrust_3.1.6/workspace/scim/target/site/apidocs/org/gluu/oxtrust/model/scim2/class-use/CustomAttributes.html...
Generating /home/tomcat/.jenkins/jobs/oxTrust_3.1.6/workspace/scim/target/site/apidocs/org/gluu/oxtrust/model/scim2/class-use/BaseScimResource.html...
Generating /home/tomcat/.jenkins/jobs/oxTrust_3.1.6/workspace/scim/target/site/apidocs/org/gluu/oxtrust/model/scim2/class-use/SearchRequest.html...
Generating /home/tomcat/.jenkins/jobs/oxTrust_3.1.6/workspace/scim/target/site/apidocs/org/gluu/oxtrust/model/scim2/class-use/ErrorResponse.html...
Generating /home/tomcat/.jenkins/jobs/oxTrust_3.1.6/workspace/scim/target/site/apidocs/org/gluu/oxtrust/model/scim2/class-use/Validations.html...
Generating /home/tomcat/.jenkins/jobs/oxTrust_3.1.6/workspace/scim/target/site/apidocs/org/gluu/oxtrust/model/scim2/class-use/Meta.html...
Generating /home/tomcat/.jenkins/jobs/oxTrust_3.1.6/workspace/scim/target/site/apidocs/org/gluu/oxtrust/model/scim2/extensions/class-use/Extension.html...
Generating /home/tomcat/.jenkins/jobs/oxTrust_3.1.6/workspace/scim/target/site/apidocs/org/gluu/oxtrust/model/scim2/extensions/class-use/ExtensionField.html...
Generating /home/tomcat/.jenkins/jobs/oxTrust_3.1.6/workspace/scim/target/site/apidocs/org/gluu/oxtrust/model/scim2/bulk/class-use/BulkBase.html...
Generating /home/tomcat/.jenkins/jobs/oxTrust_3.1.6/workspace/scim/target/site/apidocs/org/gluu/oxtrust/model/scim2/bulk/class-use/BulkOperation.html...
Generating /home/tomcat/.jenkins/jobs/oxTrust_3.1.6/workspace/scim/target/site/apidocs/org/gluu/oxtrust/model/scim2/bulk/class-use/BulkResponse.html...
Generating /home/tomcat/.jenkins/jobs/oxTrust_3.1.6/workspace/scim/target/site/apidocs/org/gluu/oxtrust/model/scim2/bulk/class-use/BulkRequest.html...
Generating /home/tomcat/.jenkins/jobs/oxTrust_3.1.6/workspace/scim/target/site/apidocs/org/gluu/oxtrust/model/scim2/annotations/class-use/Validator.html...
Generating /home/tomcat/.jenkins/jobs/oxTrust_3.1.6/workspace/scim/target/site/apidocs/org/gluu/oxtrust/model/scim2/annotations/class-use/Attribute.html...
Generating /home/tomcat/.jenkins/jobs/oxTrust_3.1.6/workspace/scim/target/site/apidocs/org/gluu/oxtrust/model/scim2/annotations/class-use/StoreReference.html...
Generating /home/tomcat/.jenkins/jobs/oxTrust_3.1.6/workspace/scim/target/site/apidocs/org/gluu/oxtrust/model/scim2/annotations/class-use/Schema.html...
Generating /home/tomcat/.jenkins/jobs/oxTrust_3.1.6/workspace/scim/target/site/apidocs/org/gluu/oxtrust/model/scim2/fido/class-use/FidoDeviceResource.html...
Generating /home/tomcat/.jenkins/jobs/oxTrust_3.1.6/workspace/scim/target/site/apidocs/org/gluu/oxtrust/model/scim2/patch/class-use/PatchOperation.html...
Generating /home/tomcat/.jenkins/jobs/oxTrust_3.1.6/workspace/scim/target/site/apidocs/org/gluu/oxtrust/model/scim2/patch/class-use/PatchOperationType.html...
Generating /home/tomcat/.jenkins/jobs/oxTrust_3.1.6/workspace/scim/target/site/apidocs/org/gluu/oxtrust/model/scim2/patch/class-use/PatchRequest.html...
Generating /home/tomcat/.jenkins/jobs/oxTrust_3.1.6/workspace/scim/target/site/apidocs/org/gluu/oxtrust/model/scim2/group/class-use/Member.html...
Generating /home/tomcat/.jenkins/jobs/oxTrust_3.1.6/workspace/scim/target/site/apidocs/org/gluu/oxtrust/model/scim2/group/class-use/GroupResource.html...
Generating /home/tomcat/.jenkins/jobs/oxTrust_3.1.6/workspace/scim/target/site/apidocs/org/gluu/oxtrust/model/scim2/util/class-use/ScimResourceUtil.html...
Generating /home/tomcat/.jenkins/jobs/oxTrust_3.1.6/workspace/scim/target/site/apidocs/org/gluu/oxtrust/model/scim2/util/class-use/DateUtil.html...
Generating /home/tomcat/.jenkins/jobs/oxTrust_3.1.6/workspace/scim/target/site/apidocs/org/gluu/oxtrust/model/scim2/util/class-use/IntrospectUtil.html...
Generating /home/tomcat/.jenkins/jobs/oxTrust_3.1.6/workspace/scim/target/site/apidocs/org/gluu/oxtrust/model/scim2/util/class-use/ResourceValidator.html...
Generating /home/tomcat/.jenkins/jobs/oxTrust_3.1.6/workspace/scim/target/site/apidocs/org/gluu/oxtrust/model/scim2/user/class-use/X509Certificate.html...
Generating /home/tomcat/.jenkins/jobs/oxTrust_3.1.6/workspace/scim/target/site/apidocs/org/gluu/oxtrust/model/scim2/user/class-use/PhoneNumber.html...
Generating /home/tomcat/.jenkins/jobs/oxTrust_3.1.6/workspace/scim/target/site/apidocs/org/gluu/oxtrust/model/scim2/user/class-use/PhoneNumber.Type.html...
Generating /home/tomcat/.jenkins/jobs/oxTrust_3.1.6/workspace/scim/target/site/apidocs/org/gluu/oxtrust/model/scim2/user/class-use/InstantMessagingAddress.html...
Generating /home/tomcat/.jenkins/jobs/oxTrust_3.1.6/workspace/scim/target/site/apidocs/org/gluu/oxtrust/model/scim2/user/class-use/InstantMessagingAddress.Type.html...
Generating /home/tomcat/.jenkins/jobs/oxTrust_3.1.6/workspace/scim/target/site/apidocs/org/gluu/oxtrust/model/scim2/user/class-use/Role.html...
Generating /home/tomcat/.jenkins/jobs/oxTrust_3.1.6/workspace/scim/target/site/apidocs/org/gluu/oxtrust/model/scim2/user/class-use/Group.html...
Generating /home/tomcat/.jenkins/jobs/oxTrust_3.1.6/workspace/scim/target/site/apidocs/org/gluu/oxtrust/model/scim2/user/class-use/Group.Type.html...
Generating /home/tomcat/.jenkins/jobs/oxTrust_3.1.6/workspace/scim/target/site/apidocs/org/gluu/oxtrust/model/scim2/user/class-use/Email.html...
Generating /home/tomcat/.jenkins/jobs/oxTrust_3.1.6/workspace/scim/target/site/apidocs/org/gluu/oxtrust/model/scim2/user/class-use/Email.Type.html...
Generating /home/tomcat/.jenkins/jobs/oxTrust_3.1.6/workspace/scim/target/site/apidocs/org/gluu/oxtrust/model/scim2/user/class-use/UserResource.html...
Generating /home/tomcat/.jenkins/jobs/oxTrust_3.1.6/workspace/scim/target/site/apidocs/org/gluu/oxtrust/model/scim2/user/class-use/Entitlement.html...
Generating /home/tomcat/.jenkins/jobs/oxTrust_3.1.6/workspace/scim/target/site/apidocs/org/gluu/oxtrust/model/scim2/user/class-use/Name.html...
Generating /home/tomcat/.jenkins/jobs/oxTrust_3.1.6/workspace/scim/target/site/apidocs/org/gluu/oxtrust/model/scim2/user/class-use/Photo.html...
Generating /home/tomcat/.jenkins/jobs/oxTrust_3.1.6/workspace/scim/target/site/apidocs/org/gluu/oxtrust/model/scim2/user/class-use/Photo.Type.html...
Generating /home/tomcat/.jenkins/jobs/oxTrust_3.1.6/workspace/scim/target/site/apidocs/org/gluu/oxtrust/model/scim2/user/class-use/Address.html...
Generating /home/tomcat/.jenkins/jobs/oxTrust_3.1.6/workspace/scim/target/site/apidocs/org/gluu/oxtrust/model/scim2/user/class-use/Address.Type.html...
Generating /home/tomcat/.jenkins/jobs/oxTrust_3.1.6/workspace/scim/target/site/apidocs/org/gluu/oxtrust/model/scim2/provider/schema/class-use/SchemaAttribute.html...
Generating /home/tomcat/.jenkins/jobs/oxTrust_3.1.6/workspace/scim/target/site/apidocs/org/gluu/oxtrust/model/scim2/provider/schema/class-use/SchemaResource.html...
Generating /home/tomcat/.jenkins/jobs/oxTrust_3.1.6/workspace/scim/target/site/apidocs/org/gluu/oxtrust/model/scim2/provider/config/class-use/ETagConfig.html...
Generating /home/tomcat/.jenkins/jobs/oxTrust_3.1.6/workspace/scim/target/site/apidocs/org/gluu/oxtrust/model/scim2/provider/config/class-use/ChangePasswordConfig.html...
Generating /home/tomcat/.jenkins/jobs/oxTrust_3.1.6/workspace/scim/target/site/apidocs/org/gluu/oxtrust/model/scim2/provider/config/class-use/ServiceProviderConfig.html...
Generating /home/tomcat/.jenkins/jobs/oxTrust_3.1.6/workspace/scim/target/site/apidocs/org/gluu/oxtrust/model/scim2/provider/config/class-use/SortConfig.html...
Generating /home/tomcat/.jenkins/jobs/oxTrust_3.1.6/workspace/scim/target/site/apidocs/org/gluu/oxtrust/model/scim2/provider/config/class-use/FilterConfig.html...
Generating /home/tomcat/.jenkins/jobs/oxTrust_3.1.6/workspace/scim/target/site/apidocs/org/gluu/oxtrust/model/scim2/provider/config/class-use/BulkConfig.html...
Generating /home/tomcat/.jenkins/jobs/oxTrust_3.1.6/workspace/scim/target/site/apidocs/org/gluu/oxtrust/model/scim2/provider/config/class-use/PatchConfig.html...
Generating /home/tomcat/.jenkins/jobs/oxTrust_3.1.6/workspace/scim/target/site/apidocs/org/gluu/oxtrust/model/scim2/provider/config/class-use/AuthenticationScheme.html...
Generating /home/tomcat/.jenkins/jobs/oxTrust_3.1.6/workspace/scim/target/site/apidocs/org/gluu/oxtrust/model/scim2/provider/resourcetypes/class-use/SchemaExtensionHolder.html...
Generating /home/tomcat/.jenkins/jobs/oxTrust_3.1.6/workspace/scim/target/site/apidocs/org/gluu/oxtrust/model/scim2/provider/resourcetypes/class-use/ResourceType.html...
Generating /home/tomcat/.jenkins/jobs/oxTrust_3.1.6/workspace/scim/target/site/apidocs/org/gluu/oxtrust/model/exception/package-use.html...
Generating /home/tomcat/.jenkins/jobs/oxTrust_3.1.6/workspace/scim/target/site/apidocs/org/gluu/oxtrust/model/scim2/package-use.html...
Generating /home/tomcat/.jenkins/jobs/oxTrust_3.1.6/workspace/scim/target/site/apidocs/org/gluu/oxtrust/model/scim2/annotations/package-use.html...
Generating /home/tomcat/.jenkins/jobs/oxTrust_3.1.6/workspace/scim/target/site/apidocs/org/gluu/oxtrust/model/scim2/bulk/package-use.html...
Generating /home/tomcat/.jenkins/jobs/oxTrust_3.1.6/workspace/scim/target/site/apidocs/org/gluu/oxtrust/model/scim2/extensions/package-use.html...
Generating /home/tomcat/.jenkins/jobs/oxTrust_3.1.6/workspace/scim/target/site/apidocs/org/gluu/oxtrust/model/scim2/fido/package-use.html...
Generating /home/tomcat/.jenkins/jobs/oxTrust_3.1.6/workspace/scim/target/site/apidocs/org/gluu/oxtrust/model/scim2/group/package-use.html...
Generating /home/tomcat/.jenkins/jobs/oxTrust_3.1.6/workspace/scim/target/site/apidocs/org/gluu/oxtrust/model/scim2/patch/package-use.html...
Generating /home/tomcat/.jenkins/jobs/oxTrust_3.1.6/workspace/scim/target/site/apidocs/org/gluu/oxtrust/model/scim2/provider/config/package-use.html...
Generating /home/tomcat/.jenkins/jobs/oxTrust_3.1.6/workspace/scim/target/site/apidocs/org/gluu/oxtrust/model/scim2/provider/resourcetypes/package-use.html...
Generating /home/tomcat/.jenkins/jobs/oxTrust_3.1.6/workspace/scim/target/site/apidocs/org/gluu/oxtrust/model/scim2/provider/schema/package-use.html...
Generating /home/tomcat/.jenkins/jobs/oxTrust_3.1.6/workspace/scim/target/site/apidocs/org/gluu/oxtrust/model/scim2/user/package-use.html...
Generating /home/tomcat/.jenkins/jobs/oxTrust_3.1.6/workspace/scim/target/site/apidocs/org/gluu/oxtrust/model/scim2/util/package-use.html...
Generating /home/tomcat/.jenkins/jobs/oxTrust_3.1.6/workspace/scim/target/site/apidocs/org/gluu/oxtrust/ws/rs/scim2/package-use.html...
Generating /home/tomcat/.jenkins/jobs/oxTrust_3.1.6/workspace/scim/target/site/apidocs/org/xdi/model/package-use.html...
Building index for all the packages and classes...
Generating /home/tomcat/.jenkins/jobs/oxTrust_3.1.6/workspace/scim/target/site/apidocs/overview-tree.html...
Generating /home/tomcat/.jenkins/jobs/oxTrust_3.1.6/workspace/scim/target/site/apidocs/index-all.html...
Generating /home/tomcat/.jenkins/jobs/oxTrust_3.1.6/workspace/scim/target/site/apidocs/deprecated-list.html...
Building index for all classes...
Generating /home/tomcat/.jenkins/jobs/oxTrust_3.1.6/workspace/scim/target/site/apidocs/allclasses-frame.html...
Generating /home/tomcat/.jenkins/jobs/oxTrust_3.1.6/workspace/scim/target/site/apidocs/allclasses-noframe.html...
Generating /home/tomcat/.jenkins/jobs/oxTrust_3.1.6/workspace/scim/target/site/apidocs/index.html...
Generating /home/tomcat/.jenkins/jobs/oxTrust_3.1.6/workspace/scim/target/site/apidocs/overview-summary.html...
Generating /home/tomcat/.jenkins/jobs/oxTrust_3.1.6/workspace/scim/target/site/apidocs/help-doc.html...
2 warnings
[WARNING] Javadoc Warnings
[WARNING] /home/tomcat/.jenkins/jobs/oxTrust_3.1.6/workspace/scim/src/main/java/org/gluu/oxtrust/ws/rs/scim2/IFidoDeviceWebService.java:136: warning: no @param for userId
[WARNING] Response searchDevices(
[WARNING] ^
[WARNING] /home/tomcat/.jenkins/jobs/oxTrust_3.1.6/workspace/scim/src/main/java/org/gluu/oxtrust/ws/rs/scim2/IFidoDeviceWebService.java:160: warning: no @param for userId
[WARNING] Response searchDevicesPost(SearchRequest searchRequest, @QueryParam("userId") final String userId);
[WARNING] ^
[INFO] 
[INFO] --- maven-site-plugin:2.1.1:site (default-site) @ oxtrust-scim ---
[INFO]                                                                         
[INFO] ------------------------------------------------------------------------
[INFO] Building oxTrust Server 3.1.6.sp2
[INFO] ------------------------------------------------------------------------
[INFO] 
[INFO] --- maven-clean-plugin:2.5:clean (default-clean) @ oxtrust-server ---
[INFO] Deleting /home/tomcat/.jenkins/jobs/oxTrust_3.1.6/workspace/server/target
[INFO] 
[INFO] --- buildnumber-maven-plugin:1.1:create (default) @ oxtrust-server ---
[INFO] Checking for local modifications: skipped.
[INFO] Updating project files from SCM: skipped.
[INFO] Executing: /bin/sh -c cd /home/tomcat/.jenkins/jobs/oxTrust_3.1.6/workspace/server && git rev-parse --verify HEAD
[INFO] Working directory: /home/tomcat/.jenkins/jobs/oxTrust_3.1.6/workspace/server
[INFO] Storing buildNumber: 9ac73df3de3a50037a7ec2f5c8f411588f2d5776 at timestamp: 1562218619274
[INFO] Executing: /bin/sh -c cd /home/tomcat/.jenkins/jobs/oxTrust_3.1.6/workspace/server && git rev-parse --verify HEAD
[INFO] Working directory: /home/tomcat/.jenkins/jobs/oxTrust_3.1.6/workspace/server
[INFO] Storing buildScmBranch: UNKNOWN
[INFO] 
[INFO] --- maven-resources-plugin:2.6:resources (default-resources) @ oxtrust-server ---
[INFO] Using 'UTF-8' encoding to copy filtered resources.
[INFO] Copying 94 resources
[INFO] 
[INFO] --- maven-compiler-plugin:2.3.2:compile (default-compile) @ oxtrust-server ---
[INFO] Compiling 324 source files to /home/tomcat/.jenkins/jobs/oxTrust_3.1.6/workspace/server/target/classes
[INFO] 
[INFO] --- buildnumber-maven-plugin:1.1:create (default) @ oxtrust-server ---
[INFO] Checking for local modifications: skipped.
[INFO] Updating project files from SCM: skipped.
[INFO] Executing: /bin/sh -c cd /home/tomcat/.jenkins/jobs/oxTrust_3.1.6/workspace/server && git rev-parse --verify HEAD
[INFO] Working directory: /home/tomcat/.jenkins/jobs/oxTrust_3.1.6/workspace/server
[INFO] Storing buildNumber: 9ac73df3de3a50037a7ec2f5c8f411588f2d5776 at timestamp: 1562218628463
[INFO] Executing: /bin/sh -c cd /home/tomcat/.jenkins/jobs/oxTrust_3.1.6/workspace/server && git rev-parse --verify HEAD
[INFO] Working directory: /home/tomcat/.jenkins/jobs/oxTrust_3.1.6/workspace/server
[INFO] Storing buildScmBranch: UNKNOWN
[INFO] 
[INFO] --- maven-resources-plugin:2.6:resources (default-resources) @ oxtrust-server ---
[INFO] Using 'UTF-8' encoding to copy filtered resources.
[INFO] Copying 94 resources
[INFO] 
[INFO] --- maven-compiler-plugin:2.3.2:compile (default-compile) @ oxtrust-server ---
[INFO] Nothing to compile - all classes are up to date
[INFO] 
[INFO] --- maven-resources-plugin:2.6:testResources (default-testResources) @ oxtrust-server ---
[INFO] Using 'UTF-8' encoding to copy filtered resources.
[INFO] Copying 103 resources
[INFO] Copying 6 resources
[INFO] 
[INFO] --- maven-resources-plugin:2.6:copy-resources (prepare-configuration-files) @ oxtrust-server ---
[INFO] Using 'UTF-8' encoding to copy filtered resources.
[INFO] Copying 95 resources
[INFO] 
[INFO] --- maven-compiler-plugin:2.3.2:testCompile (default-testCompile) @ oxtrust-server ---
[INFO] Compiling 13 source files to /home/tomcat/.jenkins/jobs/oxTrust_3.1.6/workspace/server/target/test-classes
[INFO] -------------------------------------------------------------
[ERROR] COMPILATION ERROR : 
[INFO] -------------------------------------------------------------
[ERROR] /home/tomcat/.jenkins/jobs/oxTrust_3.1.6/workspace/server/src/test/java/org/gluu/oxtrust/service/PostLogoutRedirectUriTest.java:[13,35] error: package org.gluu.oxtrust.action.test does not exist
[ERROR] /home/tomcat/.jenkins/jobs/oxTrust_3.1.6/workspace/server/src/test/java/org/gluu/oxtrust/service/PostLogoutRedirectUriTest.java:[17,47] error: cannot find symbol
[ERROR]  class AbstractAuthenticationTest
/home/tomcat/.jenkins/jobs/oxTrust_3.1.6/workspace/server/src/test/java/org/gluu/oxtrust/action/ConfigurationStatusTest.java:[16,30] error: cannot find symbol
[ERROR]  package org.gluu.oxtrust.action
/home/tomcat/.jenkins/jobs/oxTrust_3.1.6/workspace/server/src/test/java/org/gluu/oxtrust/action/ConfigurationStatusTest.java:[18,36] error: cannot find symbol
[ERROR]  package org.gluu.oxtrust.ldap.service
/home/tomcat/.jenkins/jobs/oxTrust_3.1.6/workspace/server/src/test/java/org/gluu/oxtrust/action/ConfigurationStatusTest.java:[19,29] error: cannot find symbol
[ERROR]  package org.gluu.oxtrust.model
/home/tomcat/.jenkins/jobs/oxTrust_3.1.6/workspace/server/src/test/java/org/gluu/oxtrust/action/ConfigurationStatusTest.java:[37,9] error: cannot find symbol
[ERROR]  class ConfigurationStatusTest
/home/tomcat/.jenkins/jobs/oxTrust_3.1.6/workspace/server/src/test/java/org/gluu/oxtrust/action/ConfigurationStatusTest.java:[40,9] error: cannot find symbol
[ERROR]  class ConfigurationStatusTest
/home/tomcat/.jenkins/jobs/oxTrust_3.1.6/workspace/server/src/test/java/org/gluu/oxtrust/service/ApplianceStatusTest.java:[18,35] error: package org.gluu.oxtrust.action.test does not exist
[ERROR] /home/tomcat/.jenkins/jobs/oxTrust_3.1.6/workspace/server/src/test/java/org/gluu/oxtrust/service/ApplianceStatusTest.java:[29,41] error: cannot find symbol
[INFO] 9 errors 
[INFO] -------------------------------------------------------------
[INFO] ------------------------------------------------------------------------
[INFO] Reactor Summary:
[INFO] 
[INFO] oxTrust ............................................ SUCCESS [  2.940 s]
[INFO] oxTrust static resources ........................... SUCCESS [  1.886 s]
[INFO] oxTrust configuration .............................. SUCCESS [  0.323 s]
[INFO] oxTrust Model library .............................. SUCCESS [  8.181 s]
[INFO] OpenId authentication module ....................... SUCCESS [ 11.188 s]
[INFO] oxtrust-scim ....................................... SUCCESS [ 16.093 s]
[INFO] oxTrust Server ..................................... FAILURE [ 11.705 s]
[INFO] OpenId authentication module for Saml .............. SKIPPED
[INFO] OpenId authentication module for CAS ............... SKIPPED
[INFO] ------------------------------------------------------------------------
[INFO] BUILD FAILURE
[INFO] ------------------------------------------------------------------------
[INFO] Total time: 53.467 s
[INFO] Finished at: 2019-07-04T01:37:10-04:00
[INFO] Final Memory: 117M/814M
[INFO] ------------------------------------------------------------------------
[ERROR] Failed to execute goal org.apache.maven.plugins:maven-compiler-plugin:2.3.2:testCompile (default-testCompile) on project oxtrust-server: Compilation failure: Compilation failure:
[ERROR] /home/tomcat/.jenkins/jobs/oxTrust_3.1.6/workspace/server/src/test/java/org/gluu/oxtrust/service/PostLogoutRedirectUriTest.java:[13,35] error: package org.gluu.oxtrust.action.test does not exist
[ERROR] /home/tomcat/.jenkins/jobs/oxTrust_3.1.6/workspace/server/src/test/java/org/gluu/oxtrust/service/PostLogoutRedirectUriTest.java:[17,47] error: cannot find symbol
[ERROR] class AbstractAuthenticationTest
[ERROR] /home/tomcat/.jenkins/jobs/oxTrust_3.1.6/workspace/server/src/test/java/org/gluu/oxtrust/action/ConfigurationStatusTest.java:[16,30] error: cannot find symbol
[ERROR] package org.gluu.oxtrust.action
[ERROR] /home/tomcat/.jenkins/jobs/oxTrust_3.1.6/workspace/server/src/test/java/org/gluu/oxtrust/action/ConfigurationStatusTest.java:[18,36] error: cannot find symbol
[ERROR] package org.gluu.oxtrust.ldap.service
[ERROR] /home/tomcat/.jenkins/jobs/oxTrust_3.1.6/workspace/server/src/test/java/org/gluu/oxtrust/action/ConfigurationStatusTest.java:[19,29] error: cannot find symbol
[ERROR] package org.gluu.oxtrust.model
[ERROR] /home/tomcat/.jenkins/jobs/oxTrust_3.1.6/workspace/server/src/test/java/org/gluu/oxtrust/action/ConfigurationStatusTest.java:[37,9] error: cannot find symbol
[ERROR] class ConfigurationStatusTest
[ERROR] /home/tomcat/.jenkins/jobs/oxTrust_3.1.6/workspace/server/src/test/java/org/gluu/oxtrust/action/ConfigurationStatusTest.java:[40,9] error: cannot find symbol
[ERROR] class ConfigurationStatusTest
[ERROR] /home/tomcat/.jenkins/jobs/oxTrust_3.1.6/workspace/server/src/test/java/org/gluu/oxtrust/service/ApplianceStatusTest.java:[18,35] error: package org.gluu.oxtrust.action.test does not exist
[ERROR] /home/tomcat/.jenkins/jobs/oxTrust_3.1.6/workspace/server/src/test/java/org/gluu/oxtrust/service/ApplianceStatusTest.java:[29,41] error: cannot find symbol
[ERROR] -> [Help 1]
[ERROR] 
[ERROR] To see the full stack trace of the errors, re-run Maven with the -e switch.
[ERROR] Re-run Maven using the -X switch to enable full debug logging.
[ERROR] 
[ERROR] For more information about the errors and possible solutions, please read the following articles:
[ERROR] [Help 1] http://cwiki.apache.org/confluence/display/MAVEN/MojoFailureException
[ERROR] 
[ERROR] After correcting the problems, you can resume the build with the command
[ERROR]   mvn <goals> -rf :oxtrust-server
Build step 'Invoke top-level Maven targets' marked build as failure
[FINDBUGS] Skipping publisher since build result is FAILURE
Publishing Javadoc
TestNG Reports Processing: START
Looking for TestNG results report in workspace using pattern: **/testng-results.xml
Did not find any matching files.
Not sending mail to unregistered user Yuriy.Movchan@gmail.com
Sending e-mails to: support@gluu.org
[Boolean condition] checking [true] against [^(1|y|yes|t|true|on|run)$] (origin token: $DEPLOY_BUILD)
Run condition [Boolean condition] enabling perform for step [Builder to mark whether executed]
Finished: FAILURE