FailedConsole Output

Started by user Yuriy Movchan
Running as SYSTEM
Building on master in workspace /home/jenkins/.jenkins/jobs/oxShibboleth/workspace
The recommended git tool is: NONE
No credentials specified
 > git rev-parse --is-inside-work-tree # timeout=10
Fetching changes from the remote Git repository
 > git config remote.origin.url https://github.com/GluuFederation/oxShibboleth # timeout=10
Fetching upstream changes from https://github.com/GluuFederation/oxShibboleth
 > git --version # timeout=10
 > git --version # 'git version 1.8.3.1'
 > git fetch --tags --progress https://github.com/GluuFederation/oxShibboleth +refs/heads/*:refs/remotes/origin/* # timeout=10
 > git rev-parse refs/remotes/origin/version_4.2.3.sp1^{commit} # timeout=10
 > git rev-parse refs/remotes/origin/origin/version_4.2.3.sp1^{commit} # timeout=10
Checking out Revision d2cd25daeb636a91efcc8b3ad62854f840a9656a (refs/remotes/origin/version_4.2.3.sp1)
 > git config core.sparsecheckout # timeout=10
 > git checkout -f d2cd25daeb636a91efcc8b3ad62854f840a9656a # timeout=10
Commit message: "feat: version 4.2.3.sp1"
First time build. Skipping changelog.
[workspace] $ /home/jenkins/.jenkins/tools/hudson.tasks.Maven_MavenInstallation/maven_3.3.9/bin/mvn -DVERSION_NAME=version_4.2.3.sp1 clean install
[INFO] Scanning for projects...
[INFO] ------------------------------------------------------------------------
[INFO] Reactor Build Order:
[INFO] 
[INFO] OX Shibboleth
[INFO] OX Shibboleth IDP static resources
[INFO] Gluu Shibboleth IDP
[INFO] OX Shibboleth key generator
[INFO] oxLogoServlet
[INFO]                                                                         
[INFO] ------------------------------------------------------------------------
[INFO] Building OX Shibboleth 4.2.3.sp1
[INFO] ------------------------------------------------------------------------
[INFO] 
[INFO] --- maven-clean-plugin:2.5:clean (default-clean) @ oxShibboleth ---
[INFO] 
[INFO] --- maven-install-plugin:2.3.1:install (default-install) @ oxShibboleth ---
[INFO] Installing /home/jenkins/.jenkins/jobs/oxShibboleth/workspace/pom.xml to /var/www/html/maven/org/gluu/oxShibboleth/4.2.3.sp1/oxShibboleth-4.2.3.sp1.pom
[INFO]                                                                         
[INFO] ------------------------------------------------------------------------
[INFO] Building OX Shibboleth IDP static resources 4.2.3.sp1
[INFO] ------------------------------------------------------------------------
[INFO] 
[INFO] --- maven-clean-plugin:2.5:clean (default-clean) @ oxShibbolethStatic ---
[INFO] Deleting /home/jenkins/.jenkins/jobs/oxShibboleth/workspace/static/target
[INFO] 
[INFO] --- download-maven-plugin:1.2.1:wget (download-dist) @ oxShibbolethStatic ---
[INFO] Got from cache: /var/www/html/maven/.cache/maven-download-plugin/shibboleth-identity-provider-4.0.1.tar.gz
[INFO] Expanding: /home/jenkins/.jenkins/jobs/oxShibboleth/workspace/static/target/classes/shibboleth-identity-provider-4.0.1.tar.gz into /home/jenkins/.jenkins/jobs/oxShibboleth/workspace/static/target/classes
[INFO] 
[INFO] --- maven-resources-plugin:2.5:resources (default-resources) @ oxShibbolethStatic ---
[debug] execute contextualize
[INFO] Using 'UTF-8' encoding to copy filtered resources.
[INFO] Copying 2 resources
[INFO] 
[INFO] --- maven-patch-plugin:1.1.1:apply (gluu-patch) @ oxShibbolethStatic ---
[INFO] Applying patch: 01.split-by-parts.patch
[INFO] Applying patch: 60.script-manager.patch
[INFO] Applying patch: 61.gluu-release-attributes-post-processor.patch
[INFO] Applying patch: 70.health-check-servlet
[INFO] 
[INFO] --- maven-antrun-plugin:1.7:run (build-ipd-war) @ oxShibbolethStatic ---
[INFO] Executing tasks

main:
   [delete] Deleting directory /home/jenkins/.jenkins/jobs/oxShibboleth/workspace/static/target/classes/shibboleth-identity-provider-4.0.1/webapp
     [move] Moving 338 files to /home/jenkins/.jenkins/jobs/oxShibboleth/workspace/static/target/classes/shibboleth-idp
[INFO] Executed tasks
[INFO] 
[INFO] --- maven-compiler-plugin:2.3.2:compile (default-compile) @ oxShibbolethStatic ---
[INFO] No sources to compile
[INFO] 
[INFO] --- maven-resources-plugin:2.5:testResources (default-testResources) @ oxShibbolethStatic ---
[debug] execute contextualize
[INFO] Using 'UTF-8' encoding to copy filtered resources.
[INFO] skip non existing resourceDirectory /home/jenkins/.jenkins/jobs/oxShibboleth/workspace/static/src/test/resources
[INFO] 
[INFO] --- maven-compiler-plugin:2.3.2:testCompile (default-testCompile) @ oxShibbolethStatic ---
[INFO] No sources to compile
[INFO] 
[INFO] --- maven-surefire-plugin:2.17:test (default-test) @ oxShibbolethStatic ---
[INFO] No tests to run.
[INFO] 
[INFO] --- maven-jar-plugin:2.4:jar (default-jar) @ oxShibbolethStatic ---
[INFO] Building jar: /home/jenkins/.jenkins/jobs/oxShibboleth/workspace/static/target/oxShibbolethStatic-4.2.3.sp1.jar
[INFO] 
[INFO] --- maven-jar-plugin:2.4:test-jar (default) @ oxShibbolethStatic ---
[WARNING] JAR will be empty - no content was marked for inclusion!
[INFO] Building jar: /home/jenkins/.jenkins/jobs/oxShibboleth/workspace/static/target/oxShibbolethStatic-4.2.3.sp1-tests.jar
[INFO] 
[INFO] --- maven-install-plugin:2.4:install (default-install) @ oxShibbolethStatic ---
[INFO] Installing /home/jenkins/.jenkins/jobs/oxShibboleth/workspace/static/target/oxShibbolethStatic-4.2.3.sp1.jar to /var/www/html/maven/org/gluu/oxShibbolethStatic/4.2.3.sp1/oxShibbolethStatic-4.2.3.sp1.jar
[INFO] Installing /home/jenkins/.jenkins/jobs/oxShibboleth/workspace/static/pom.xml to /var/www/html/maven/org/gluu/oxShibbolethStatic/4.2.3.sp1/oxShibbolethStatic-4.2.3.sp1.pom
[INFO] Installing /home/jenkins/.jenkins/jobs/oxShibboleth/workspace/static/target/oxShibbolethStatic-4.2.3.sp1-tests.jar to /var/www/html/maven/org/gluu/oxShibbolethStatic/4.2.3.sp1/oxShibbolethStatic-4.2.3.sp1-tests.jar
[INFO]                                                                         
[INFO] ------------------------------------------------------------------------
[INFO] Building Gluu Shibboleth IDP 4.2.3.sp1
[INFO] ------------------------------------------------------------------------
Downloading: https://repo1.maven.org/maven2/org/gluu/shib-oxauth-authn3/4.2.3.sp1/shib-oxauth-authn3-4.2.3.sp1.pom

Downloading: https://repository.jboss.org/nexus/content/groups/public-jboss/org/gluu/shib-oxauth-authn3/4.2.3.sp1/shib-oxauth-authn3-4.2.3.sp1.pom

Downloading: https://build.shibboleth.net/nexus/content/repositories/releases/org/gluu/shib-oxauth-authn3/4.2.3.sp1/shib-oxauth-authn3-4.2.3.sp1.pom

Downloading: https://repo1.maven.org/maven2/org/bouncycastle/org/gluu/shib-oxauth-authn3/4.2.3.sp1/shib-oxauth-authn3-4.2.3.sp1.pom

Downloading: https://ox.gluu.org/maven/org/gluu/shib-oxauth-authn3/4.2.3.sp1/shib-oxauth-authn3-4.2.3.sp1.pom

Downloading: https://build.shibboleth.net/nexus/content/groups/public/org/gluu/shib-oxauth-authn3/4.2.3.sp1/shib-oxauth-authn3-4.2.3.sp1.pom

[WARNING] The POM for org.gluu:shib-oxauth-authn3:jar:4.2.3.sp1 is missing, no dependency information available
Downloading: https://repo1.maven.org/maven2/org/gluu/shib-oxauth-authn3/4.2.3.sp1/shib-oxauth-authn3-4.2.3.sp1.jar

Downloading: https://repository.jboss.org/nexus/content/groups/public-jboss/org/gluu/shib-oxauth-authn3/4.2.3.sp1/shib-oxauth-authn3-4.2.3.sp1.jar

Downloading: https://build.shibboleth.net/nexus/content/repositories/releases/org/gluu/shib-oxauth-authn3/4.2.3.sp1/shib-oxauth-authn3-4.2.3.sp1.jar

Downloading: https://repo1.maven.org/maven2/org/bouncycastle/org/gluu/shib-oxauth-authn3/4.2.3.sp1/shib-oxauth-authn3-4.2.3.sp1.jar

Downloading: https://ox.gluu.org/maven/org/gluu/shib-oxauth-authn3/4.2.3.sp1/shib-oxauth-authn3-4.2.3.sp1.jar

Downloading: https://build.shibboleth.net/nexus/content/groups/public/org/gluu/shib-oxauth-authn3/4.2.3.sp1/shib-oxauth-authn3-4.2.3.sp1.jar

[INFO] ------------------------------------------------------------------------
[INFO] Reactor Summary:
[INFO] 
[INFO] OX Shibboleth ...................................... SUCCESS [  0.406 s]
[INFO] OX Shibboleth IDP static resources ................. SUCCESS [  5.090 s]
[INFO] Gluu Shibboleth IDP ................................ FAILURE [  2.472 s]
[INFO] OX Shibboleth key generator ........................ SKIPPED
[INFO] oxLogoServlet ...................................... SKIPPED
[INFO] ------------------------------------------------------------------------
[INFO] BUILD FAILURE
[INFO] ------------------------------------------------------------------------
[INFO] Total time: 8.169 s
[INFO] Finished at: 2021-06-17T17:56:38+00:00
[INFO] Final Memory: 19M/70M
[INFO] ------------------------------------------------------------------------
[ERROR] Failed to execute goal on project oxshibbolethIdp: Could not resolve dependencies for project org.gluu:oxshibbolethIdp:war:4.2.3.sp1: Could not find artifact org.gluu:shib-oxauth-authn3:jar:4.2.3.sp1 in central (https://repo1.maven.org/maven2) -> [Help 1]
[ERROR] 
[ERROR] To see the full stack trace of the errors, re-run Maven with the -e switch.
[ERROR] Re-run Maven using the -X switch to enable full debug logging.
[ERROR] 
[ERROR] For more information about the errors and possible solutions, please read the following articles:
[ERROR] [Help 1] http://cwiki.apache.org/confluence/display/MAVEN/DependencyResolutionException
[ERROR] 
[ERROR] After correcting the problems, you can resume the build with the command
[ERROR]   mvn <goals> -rf :oxshibbolethIdp
Build step 'Invoke top-level Maven targets' marked build as failure
Sending e-mails to: support@gluu.org
ERROR: Couldn't connect to host, port: webmail.gluu.org, 465; timeout 60000
com.sun.mail.util.MailConnectException: Couldn't connect to host, port: webmail.gluu.org, 465; timeout 60000;
  nested exception is:
	java.net.SocketTimeoutException: connect timed out
	at com.sun.mail.smtp.SMTPTransport.openServer(SMTPTransport.java:2210)
	at com.sun.mail.smtp.SMTPTransport.protocolConnect(SMTPTransport.java:722)
	at javax.mail.Service.connect(Service.java:310)
	at javax.mail.Service.connect(Service.java:169)
	at javax.mail.Service.connect(Service.java:118)
	at javax.mail.Transport.send0(Transport.java:188)
	at javax.mail.Transport.send(Transport.java:118)
	at hudson.tasks.MailSender.run(MailSender.java:130)
	at hudson.tasks.Mailer.perform(Mailer.java:176)
	at hudson.tasks.Mailer.perform(Mailer.java:139)
	at hudson.tasks.BuildStepMonitor$1.perform(BuildStepMonitor.java:20)
	at hudson.model.AbstractBuild$AbstractBuildExecution.perform(AbstractBuild.java:741)
	at hudson.model.AbstractBuild$AbstractBuildExecution.performAllBuildSteps(AbstractBuild.java:690)
	at hudson.model.Build$BuildExecution.post2(Build.java:186)
	at hudson.model.AbstractBuild$AbstractBuildExecution.post(AbstractBuild.java:635)
	at hudson.model.Run.execute(Run.java:1905)
	at hudson.model.FreeStyleBuild.run(FreeStyleBuild.java:43)
	at hudson.model.ResourceController.execute(ResourceController.java:97)
	at hudson.model.Executor.run(Executor.java:428)
Caused by: java.net.SocketTimeoutException: connect timed out
	at java.net.PlainSocketImpl.socketConnect(Native Method)
	at java.net.AbstractPlainSocketImpl.doConnect(AbstractPlainSocketImpl.java:350)
	at java.net.AbstractPlainSocketImpl.connectToAddress(AbstractPlainSocketImpl.java:206)
	at java.net.AbstractPlainSocketImpl.connect(AbstractPlainSocketImpl.java:188)
	at java.net.SocksSocketImpl.connect(SocksSocketImpl.java:392)
	at java.net.Socket.connect(Socket.java:589)
	at com.sun.mail.util.SocketFetcher.createSocket(SocketFetcher.java:333)
	at com.sun.mail.util.SocketFetcher.getSocket(SocketFetcher.java:193)
	at com.sun.mail.smtp.SMTPTransport.openServer(SMTPTransport.java:2160)
	... 18 more
Finished: FAILURE