FailedConsole Output

Started by an SCM change
Running as SYSTEM
Building on master in workspace /home/jenkins/.jenkins/jobs/oxScimClient_master_LDAP/workspace
No credentials specified
 > git rev-parse --is-inside-work-tree # timeout=10
Fetching changes from the remote Git repository
 > git config remote.origin.url https://github.com/GluuFederation/SCIM-Client # timeout=10
Fetching upstream changes from https://github.com/GluuFederation/SCIM-Client
 > git --version # timeout=10
 > git fetch --tags --progress https://github.com/GluuFederation/SCIM-Client +refs/heads/*:refs/remotes/origin/* # timeout=10
 > git rev-parse refs/remotes/origin/master^{commit} # timeout=10
 > git rev-parse refs/remotes/origin/origin/master^{commit} # timeout=10
Checking out Revision 85a90e3c593ef9cc4c59a2070aa5aebd2eb51bdf (refs/remotes/origin/master)
 > git config core.sparsecheckout # timeout=10
 > git checkout -f 85a90e3c593ef9cc4c59a2070aa5aebd2eb51bdf # timeout=10
Commit message: "Update readme"
 > git rev-list --no-walk 48c52c40cce64cc07fece9ac0393d405be26db29 # timeout=10
[workspace] $ /bin/sh -xe /opt/jetty/temp/jenkins576621161872016532.sh
+ rm -rf ./oxHudsonProfiles
+ rm -rf ./profiles/jenkins-ldap.gluu.org
+ git clone github.com:GluuFederation/oxHudsonProfiles.git
Cloning into 'oxHudsonProfiles'...
+ mkdir -p ./profiles
+ cp -rf ./oxHudsonProfiles/scim-client/profiles/jenkins-ldap.gluu.org/ profiles
+ rm -rf ./oxHudsonProfiles
[workspace] $ /home/jenkins/.jenkins/tools/hudson.tasks.Maven_MavenInstallation/maven_3.3.9/bin/mvn -DVERSION_NAME=master -DPROFILE_NAME=jenkins-ldap.gluu.org -DMAVEN_SKIP_TESTS=false -Dmaven.test.skip=false -Dcfg=jenkins-ldap.gluu.org clean compile javadoc:javadoc install findbugs:findbugs site
[INFO] Scanning for projects...
[INFO]                                                                         
[INFO] ------------------------------------------------------------------------
[INFO] Building SCIM-Client 4.2.0-SNAPSHOT
[INFO] ------------------------------------------------------------------------
Downloading: https://repo2.maven.org/maven2/org/bouncycastle/org/gluu/gluu-core-bom/4.2.0-SNAPSHOT/maven-metadata.xml

[WARNING] Could not transfer metadata org.gluu:gluu-core-bom:4.2.0-SNAPSHOT/maven-metadata.xml from/to bouncycastle (https://repo2.maven.org/maven2/org/bouncycastle): repo2.maven.org: Name or service not known
Downloading: https://repo2.maven.org/maven2/org/bouncycastle/org/gluu/oxeleven-client/4.2.0-SNAPSHOT/maven-metadata.xml

[WARNING] Could not transfer metadata org.gluu:oxeleven-client:4.2.0-SNAPSHOT/maven-metadata.xml from/to bouncycastle (https://repo2.maven.org/maven2/org/bouncycastle): repo2.maven.org
[WARNING] Failure to transfer org.gluu:oxeleven-client:4.2.0-SNAPSHOT/maven-metadata.xml from https://repo2.maven.org/maven2/org/bouncycastle was cached in the local repository, resolution will not be reattempted until the update interval of bouncycastle has elapsed or updates are forced. Original error: Could not transfer metadata org.gluu:oxeleven-client:4.2.0-SNAPSHOT/maven-metadata.xml from/to bouncycastle (https://repo2.maven.org/maven2/org/bouncycastle): repo2.maven.org
Downloading: https://repo2.maven.org/maven2/org/bouncycastle/org/gluu/oxeleven/4.2.0-SNAPSHOT/maven-metadata.xml

[WARNING] Could not transfer metadata org.gluu:oxeleven:4.2.0-SNAPSHOT/maven-metadata.xml from/to bouncycastle (https://repo2.maven.org/maven2/org/bouncycastle): repo2.maven.org
Downloading: https://repo2.maven.org/maven2/org/bouncycastle/org/gluu/oxeleven-model/4.2.0-SNAPSHOT/maven-metadata.xml

[WARNING] Could not transfer metadata org.gluu:oxeleven-model:4.2.0-SNAPSHOT/maven-metadata.xml from/to bouncycastle (https://repo2.maven.org/maven2/org/bouncycastle): repo2.maven.org
[WARNING] Failure to transfer org.gluu:oxeleven-model:4.2.0-SNAPSHOT/maven-metadata.xml from https://repo2.maven.org/maven2/org/bouncycastle was cached in the local repository, resolution will not be reattempted until the update interval of bouncycastle has elapsed or updates are forced. Original error: Could not transfer metadata org.gluu:oxeleven-model:4.2.0-SNAPSHOT/maven-metadata.xml from/to bouncycastle (https://repo2.maven.org/maven2/org/bouncycastle): repo2.maven.org
Downloading: https://repo2.maven.org/maven2/org/bouncycastle/org/gluu/oxcore-persistence-annotation/4.2.0-SNAPSHOT/maven-metadata.xml

[WARNING] Could not transfer metadata org.gluu:oxcore-persistence-annotation:4.2.0-SNAPSHOT/maven-metadata.xml from/to bouncycastle (https://repo2.maven.org/maven2/org/bouncycastle): repo2.maven.org
[WARNING] Failure to transfer org.gluu:oxcore-persistence-annotation:4.2.0-SNAPSHOT/maven-metadata.xml from https://repo2.maven.org/maven2/org/bouncycastle was cached in the local repository, resolution will not be reattempted until the update interval of bouncycastle has elapsed or updates are forced. Original error: Could not transfer metadata org.gluu:oxcore-persistence-annotation:4.2.0-SNAPSHOT/maven-metadata.xml from/to bouncycastle (https://repo2.maven.org/maven2/org/bouncycastle): repo2.maven.org
Downloading: https://repo2.maven.org/maven2/org/bouncycastle/org/gluu/oxcore/4.2.0-SNAPSHOT/maven-metadata.xml

[WARNING] Could not transfer metadata org.gluu:oxcore:4.2.0-SNAPSHOT/maven-metadata.xml from/to bouncycastle (https://repo2.maven.org/maven2/org/bouncycastle): repo2.maven.org
Downloading: https://repo2.maven.org/maven2/org/bouncycastle/org/gluu/oxcore-util/4.2.0-SNAPSHOT/maven-metadata.xml

[WARNING] Could not transfer metadata org.gluu:oxcore-util:4.2.0-SNAPSHOT/maven-metadata.xml from/to bouncycastle (https://repo2.maven.org/maven2/org/bouncycastle): repo2.maven.org
[WARNING] Failure to transfer org.gluu:oxcore-util:4.2.0-SNAPSHOT/maven-metadata.xml from https://repo2.maven.org/maven2/org/bouncycastle was cached in the local repository, resolution will not be reattempted until the update interval of bouncycastle has elapsed or updates are forced. Original error: Could not transfer metadata org.gluu:oxcore-util:4.2.0-SNAPSHOT/maven-metadata.xml from/to bouncycastle (https://repo2.maven.org/maven2/org/bouncycastle): repo2.maven.org
Downloading: https://repo2.maven.org/maven2/org/bouncycastle/org/gluu/oxcore-model/4.2.0-SNAPSHOT/maven-metadata.xml

[WARNING] Could not transfer metadata org.gluu:oxcore-model:4.2.0-SNAPSHOT/maven-metadata.xml from/to bouncycastle (https://repo2.maven.org/maven2/org/bouncycastle): repo2.maven.org
[WARNING] Failure to transfer org.gluu:oxcore-model:4.2.0-SNAPSHOT/maven-metadata.xml from https://repo2.maven.org/maven2/org/bouncycastle was cached in the local repository, resolution will not be reattempted until the update interval of bouncycastle has elapsed or updates are forced. Original error: Could not transfer metadata org.gluu:oxcore-model:4.2.0-SNAPSHOT/maven-metadata.xml from/to bouncycastle (https://repo2.maven.org/maven2/org/bouncycastle): repo2.maven.org
Downloading: https://repo2.maven.org/maven2/org/bouncycastle/org/gluu/oxcore-persistence-model/4.2.0-SNAPSHOT/maven-metadata.xml

[WARNING] Could not transfer metadata org.gluu:oxcore-persistence-model:4.2.0-SNAPSHOT/maven-metadata.xml from/to bouncycastle (https://repo2.maven.org/maven2/org/bouncycastle): repo2.maven.org
[WARNING] Failure to transfer org.gluu:oxcore-persistence-model:4.2.0-SNAPSHOT/maven-metadata.xml from https://repo2.maven.org/maven2/org/bouncycastle was cached in the local repository, resolution will not be reattempted until the update interval of bouncycastle has elapsed or updates are forced. Original error: Could not transfer metadata org.gluu:oxcore-persistence-model:4.2.0-SNAPSHOT/maven-metadata.xml from/to bouncycastle (https://repo2.maven.org/maven2/org/bouncycastle): repo2.maven.org
Downloading: https://repo2.maven.org/maven2/org/bouncycastle/net/minidev/json-smart/maven-metadata.xml

[WARNING] Could not transfer metadata net.minidev:json-smart/maven-metadata.xml from/to bouncycastle (https://repo2.maven.org/maven2/org/bouncycastle): repo2.maven.org
[WARNING] Failure to transfer org.gluu:oxcore-model:4.2.0-SNAPSHOT/maven-metadata.xml from https://repo2.maven.org/maven2/org/bouncycastle was cached in the local repository, resolution will not be reattempted until the update interval of bouncycastle has elapsed or updates are forced. Original error: Could not transfer metadata org.gluu:oxcore-model:4.2.0-SNAPSHOT/maven-metadata.xml from/to bouncycastle (https://repo2.maven.org/maven2/org/bouncycastle): repo2.maven.org
[WARNING] Failure to transfer org.gluu:oxcore-persistence-model:4.2.0-SNAPSHOT/maven-metadata.xml from https://repo2.maven.org/maven2/org/bouncycastle was cached in the local repository, resolution will not be reattempted until the update interval of bouncycastle has elapsed or updates are forced. Original error: Could not transfer metadata org.gluu:oxcore-persistence-model:4.2.0-SNAPSHOT/maven-metadata.xml from/to bouncycastle (https://repo2.maven.org/maven2/org/bouncycastle): repo2.maven.org
[INFO] 
[INFO] --- maven-clean-plugin:2.5:clean (default-clean) @ scim-client2 ---
[INFO] Deleting /home/jenkins/.jenkins/jobs/oxScimClient_master_LDAP/workspace/target
[INFO] 
[INFO] --- maven-resources-plugin:2.6:resources (default-resources) @ scim-client2 ---
[INFO] Using 'UTF-8' encoding to copy filtered resources.
[INFO] Copying 1 resource
[INFO] 
[INFO] --- maven-compiler-plugin:3.1:compile (default-compile) @ scim-client2 ---
[INFO] Changes detected - recompiling the module!
[INFO] Compiling 17 source files to /home/jenkins/.jenkins/jobs/oxScimClient_master_LDAP/workspace/target/classes
[WARNING] /home/jenkins/.jenkins/jobs/oxScimClient_master_LDAP/workspace/src/main/java/gluu/scim2/client/rest/provider/ListResponseProvider.java: /home/jenkins/.jenkins/jobs/oxScimClient_master_LDAP/workspace/src/main/java/gluu/scim2/client/rest/provider/ListResponseProvider.java uses unchecked or unsafe operations.
[WARNING] /home/jenkins/.jenkins/jobs/oxScimClient_master_LDAP/workspace/src/main/java/gluu/scim2/client/rest/provider/ListResponseProvider.java: Recompile with -Xlint:unchecked for details.
[INFO] 
[INFO] >>> maven-javadoc-plugin:2.10.4:javadoc (default-cli) > generate-sources @ scim-client2 >>>
[INFO] 
[INFO] <<< maven-javadoc-plugin:2.10.4:javadoc (default-cli) < generate-sources @ scim-client2 <<<
[INFO] 
[INFO] --- maven-javadoc-plugin:2.10.4:javadoc (default-cli) @ scim-client2 ---
[INFO] 
Loading source files for package gluu.scim2.client.exception...
Loading source files for package gluu.scim2.client.factory...
Loading source files for package gluu.scim2.client.rest.provider...
Loading source files for package gluu.scim2.client.rest...
Loading source files for package gluu.scim2.client...
Constructing Javadoc information...
Standard Doclet version 1.8.0_222
Building tree for all the packages and classes...
Generating /home/jenkins/.jenkins/jobs/oxScimClient_master_LDAP/workspace/target/site/apidocs/gluu/scim2/client/exception/ScimClientException.html...
Generating /home/jenkins/.jenkins/jobs/oxScimClient_master_LDAP/workspace/target/site/apidocs/gluu/scim2/client/exception/ScimInitializationException.html...
Generating /home/jenkins/.jenkins/jobs/oxScimClient_master_LDAP/workspace/target/site/apidocs/gluu/scim2/client/factory/ScimClientFactory.html...
Generating /home/jenkins/.jenkins/jobs/oxScimClient_master_LDAP/workspace/target/site/apidocs/gluu/scim2/client/rest/provider/AuthorizationInjectionFilter.html...
Generating /home/jenkins/.jenkins/jobs/oxScimClient_master_LDAP/workspace/target/site/apidocs/gluu/scim2/client/rest/provider/ListResponseProvider.html...
Generating /home/jenkins/.jenkins/jobs/oxScimClient_master_LDAP/workspace/target/site/apidocs/gluu/scim2/client/rest/provider/ScimResourceProvider.html...
Generating /home/jenkins/.jenkins/jobs/oxScimClient_master_LDAP/workspace/target/site/apidocs/gluu/scim2/client/rest/ClientSideFido2DeviceService.html...
Generating /home/jenkins/.jenkins/jobs/oxScimClient_master_LDAP/workspace/target/site/apidocs/gluu/scim2/client/rest/ClientSideFidoDeviceService.html...
Generating /home/jenkins/.jenkins/jobs/oxScimClient_master_LDAP/workspace/target/site/apidocs/gluu/scim2/client/rest/ClientSideGroupService.html...
Generating /home/jenkins/.jenkins/jobs/oxScimClient_master_LDAP/workspace/target/site/apidocs/gluu/scim2/client/rest/ClientSideService.html...
Generating /home/jenkins/.jenkins/jobs/oxScimClient_master_LDAP/workspace/target/site/apidocs/gluu/scim2/client/rest/ClientSideUserService.html...
Generating /home/jenkins/.jenkins/jobs/oxScimClient_master_LDAP/workspace/target/site/apidocs/gluu/scim2/client/rest/CloseableClient.html...
Generating /home/jenkins/.jenkins/jobs/oxScimClient_master_LDAP/workspace/target/site/apidocs/gluu/scim2/client/rest/FreelyAccessible.html...
Generating /home/jenkins/.jenkins/jobs/oxScimClient_master_LDAP/workspace/target/site/apidocs/gluu/scim2/client/AbstractScimClient.html...
Generating /home/jenkins/.jenkins/jobs/oxScimClient_master_LDAP/workspace/target/site/apidocs/gluu/scim2/client/ClientMap.html...
Generating /home/jenkins/.jenkins/jobs/oxScimClient_master_LDAP/workspace/target/site/apidocs/gluu/scim2/client/TestModeScimClient.html...
Generating /home/jenkins/.jenkins/jobs/oxScimClient_master_LDAP/workspace/target/site/apidocs/gluu/scim2/client/UmaScimClient.html...
Generating /home/jenkins/.jenkins/jobs/oxScimClient_master_LDAP/workspace/target/site/apidocs/overview-frame.html...
Generating /home/jenkins/.jenkins/jobs/oxScimClient_master_LDAP/workspace/target/site/apidocs/gluu/scim2/client/package-frame.html...
Generating /home/jenkins/.jenkins/jobs/oxScimClient_master_LDAP/workspace/target/site/apidocs/gluu/scim2/client/package-summary.html...
Generating /home/jenkins/.jenkins/jobs/oxScimClient_master_LDAP/workspace/target/site/apidocs/gluu/scim2/client/package-tree.html...
Generating /home/jenkins/.jenkins/jobs/oxScimClient_master_LDAP/workspace/target/site/apidocs/gluu/scim2/client/exception/package-frame.html...
Generating /home/jenkins/.jenkins/jobs/oxScimClient_master_LDAP/workspace/target/site/apidocs/gluu/scim2/client/exception/package-summary.html...
Generating /home/jenkins/.jenkins/jobs/oxScimClient_master_LDAP/workspace/target/site/apidocs/gluu/scim2/client/exception/package-tree.html...
Generating /home/jenkins/.jenkins/jobs/oxScimClient_master_LDAP/workspace/target/site/apidocs/gluu/scim2/client/factory/package-frame.html...
Generating /home/jenkins/.jenkins/jobs/oxScimClient_master_LDAP/workspace/target/site/apidocs/gluu/scim2/client/factory/package-summary.html...
Generating /home/jenkins/.jenkins/jobs/oxScimClient_master_LDAP/workspace/target/site/apidocs/gluu/scim2/client/factory/package-tree.html...
Generating /home/jenkins/.jenkins/jobs/oxScimClient_master_LDAP/workspace/target/site/apidocs/gluu/scim2/client/rest/package-frame.html...
Generating /home/jenkins/.jenkins/jobs/oxScimClient_master_LDAP/workspace/target/site/apidocs/gluu/scim2/client/rest/package-summary.html...
Generating /home/jenkins/.jenkins/jobs/oxScimClient_master_LDAP/workspace/target/site/apidocs/gluu/scim2/client/rest/package-tree.html...
Generating /home/jenkins/.jenkins/jobs/oxScimClient_master_LDAP/workspace/target/site/apidocs/gluu/scim2/client/rest/provider/package-frame.html...
Generating /home/jenkins/.jenkins/jobs/oxScimClient_master_LDAP/workspace/target/site/apidocs/gluu/scim2/client/rest/provider/package-summary.html...
Generating /home/jenkins/.jenkins/jobs/oxScimClient_master_LDAP/workspace/target/site/apidocs/gluu/scim2/client/rest/provider/package-tree.html...
Generating /home/jenkins/.jenkins/jobs/oxScimClient_master_LDAP/workspace/target/site/apidocs/constant-values.html...
Generating /home/jenkins/.jenkins/jobs/oxScimClient_master_LDAP/workspace/target/site/apidocs/serialized-form.html...
Generating /home/jenkins/.jenkins/jobs/oxScimClient_master_LDAP/workspace/target/site/apidocs/gluu/scim2/client/exception/class-use/ScimInitializationException.html...
Generating /home/jenkins/.jenkins/jobs/oxScimClient_master_LDAP/workspace/target/site/apidocs/gluu/scim2/client/exception/class-use/ScimClientException.html...
Generating /home/jenkins/.jenkins/jobs/oxScimClient_master_LDAP/workspace/target/site/apidocs/gluu/scim2/client/factory/class-use/ScimClientFactory.html...
Generating /home/jenkins/.jenkins/jobs/oxScimClient_master_LDAP/workspace/target/site/apidocs/gluu/scim2/client/rest/provider/class-use/ListResponseProvider.html...
Generating /home/jenkins/.jenkins/jobs/oxScimClient_master_LDAP/workspace/target/site/apidocs/gluu/scim2/client/rest/provider/class-use/AuthorizationInjectionFilter.html...
Generating /home/jenkins/.jenkins/jobs/oxScimClient_master_LDAP/workspace/target/site/apidocs/gluu/scim2/client/rest/provider/class-use/ScimResourceProvider.html...
Generating /home/jenkins/.jenkins/jobs/oxScimClient_master_LDAP/workspace/target/site/apidocs/gluu/scim2/client/rest/class-use/FreelyAccessible.html...
Generating /home/jenkins/.jenkins/jobs/oxScimClient_master_LDAP/workspace/target/site/apidocs/gluu/scim2/client/rest/class-use/CloseableClient.html...
Generating /home/jenkins/.jenkins/jobs/oxScimClient_master_LDAP/workspace/target/site/apidocs/gluu/scim2/client/rest/class-use/ClientSideUserService.html...
Generating /home/jenkins/.jenkins/jobs/oxScimClient_master_LDAP/workspace/target/site/apidocs/gluu/scim2/client/rest/class-use/ClientSideService.html...
Generating /home/jenkins/.jenkins/jobs/oxScimClient_master_LDAP/workspace/target/site/apidocs/gluu/scim2/client/rest/class-use/ClientSideGroupService.html...
Generating /home/jenkins/.jenkins/jobs/oxScimClient_master_LDAP/workspace/target/site/apidocs/gluu/scim2/client/rest/class-use/ClientSideFidoDeviceService.html...
Generating /home/jenkins/.jenkins/jobs/oxScimClient_master_LDAP/workspace/target/site/apidocs/gluu/scim2/client/rest/class-use/ClientSideFido2DeviceService.html...
Generating /home/jenkins/.jenkins/jobs/oxScimClient_master_LDAP/workspace/target/site/apidocs/gluu/scim2/client/class-use/AbstractScimClient.html...
Generating /home/jenkins/.jenkins/jobs/oxScimClient_master_LDAP/workspace/target/site/apidocs/gluu/scim2/client/class-use/UmaScimClient.html...
Generating /home/jenkins/.jenkins/jobs/oxScimClient_master_LDAP/workspace/target/site/apidocs/gluu/scim2/client/class-use/TestModeScimClient.html...
Generating /home/jenkins/.jenkins/jobs/oxScimClient_master_LDAP/workspace/target/site/apidocs/gluu/scim2/client/class-use/ClientMap.html...
Generating /home/jenkins/.jenkins/jobs/oxScimClient_master_LDAP/workspace/target/site/apidocs/gluu/scim2/client/package-use.html...
Generating /home/jenkins/.jenkins/jobs/oxScimClient_master_LDAP/workspace/target/site/apidocs/gluu/scim2/client/exception/package-use.html...
Generating /home/jenkins/.jenkins/jobs/oxScimClient_master_LDAP/workspace/target/site/apidocs/gluu/scim2/client/factory/package-use.html...
Generating /home/jenkins/.jenkins/jobs/oxScimClient_master_LDAP/workspace/target/site/apidocs/gluu/scim2/client/rest/package-use.html...
Generating /home/jenkins/.jenkins/jobs/oxScimClient_master_LDAP/workspace/target/site/apidocs/gluu/scim2/client/rest/provider/package-use.html...
Building index for all the packages and classes...
Generating /home/jenkins/.jenkins/jobs/oxScimClient_master_LDAP/workspace/target/site/apidocs/overview-tree.html...
Generating /home/jenkins/.jenkins/jobs/oxScimClient_master_LDAP/workspace/target/site/apidocs/index-all.html...
Generating /home/jenkins/.jenkins/jobs/oxScimClient_master_LDAP/workspace/target/site/apidocs/deprecated-list.html...
Building index for all classes...
Generating /home/jenkins/.jenkins/jobs/oxScimClient_master_LDAP/workspace/target/site/apidocs/allclasses-frame.html...
Generating /home/jenkins/.jenkins/jobs/oxScimClient_master_LDAP/workspace/target/site/apidocs/allclasses-noframe.html...
Generating /home/jenkins/.jenkins/jobs/oxScimClient_master_LDAP/workspace/target/site/apidocs/index.html...
Generating /home/jenkins/.jenkins/jobs/oxScimClient_master_LDAP/workspace/target/site/apidocs/overview-summary.html...
Generating /home/jenkins/.jenkins/jobs/oxScimClient_master_LDAP/workspace/target/site/apidocs/help-doc.html...
[INFO] 
[INFO] --- maven-resources-plugin:2.6:resources (default-resources) @ scim-client2 ---
[INFO] Using 'UTF-8' encoding to copy filtered resources.
[INFO] Copying 1 resource
[INFO] 
[INFO] --- maven-compiler-plugin:3.1:compile (default-compile) @ scim-client2 ---
[INFO] Nothing to compile - all classes are up to date
[INFO] 
[INFO] --- maven-resources-plugin:2.6:testResources (default-testResources) @ scim-client2 ---
[INFO] Using 'UTF-8' encoding to copy filtered resources.
[INFO] Copying 35 resources
[INFO] 
[INFO] --- maven-compiler-plugin:3.1:testCompile (default-testCompile) @ scim-client2 ---
[INFO] Changes detected - recompiling the module!
[INFO] Compiling 32 source files to /home/jenkins/.jenkins/jobs/oxScimClient_master_LDAP/workspace/target/test-classes
[WARNING] /home/jenkins/.jenkins/jobs/oxScimClient_master_LDAP/workspace/src/test/java/gluu/scim2/client/corner/SpecialCharsTest.java: /home/jenkins/.jenkins/jobs/oxScimClient_master_LDAP/workspace/src/test/java/gluu/scim2/client/corner/SpecialCharsTest.java uses or overrides a deprecated API.
[WARNING] /home/jenkins/.jenkins/jobs/oxScimClient_master_LDAP/workspace/src/test/java/gluu/scim2/client/corner/SpecialCharsTest.java: Recompile with -Xlint:deprecation for details.
[INFO] 
[INFO] --- maven-surefire-plugin:2.12.4:test (default-test) @ scim-client2 ---
[INFO] Surefire report directory: /home/jenkins/.jenkins/jobs/oxScimClient_master_LDAP/workspace/target/surefire-reports

-------------------------------------------------------
 T E S T S
-------------------------------------------------------
Running TestSuite
13:22:27 INFO  BaseTest.java:43 - Invoked initTestSuite of 'Corner and other weird cases'
13:22:27 INFO  BaseTest.java:71 - Initializing client...
13:22:29 DEBUG MinimalUserTest.java:24 - Creating mimimal user from json...
13:22:29 DEBUG MinimalGroupTest.java:26 - Creating mimimal group from json...
13:22:29 DEBUG AverageUserTest.java:31 - Creating user from json...
13:22:29 DEBUG FullUserTest.java:31 - Creating user from json...
13:22:29 DEBUG SimpleSearchUserTest.java:28 - Creating user from json...
13:22:29 DEBUG ComplexSearchUserTest.java:63 - Searching at most 3 users using POST verb
13:22:29 DEBUG ComplexSearchUserTest.java:64 - Sorted by family name descending
13:22:29 DEBUG ComplexSearchUserTest.java:65 - Retrieving only the attributes [name.familyName, active]
13:22:29 DEBUG ComplexSearchUserTest.java:149 - Searching at most 3 users using POST verb
13:22:29 DEBUG ComplexSearchUserTest.java:150 - Sorted by displayName ascending
13:22:29 DEBUG ComplexSearchUserTest.java:151 - Excluding the attributes [x509Certificates, entitlements, roles, ims, phoneNumbers, addresses, emails, groups]
13:22:29 DEBUG ComplexSearchUserTest.java:34 - Searching users with attribute nickName existent or ims.value=Skype using POST verb
13:22:29 INFO  GroupAssignUserTest.java:35 - Creating 3 users...
13:22:29 DEBUG QueryParamRetrievalTest.java:29 - Retrieving test users...
13:22:29 DEBUG QueryParamCreateUpdateTest.java:33 - Creating user from json...
13:22:30 DEBUG PatchReplaceUserTest.java:34 - Creating user from json...
13:22:30 DEBUG PatchAddUserTest.java:25 - Creating user from json...
13:22:30 DEBUG PatchDeleteUserTest.java:25 - Creating user from json...
13:22:30 DEBUG PatchUserExtTest.java:35 - Creating user from json...
13:22:30 DEBUG UserBaseTest.java:33 - Deleting user 1584451350228
13:22:30 DEBUG PatchGroupTest.java:42 - Creating group from json...
13:22:30 INFO  UsersBulkTest.java:30 - Sending a bulk with POST, PUT, and PATCH operations...
13:22:30 INFO  GroupsBulkTest.java:35 - Creating one user and one group using bulk json string
13:22:30 INFO  GroupsBulkTest.java:93 - Cleaning...
13:22:30 INFO  AbstractScimClient.java:127 - Closing RestEasy client
Tests run: 113, Failures: 51, Errors: 0, Skipped: 60, Time elapsed: 5.78 sec <<< FAILURE!
init(gluu.scim2.client.servicemeta.ResourceTypesTest)  Time elapsed: 3.896 sec  <<< FAILURE!
javax.ws.rs.ProcessingException: com.fasterxml.jackson.databind.exc.MismatchedInputException: Cannot construct instance of `java.util.LinkedHashMap` (although at least one Creator exists): no String-argument constructor/factory method to deserialize from String value ('User')
 at [Source: (ByteArrayInputStream); line: 1, column: 339] (through reference chain: org.gluu.oxtrust.model.scim2.ListResponse["Resources"]->java.util.ArrayList[0]->org.gluu.oxtrust.model.scim2.BaseScimResource["name"])
	at org.jboss.resteasy.client.jaxrs.internal.ClientResponse.readFrom(ClientResponse.java:245)
	at org.jboss.resteasy.specimpl.BuiltResponse.readEntity(BuiltResponse.java:88)
	at org.jboss.resteasy.specimpl.AbstractBuiltResponse.readEntity(AbstractBuiltResponse.java:262)
	at gluu.scim2.client.servicemeta.ResourceTypesTest.init(ResourceTypesTest.java:22)
Caused by: com.fasterxml.jackson.databind.exc.MismatchedInputException: Cannot construct instance of `java.util.LinkedHashMap` (although at least one Creator exists): no String-argument constructor/factory method to deserialize from String value ('User')
 at [Source: (ByteArrayInputStream); line: 1, column: 339] (through reference chain: org.gluu.oxtrust.model.scim2.ListResponse["Resources"]->java.util.ArrayList[0]->org.gluu.oxtrust.model.scim2.BaseScimResource["name"])
	at com.fasterxml.jackson.databind.exc.MismatchedInputException.from(MismatchedInputException.java:63)
	at com.fasterxml.jackson.databind.DeserializationContext.reportInputMismatch(DeserializationContext.java:1429)
	at com.fasterxml.jackson.databind.DeserializationContext.handleMissingInstantiator(DeserializationContext.java:1059)
	at com.fasterxml.jackson.databind.deser.ValueInstantiator._createFromStringFallbacks(ValueInstantiator.java:371)
	at com.fasterxml.jackson.databind.deser.ValueInstantiator.createFromString(ValueInstantiator.java:258)
	at com.fasterxml.jackson.databind.deser.std.MapDeserializer.deserialize(MapDeserializer.java:357)
	at com.fasterxml.jackson.databind.deser.std.MapDeserializer.deserialize(MapDeserializer.java:29)
	at com.fasterxml.jackson.databind.deser.SettableAnyProperty.deserialize(SettableAnyProperty.java:153)
	at com.fasterxml.jackson.databind.deser.SettableAnyProperty.deserializeAndSet(SettableAnyProperty.java:134)
	at com.fasterxml.jackson.databind.deser.BeanDeserializerBase.handleUnknownVanilla(BeanDeserializerBase.java:1564)
	at com.fasterxml.jackson.databind.deser.BeanDeserializer.vanillaDeserialize(BeanDeserializer.java:294)
	at com.fasterxml.jackson.databind.deser.BeanDeserializer.deserialize(BeanDeserializer.java:151)
	at com.fasterxml.jackson.databind.deser.std.CollectionDeserializer.deserialize(CollectionDeserializer.java:286)
	at com.fasterxml.jackson.databind.deser.std.CollectionDeserializer.deserialize(CollectionDeserializer.java:245)
	at com.fasterxml.jackson.databind.deser.std.CollectionDeserializer.deserialize(CollectionDeserializer.java:27)
	at com.fasterxml.jackson.databind.deser.impl.MethodProperty.deserializeAndSet(MethodProperty.java:129)
	at com.fasterxml.jackson.databind.deser.BeanDeserializer.vanillaDeserialize(BeanDeserializer.java:288)
	at com.fasterxml.jackson.databind.deser.BeanDeserializer.deserialize(BeanDeserializer.java:151)
	at com.fasterxml.jackson.databind.ObjectReader._bind(ObjectReader.java:1682)
	at com.fasterxml.jackson.databind.ObjectReader.readValue(ObjectReader.java:977)
	at org.jboss.resteasy.plugins.providers.jackson.ResteasyJackson2Provider.readFrom(ResteasyJackson2Provider.java:185)
	at org.jboss.resteasy.core.interception.AbstractReaderInterceptorContext.readFrom(AbstractReaderInterceptorContext.java:66)
	at org.jboss.resteasy.core.interception.AbstractReaderInterceptorContext.proceed(AbstractReaderInterceptorContext.java:56)
	at org.jboss.resteasy.client.jaxrs.internal.ClientResponse.readFrom(ClientResponse.java:211)
	... 36 more

createUser(gluu.scim2.client.singleresource.MinimalUserTest)  Time elapsed: 0.079 sec  <<< FAILURE!
gluu.scim2.client.exception.ScimInitializationException
	at gluu.scim2.client.UmaScimClient.authorize(UmaScimClient.java:108)
	at gluu.scim2.client.AbstractScimClient.invoke(AbstractScimClient.java:142)
	at com.sun.proxy.$Proxy45.createUser(Unknown Source)
	at gluu.scim2.client.UserBaseTest.createUserFromJson(UserBaseTest.java:21)
	at gluu.scim2.client.singleresource.MinimalUserTest.createUser(MinimalUserTest.java:25)
Caused by: java.lang.NullPointerException
	at java.util.StringTokenizer.<init>(StringTokenizer.java:199)
	at org.gluu.util.StringHelper.split(StringHelper.java:83)
	at org.gluu.util.StringHelper.split(StringHelper.java:79)
	at gluu.scim2.client.UmaScimClient.authorize(UmaScimClient.java:96)
	... 38 more

delete(gluu.scim2.client.singleresource.MinimalUserTest)  Time elapsed: 0.001 sec  <<< FAILURE!
java.lang.NullPointerException
	at gluu.scim2.client.UserBaseTest.deleteUser(UserBaseTest.java:33)
	at gluu.scim2.client.singleresource.MinimalUserTest.delete(MinimalUserTest.java:45)

createGroup(gluu.scim2.client.singleresource.MinimalGroupTest)  Time elapsed: 0.026 sec  <<< FAILURE!
gluu.scim2.client.exception.ScimInitializationException
	at gluu.scim2.client.UmaScimClient.authorize(UmaScimClient.java:108)
	at gluu.scim2.client.AbstractScimClient.invoke(AbstractScimClient.java:142)
	at com.sun.proxy.$Proxy45.createGroup(Unknown Source)
	at gluu.scim2.client.singleresource.MinimalGroupTest.createGroup(MinimalGroupTest.java:27)
Caused by: java.lang.NullPointerException
	at java.util.StringTokenizer.<init>(StringTokenizer.java:199)
	at org.gluu.util.StringHelper.split(StringHelper.java:83)
	at org.gluu.util.StringHelper.split(StringHelper.java:79)
	at gluu.scim2.client.UmaScimClient.authorize(UmaScimClient.java:96)
	... 37 more

delete(gluu.scim2.client.singleresource.MinimalGroupTest)  Time elapsed: 0.001 sec  <<< FAILURE!
java.lang.NullPointerException
	at gluu.scim2.client.singleresource.MinimalGroupTest.delete(MinimalGroupTest.java:54)

create(gluu.scim2.client.singleresource.AverageUserTest)  Time elapsed: 0.04 sec  <<< FAILURE!
gluu.scim2.client.exception.ScimInitializationException
	at gluu.scim2.client.UmaScimClient.authorize(UmaScimClient.java:108)
	at gluu.scim2.client.AbstractScimClient.invoke(AbstractScimClient.java:142)
	at com.sun.proxy.$Proxy45.createUser(Unknown Source)
	at gluu.scim2.client.UserBaseTest.createUserFromJson(UserBaseTest.java:21)
	at gluu.scim2.client.singleresource.AverageUserTest.create(AverageUserTest.java:32)
Caused by: java.lang.NullPointerException
	at java.util.StringTokenizer.<init>(StringTokenizer.java:199)
	at org.gluu.util.StringHelper.split(StringHelper.java:83)
	at org.gluu.util.StringHelper.split(StringHelper.java:79)
	at gluu.scim2.client.UmaScimClient.authorize(UmaScimClient.java:96)
	... 38 more

delete(gluu.scim2.client.singleresource.AverageUserTest)  Time elapsed: 0.001 sec  <<< FAILURE!
java.lang.NullPointerException
	at gluu.scim2.client.UserBaseTest.deleteUser(UserBaseTest.java:33)
	at gluu.scim2.client.singleresource.AverageUserTest.delete(AverageUserTest.java:121)

createFull(gluu.scim2.client.singleresource.FullUserTest)  Time elapsed: 0.025 sec  <<< FAILURE!
gluu.scim2.client.exception.ScimInitializationException
	at gluu.scim2.client.UmaScimClient.authorize(UmaScimClient.java:108)
	at gluu.scim2.client.AbstractScimClient.invoke(AbstractScimClient.java:142)
	at com.sun.proxy.$Proxy45.createUser(Unknown Source)
	at gluu.scim2.client.UserBaseTest.createUserFromJson(UserBaseTest.java:21)
	at gluu.scim2.client.singleresource.FullUserTest.createFull(FullUserTest.java:32)
Caused by: java.lang.NullPointerException
	at java.util.StringTokenizer.<init>(StringTokenizer.java:199)
	at org.gluu.util.StringHelper.split(StringHelper.java:83)
	at org.gluu.util.StringHelper.split(StringHelper.java:79)
	at gluu.scim2.client.UmaScimClient.authorize(UmaScimClient.java:96)
	... 38 more

delete(gluu.scim2.client.singleresource.FullUserTest)  Time elapsed: 0 sec  <<< FAILURE!
java.lang.NullPointerException
	at gluu.scim2.client.UserBaseTest.deleteUser(UserBaseTest.java:33)
	at gluu.scim2.client.singleresource.FullUserTest.delete(FullUserTest.java:152)

create(gluu.scim2.client.search.SimpleSearchUserTest)  Time elapsed: 0.028 sec  <<< FAILURE!
gluu.scim2.client.exception.ScimInitializationException
	at gluu.scim2.client.UmaScimClient.authorize(UmaScimClient.java:108)
	at gluu.scim2.client.AbstractScimClient.invoke(AbstractScimClient.java:142)
	at com.sun.proxy.$Proxy45.createUser(Unknown Source)
	at gluu.scim2.client.UserBaseTest.createUserFromJson(UserBaseTest.java:21)
	at gluu.scim2.client.search.SimpleSearchUserTest.create(SimpleSearchUserTest.java:29)
Caused by: java.lang.NullPointerException
	at java.util.StringTokenizer.<init>(StringTokenizer.java:199)
	at org.gluu.util.StringHelper.split(StringHelper.java:83)
	at org.gluu.util.StringHelper.split(StringHelper.java:79)
	at gluu.scim2.client.UmaScimClient.authorize(UmaScimClient.java:96)
	... 38 more

searchAttributesParam(gluu.scim2.client.search.ComplexSearchUserTest)  Time elapsed: 0.064 sec  <<< FAILURE!
gluu.scim2.client.exception.ScimInitializationException
	at gluu.scim2.client.UmaScimClient.authorize(UmaScimClient.java:108)
	at gluu.scim2.client.AbstractScimClient.invoke(AbstractScimClient.java:142)
	at com.sun.proxy.$Proxy45.searchUsersPost(Unknown Source)
	at gluu.scim2.client.search.ComplexSearchUserTest.searchAttributesParam(ComplexSearchUserTest.java:75)
Caused by: java.lang.NullPointerException
	at java.util.StringTokenizer.<init>(StringTokenizer.java:199)
	at org.gluu.util.StringHelper.split(StringHelper.java:83)
	at org.gluu.util.StringHelper.split(StringHelper.java:79)
	at gluu.scim2.client.UmaScimClient.authorize(UmaScimClient.java:96)
	... 37 more

searchExcludedAttributesParam(gluu.scim2.client.search.ComplexSearchUserTest)  Time elapsed: 0.031 sec  <<< FAILURE!
gluu.scim2.client.exception.ScimInitializationException
	at gluu.scim2.client.UmaScimClient.authorize(UmaScimClient.java:108)
	at gluu.scim2.client.AbstractScimClient.invoke(AbstractScimClient.java:142)
	at com.sun.proxy.$Proxy45.searchUsersPost(Unknown Source)
	at gluu.scim2.client.search.ComplexSearchUserTest.searchExcludedAttributesParam(ComplexSearchUserTest.java:161)
Caused by: java.lang.NullPointerException
	at java.util.StringTokenizer.<init>(StringTokenizer.java:199)
	at org.gluu.util.StringHelper.split(StringHelper.java:83)
	at org.gluu.util.StringHelper.split(StringHelper.java:79)
	at gluu.scim2.client.UmaScimClient.authorize(UmaScimClient.java:96)
	... 37 more

searchNoAttributesParam(gluu.scim2.client.search.ComplexSearchUserTest)  Time elapsed: 0.026 sec  <<< FAILURE!
gluu.scim2.client.exception.ScimInitializationException
	at gluu.scim2.client.UmaScimClient.authorize(UmaScimClient.java:108)
	at gluu.scim2.client.AbstractScimClient.invoke(AbstractScimClient.java:142)
	at com.sun.proxy.$Proxy45.searchUsersPost(Unknown Source)
	at gluu.scim2.client.search.ComplexSearchUserTest.searchNoAttributesParam(ComplexSearchUserTest.java:38)
Caused by: java.lang.NullPointerException
	at java.util.StringTokenizer.<init>(StringTokenizer.java:199)
	at org.gluu.util.StringHelper.split(StringHelper.java:83)
	at org.gluu.util.StringHelper.split(StringHelper.java:79)
	at gluu.scim2.client.UmaScimClient.authorize(UmaScimClient.java:96)
	... 37 more

searchSortByExternalId(gluu.scim2.client.search.ComplexSearchUserTest)  Time elapsed: 0.034 sec  <<< FAILURE!
gluu.scim2.client.exception.ScimInitializationException
	at gluu.scim2.client.UmaScimClient.authorize(UmaScimClient.java:108)
	at gluu.scim2.client.AbstractScimClient.invoke(AbstractScimClient.java:142)
	at com.sun.proxy.$Proxy45.searchUsers(Unknown Source)
	at gluu.scim2.client.search.ComplexSearchUserTest.searchSortByExternalId(ComplexSearchUserTest.java:244)
Caused by: java.lang.NullPointerException
	at java.util.StringTokenizer.<init>(StringTokenizer.java:199)
	at org.gluu.util.StringHelper.split(StringHelper.java:83)
	at org.gluu.util.StringHelper.split(StringHelper.java:79)
	at gluu.scim2.client.UmaScimClient.authorize(UmaScimClient.java:96)
	... 37 more

search1(gluu.scim2.client.search.PaginationUserSearchTest)  Time elapsed: 0.024 sec  <<< FAILURE!
gluu.scim2.client.exception.ScimInitializationException
	at gluu.scim2.client.UmaScimClient.authorize(UmaScimClient.java:108)
	at gluu.scim2.client.AbstractScimClient.invoke(AbstractScimClient.java:142)
	at com.sun.proxy.$Proxy45.searchUsersPost(Unknown Source)
	at gluu.scim2.client.search.PaginationUserSearchTest.search1(PaginationUserSearchTest.java:36)
Caused by: java.lang.NullPointerException
	at java.util.StringTokenizer.<init>(StringTokenizer.java:199)
	at org.gluu.util.StringHelper.split(StringHelper.java:83)
	at org.gluu.util.StringHelper.split(StringHelper.java:79)
	at gluu.scim2.client.UmaScimClient.authorize(UmaScimClient.java:96)
	... 37 more

delete(gluu.scim2.client.search.SimpleSearchUserTest)  Time elapsed: 0 sec  <<< FAILURE!
java.lang.NullPointerException
	at gluu.scim2.client.UserBaseTest.deleteUser(UserBaseTest.java:33)
	at gluu.scim2.client.search.SimpleSearchUserTest.delete(SimpleSearchUserTest.java:136)

createUsers(gluu.scim2.client.multipleresource.GroupAssignUserTest)  Time elapsed: 0.072 sec  <<< FAILURE!
gluu.scim2.client.exception.ScimInitializationException
	at gluu.scim2.client.UmaScimClient.authorize(UmaScimClient.java:108)
	at gluu.scim2.client.AbstractScimClient.invoke(AbstractScimClient.java:142)
	at com.sun.proxy.$Proxy45.createUser(Unknown Source)
	at gluu.scim2.client.multipleresource.GroupAssignUserTest.createUsers(GroupAssignUserTest.java:40)
Caused by: java.lang.NullPointerException
	at java.util.StringTokenizer.<init>(StringTokenizer.java:199)
	at org.gluu.util.StringHelper.split(StringHelper.java:83)
	at org.gluu.util.StringHelper.split(StringHelper.java:79)
	at gluu.scim2.client.UmaScimClient.authorize(UmaScimClient.java:96)
	... 37 more

multipleRetrieval(gluu.scim2.client.singleresource.QueryParamRetrievalTest)  Time elapsed: 0.033 sec  <<< FAILURE!
gluu.scim2.client.exception.ScimInitializationException
	at gluu.scim2.client.UmaScimClient.authorize(UmaScimClient.java:108)
	at gluu.scim2.client.AbstractScimClient.invoke(AbstractScimClient.java:142)
	at com.sun.proxy.$Proxy45.searchUsers(Unknown Source)
	at gluu.scim2.client.singleresource.QueryParamRetrievalTest.multipleRetrieval(QueryParamRetrievalTest.java:32)
Caused by: java.lang.NullPointerException
	at java.util.StringTokenizer.<init>(StringTokenizer.java:199)
	at org.gluu.util.StringHelper.split(StringHelper.java:83)
	at org.gluu.util.StringHelper.split(StringHelper.java:79)
	at gluu.scim2.client.UmaScimClient.authorize(UmaScimClient.java:96)
	... 37 more

create1(gluu.scim2.client.singleresource.QueryParamCreateUpdateTest)  Time elapsed: 0.062 sec  <<< FAILURE!
gluu.scim2.client.exception.ScimInitializationException
	at gluu.scim2.client.UmaScimClient.authorize(UmaScimClient.java:108)
	at gluu.scim2.client.AbstractScimClient.invoke(AbstractScimClient.java:142)
	at com.sun.proxy.$Proxy45.createUser(Unknown Source)
	at gluu.scim2.client.singleresource.QueryParamCreateUpdateTest.create1(QueryParamCreateUpdateTest.java:38)
Caused by: java.lang.NullPointerException
	at java.util.StringTokenizer.<init>(StringTokenizer.java:199)
	at org.gluu.util.StringHelper.split(StringHelper.java:83)
	at org.gluu.util.StringHelper.split(StringHelper.java:79)
	at gluu.scim2.client.UmaScimClient.authorize(UmaScimClient.java:96)
	... 37 more

delete1(gluu.scim2.client.singleresource.QueryParamCreateUpdateTest)  Time elapsed: 0.001 sec  <<< FAILURE!
java.lang.NullPointerException
	at gluu.scim2.client.UserBaseTest.deleteUser(UserBaseTest.java:33)
	at gluu.scim2.client.singleresource.QueryParamCreateUpdateTest.delete1(QueryParamCreateUpdateTest.java:48)

delete(gluu.scim2.client.singleresource.QueryParamCreateUpdateTest)  Time elapsed: 0.002 sec  <<< FAILURE!
java.lang.NullPointerException
	at gluu.scim2.client.UserBaseTest.deleteUser(UserBaseTest.java:33)
	at gluu.scim2.client.singleresource.QueryParamCreateUpdateTest.delete(QueryParamCreateUpdateTest.java:144)

searchJson(gluu.scim2.client.search.MultipleResourcesSearchTest)  Time elapsed: 0.076 sec  <<< FAILURE!
gluu.scim2.client.exception.ScimInitializationException
	at gluu.scim2.client.UmaScimClient.authorize(UmaScimClient.java:108)
	at gluu.scim2.client.AbstractScimClient.invoke(AbstractScimClient.java:142)
	at com.sun.proxy.$Proxy45.searchResourcesPost(Unknown Source)
	at gluu.scim2.client.search.MultipleResourcesSearchTest.searchJson(MultipleResourcesSearchTest.java:26)
Caused by: java.lang.NullPointerException
	at java.util.StringTokenizer.<init>(StringTokenizer.java:199)
	at org.gluu.util.StringHelper.split(StringHelper.java:83)
	at org.gluu.util.StringHelper.split(StringHelper.java:79)
	at gluu.scim2.client.UmaScimClient.authorize(UmaScimClient.java:96)
	... 37 more

createForReplace(gluu.scim2.client.patch.PatchReplaceUserTest)  Time elapsed: 0.027 sec  <<< FAILURE!
gluu.scim2.client.exception.ScimInitializationException
	at gluu.scim2.client.UmaScimClient.authorize(UmaScimClient.java:108)
	at gluu.scim2.client.AbstractScimClient.invoke(AbstractScimClient.java:142)
	at com.sun.proxy.$Proxy45.createUser(Unknown Source)
	at gluu.scim2.client.UserBaseTest.createUserFromJson(UserBaseTest.java:21)
	at gluu.scim2.client.patch.PatchReplaceUserTest.createForReplace(PatchReplaceUserTest.java:35)
Caused by: java.lang.NullPointerException
	at java.util.StringTokenizer.<init>(StringTokenizer.java:199)
	at org.gluu.util.StringHelper.split(StringHelper.java:83)
	at org.gluu.util.StringHelper.split(StringHelper.java:79)
	at gluu.scim2.client.UmaScimClient.authorize(UmaScimClient.java:96)
	... 38 more

delete(gluu.scim2.client.patch.PatchReplaceUserTest)  Time elapsed: 0.001 sec  <<< FAILURE!
java.lang.NullPointerException
	at gluu.scim2.client.UserBaseTest.deleteUser(UserBaseTest.java:33)
	at gluu.scim2.client.patch.PatchReplaceUserTest.delete(PatchReplaceUserTest.java:199)

createForAdd(gluu.scim2.client.patch.PatchAddUserTest)  Time elapsed: 0.022 sec  <<< FAILURE!
gluu.scim2.client.exception.ScimInitializationException
	at gluu.scim2.client.UmaScimClient.authorize(UmaScimClient.java:108)
	at gluu.scim2.client.AbstractScimClient.invoke(AbstractScimClient.java:142)
	at com.sun.proxy.$Proxy45.createUser(Unknown Source)
	at gluu.scim2.client.UserBaseTest.createUserFromJson(UserBaseTest.java:21)
	at gluu.scim2.client.patch.PatchAddUserTest.createForAdd(PatchAddUserTest.java:26)
Caused by: java.lang.NullPointerException
	at java.util.StringTokenizer.<init>(StringTokenizer.java:199)
	at org.gluu.util.StringHelper.split(StringHelper.java:83)
	at org.gluu.util.StringHelper.split(StringHelper.java:79)
	at gluu.scim2.client.UmaScimClient.authorize(UmaScimClient.java:96)
	... 38 more

delete(gluu.scim2.client.patch.PatchAddUserTest)  Time elapsed: 0 sec  <<< FAILURE!
java.lang.NullPointerException
	at gluu.scim2.client.UserBaseTest.deleteUser(UserBaseTest.java:33)
	at gluu.scim2.client.patch.PatchAddUserTest.delete(PatchAddUserTest.java:48)

createForDel(gluu.scim2.client.patch.PatchDeleteUserTest)  Time elapsed: 0.023 sec  <<< FAILURE!
gluu.scim2.client.exception.ScimInitializationException
	at gluu.scim2.client.UmaScimClient.authorize(UmaScimClient.java:108)
	at gluu.scim2.client.AbstractScimClient.invoke(AbstractScimClient.java:142)
	at com.sun.proxy.$Proxy45.createUser(Unknown Source)
	at gluu.scim2.client.UserBaseTest.createUserFromJson(UserBaseTest.java:21)
	at gluu.scim2.client.patch.PatchDeleteUserTest.createForDel(PatchDeleteUserTest.java:26)
Caused by: java.lang.NullPointerException
	at java.util.StringTokenizer.<init>(StringTokenizer.java:199)
	at org.gluu.util.StringHelper.split(StringHelper.java:83)
	at org.gluu.util.StringHelper.split(StringHelper.java:79)
	at gluu.scim2.client.UmaScimClient.authorize(UmaScimClient.java:96)
	... 38 more

delete(gluu.scim2.client.patch.PatchDeleteUserTest)  Time elapsed: 0 sec  <<< FAILURE!
java.lang.NullPointerException
	at gluu.scim2.client.UserBaseTest.deleteUser(UserBaseTest.java:33)
	at gluu.scim2.client.patch.PatchDeleteUserTest.delete(PatchDeleteUserTest.java:55)

create(gluu.scim2.client.patch.PatchUserExtTest)  Time elapsed: 0.026 sec  <<< FAILURE!
gluu.scim2.client.exception.ScimInitializationException
	at gluu.scim2.client.UmaScimClient.authorize(UmaScimClient.java:108)
	at gluu.scim2.client.AbstractScimClient.invoke(AbstractScimClient.java:142)
	at com.sun.proxy.$Proxy45.createUser(Unknown Source)
	at gluu.scim2.client.UserBaseTest.createUserFromJson(UserBaseTest.java:21)
	at gluu.scim2.client.patch.PatchUserExtTest.create(PatchUserExtTest.java:36)
Caused by: java.lang.NullPointerException
	at java.util.StringTokenizer.<init>(StringTokenizer.java:199)
	at org.gluu.util.StringHelper.split(StringHelper.java:83)
	at org.gluu.util.StringHelper.split(StringHelper.java:79)
	at gluu.scim2.client.UmaScimClient.authorize(UmaScimClient.java:96)
	... 38 more

delete(gluu.scim2.client.patch.PatchUserExtTest)  Time elapsed: 0 sec  <<< FAILURE!
java.lang.NullPointerException
	at gluu.scim2.client.UserBaseTest.deleteUser(UserBaseTest.java:33)
	at gluu.scim2.client.patch.PatchUserExtTest.delete(PatchUserExtTest.java:100)

create(gluu.scim2.client.patch.PatchValueFilterUserTest)  Time elapsed: 0.042 sec  <<< FAILURE!
gluu.scim2.client.exception.ScimInitializationException
	at gluu.scim2.client.UmaScimClient.authorize(UmaScimClient.java:108)
	at gluu.scim2.client.AbstractScimClient.invoke(AbstractScimClient.java:142)
	at com.sun.proxy.$Proxy45.createUser(Unknown Source)
	at gluu.scim2.client.patch.PatchValueFilterUserTest.create(PatchValueFilterUserTest.java:31)
Caused by: java.lang.NullPointerException
	at java.util.StringTokenizer.<init>(StringTokenizer.java:199)
	at org.gluu.util.StringHelper.split(StringHelper.java:83)
	at org.gluu.util.StringHelper.split(StringHelper.java:79)
	at gluu.scim2.client.UmaScimClient.authorize(UmaScimClient.java:96)
	... 37 more

delete(gluu.scim2.client.patch.PatchValueFilterUserTest)  Time elapsed: 0.005 sec  <<< FAILURE!
java.lang.reflect.UndeclaredThrowableException
	at com.sun.proxy.$Proxy45.deleteUser(Unknown Source)
	at gluu.scim2.client.UserBaseTest.deleteUser(UserBaseTest.java:34)
	at gluu.scim2.client.patch.PatchValueFilterUserTest.delete(PatchValueFilterUserTest.java:88)
Caused by: java.lang.reflect.InvocationTargetException
	at sun.reflect.NativeMethodAccessorImpl.invoke0(Native Method)
	at sun.reflect.NativeMethodAccessorImpl.invoke(NativeMethodAccessorImpl.java:62)
	at sun.reflect.DelegatingMethodAccessorImpl.invoke(DelegatingMethodAccessorImpl.java:43)
	at java.lang.reflect.Method.invoke(Method.java:498)
	at gluu.scim2.client.AbstractScimClient.invokeServiceMethod(AbstractScimClient.java:99)
	at gluu.scim2.client.AbstractScimClient.invoke(AbstractScimClient.java:139)
	... 37 more
Caused by: java.lang.NullPointerException: RESTEASY004670: value was null
	at org.jboss.resteasy.client.jaxrs.internal.ClientWebTarget.resolveTemplate(ClientWebTarget.java:192)
	at org.jboss.resteasy.client.jaxrs.internal.ClientWebTarget.resolveTemplate(ClientWebTarget.java:25)
	at org.jboss.resteasy.client.jaxrs.internal.proxy.processors.webtarget.PathParamProcessor.build(PathParamProcessor.java:31)
	at org.jboss.resteasy.client.jaxrs.internal.proxy.ClientInvoker.createRequest(ClientInvoker.java:162)
	at org.jboss.resteasy.client.jaxrs.internal.proxy.ClientInvoker.invokeSync(ClientInvoker.java:148)
	at org.jboss.resteasy.client.jaxrs.internal.proxy.ClientInvoker.invoke(ClientInvoker.java:112)
	at org.jboss.resteasy.client.jaxrs.internal.proxy.ClientProxy.invoke(ClientProxy.java:76)
	at com.sun.proxy.$Proxy44.deleteUser(Unknown Source)
	... 43 more

createGroup(gluu.scim2.client.patch.PatchGroupTest)  Time elapsed: 0.025 sec  <<< FAILURE!
gluu.scim2.client.exception.ScimInitializationException
	at gluu.scim2.client.UmaScimClient.authorize(UmaScimClient.java:108)
	at gluu.scim2.client.AbstractScimClient.invoke(AbstractScimClient.java:142)
	at com.sun.proxy.$Proxy45.createGroup(Unknown Source)
	at gluu.scim2.client.patch.PatchGroupTest.createGroup(PatchGroupTest.java:43)
Caused by: java.lang.NullPointerException
	at java.util.StringTokenizer.<init>(StringTokenizer.java:199)
	at org.gluu.util.StringHelper.split(StringHelper.java:83)
	at org.gluu.util.StringHelper.split(StringHelper.java:79)
	at gluu.scim2.client.UmaScimClient.authorize(UmaScimClient.java:96)
	... 37 more

delete(gluu.scim2.client.patch.PatchGroupTest)  Time elapsed: 0.001 sec  <<< FAILURE!
java.lang.NullPointerException
	at gluu.scim2.client.patch.PatchGroupTest.delete(PatchGroupTest.java:146)

bulkJson1(gluu.scim2.client.bulk.UsersBulkTest)  Time elapsed: 0.036 sec  <<< FAILURE!
gluu.scim2.client.exception.ScimInitializationException
	at gluu.scim2.client.UmaScimClient.authorize(UmaScimClient.java:108)
	at gluu.scim2.client.AbstractScimClient.invoke(AbstractScimClient.java:142)
	at com.sun.proxy.$Proxy45.processBulkOperations(Unknown Source)
	at gluu.scim2.client.bulk.UsersBulkTest.bulkJson1(UsersBulkTest.java:31)
Caused by: java.lang.NullPointerException
	at java.util.StringTokenizer.<init>(StringTokenizer.java:199)
	at org.gluu.util.StringHelper.split(StringHelper.java:83)
	at org.gluu.util.StringHelper.split(StringHelper.java:79)
	at gluu.scim2.client.UmaScimClient.authorize(UmaScimClient.java:96)
	... 37 more

bulkJson(gluu.scim2.client.bulk.GroupsBulkTest)  Time elapsed: 0.04 sec  <<< FAILURE!
gluu.scim2.client.exception.ScimInitializationException
	at gluu.scim2.client.UmaScimClient.authorize(UmaScimClient.java:108)
	at gluu.scim2.client.AbstractScimClient.invoke(AbstractScimClient.java:142)
	at com.sun.proxy.$Proxy45.processBulkOperations(Unknown Source)
	at gluu.scim2.client.bulk.GroupsBulkTest.bulkJson(GroupsBulkTest.java:37)
Caused by: java.lang.NullPointerException
	at java.util.StringTokenizer.<init>(StringTokenizer.java:199)
	at org.gluu.util.StringHelper.split(StringHelper.java:83)
	at org.gluu.util.StringHelper.split(StringHelper.java:79)
	at gluu.scim2.client.UmaScimClient.authorize(UmaScimClient.java:96)
	... 37 more

delete(gluu.scim2.client.bulk.GroupsBulkTest)  Time elapsed: 0.039 sec  <<< FAILURE!
gluu.scim2.client.exception.ScimInitializationException
	at gluu.scim2.client.UmaScimClient.authorize(UmaScimClient.java:108)
	at gluu.scim2.client.AbstractScimClient.invoke(AbstractScimClient.java:142)
	at com.sun.proxy.$Proxy45.processBulkOperations(Unknown Source)
	at gluu.scim2.client.bulk.GroupsBulkTest.delete(GroupsBulkTest.java:112)
Caused by: java.lang.NullPointerException
	at java.util.StringTokenizer.<init>(StringTokenizer.java:199)
	at org.gluu.util.StringHelper.split(StringHelper.java:83)
	at org.gluu.util.StringHelper.split(StringHelper.java:79)
	at gluu.scim2.client.UmaScimClient.authorize(UmaScimClient.java:96)
	... 37 more

createWrongCustAttrs1(gluu.scim2.client.corner.WrongPayloadUserExtTest)  Time elapsed: 0.028 sec  <<< FAILURE!
gluu.scim2.client.exception.ScimInitializationException
	at gluu.scim2.client.UmaScimClient.authorize(UmaScimClient.java:108)
	at gluu.scim2.client.AbstractScimClient.invoke(AbstractScimClient.java:142)
	at com.sun.proxy.$Proxy45.createUser(Unknown Source)
	at gluu.scim2.client.corner.WrongPayloadUserExtTest.createWrongCustAttrs1(WrongPayloadUserExtTest.java:21)
Caused by: java.lang.NullPointerException
	at java.util.StringTokenizer.<init>(StringTokenizer.java:199)
	at org.gluu.util.StringHelper.split(StringHelper.java:83)
	at org.gluu.util.StringHelper.split(StringHelper.java:79)
	at gluu.scim2.client.UmaScimClient.authorize(UmaScimClient.java:96)
	... 37 more

createWrongCustAttrs2(gluu.scim2.client.corner.WrongPayloadUserExtTest)  Time elapsed: 0.027 sec  <<< FAILURE!
gluu.scim2.client.exception.ScimInitializationException
	at gluu.scim2.client.UmaScimClient.authorize(UmaScimClient.java:108)
	at gluu.scim2.client.AbstractScimClient.invoke(AbstractScimClient.java:142)
	at com.sun.proxy.$Proxy45.createUser(Unknown Source)
	at gluu.scim2.client.corner.WrongPayloadUserExtTest.createWrongCustAttrs2(WrongPayloadUserExtTest.java:28)
Caused by: java.lang.NullPointerException
	at java.util.StringTokenizer.<init>(StringTokenizer.java:199)
	at org.gluu.util.StringHelper.split(StringHelper.java:83)
	at org.gluu.util.StringHelper.split(StringHelper.java:79)
	at gluu.scim2.client.UmaScimClient.authorize(UmaScimClient.java:96)
	... 37 more

createWrongCustAttrs3(gluu.scim2.client.corner.WrongPayloadUserExtTest)  Time elapsed: 0.02 sec  <<< FAILURE!
gluu.scim2.client.exception.ScimInitializationException
	at gluu.scim2.client.UmaScimClient.authorize(UmaScimClient.java:108)
	at gluu.scim2.client.AbstractScimClient.invoke(AbstractScimClient.java:142)
	at com.sun.proxy.$Proxy45.createUser(Unknown Source)
	at gluu.scim2.client.corner.WrongPayloadUserExtTest.createWrongCustAttrs3(WrongPayloadUserExtTest.java:35)
Caused by: java.lang.NullPointerException
	at java.util.StringTokenizer.<init>(StringTokenizer.java:199)
	at org.gluu.util.StringHelper.split(StringHelper.java:83)
	at org.gluu.util.StringHelper.split(StringHelper.java:79)
	at gluu.scim2.client.UmaScimClient.authorize(UmaScimClient.java:96)
	... 37 more

createWrongCustAttrs4(gluu.scim2.client.corner.WrongPayloadUserExtTest)  Time elapsed: 0.019 sec  <<< FAILURE!
gluu.scim2.client.exception.ScimInitializationException
	at gluu.scim2.client.UmaScimClient.authorize(UmaScimClient.java:108)
	at gluu.scim2.client.AbstractScimClient.invoke(AbstractScimClient.java:142)
	at com.sun.proxy.$Proxy45.createUser(Unknown Source)
	at gluu.scim2.client.corner.WrongPayloadUserExtTest.createWrongCustAttrs4(WrongPayloadUserExtTest.java:42)
Caused by: java.lang.NullPointerException
	at java.util.StringTokenizer.<init>(StringTokenizer.java:199)
	at org.gluu.util.StringHelper.split(StringHelper.java:83)
	at org.gluu.util.StringHelper.split(StringHelper.java:79)
	at gluu.scim2.client.UmaScimClient.authorize(UmaScimClient.java:96)
	... 37 more

createWrongCustAttrs5(gluu.scim2.client.corner.WrongPayloadUserExtTest)  Time elapsed: 0.027 sec  <<< FAILURE!
gluu.scim2.client.exception.ScimInitializationException
	at gluu.scim2.client.UmaScimClient.authorize(UmaScimClient.java:108)
	at gluu.scim2.client.AbstractScimClient.invoke(AbstractScimClient.java:142)
	at com.sun.proxy.$Proxy45.createUser(Unknown Source)
	at gluu.scim2.client.corner.WrongPayloadUserExtTest.createWrongCustAttrs5(WrongPayloadUserExtTest.java:49)
Caused by: java.lang.NullPointerException
	at java.util.StringTokenizer.<init>(StringTokenizer.java:199)
	at org.gluu.util.StringHelper.split(StringHelper.java:83)
	at org.gluu.util.StringHelper.split(StringHelper.java:79)
	at gluu.scim2.client.UmaScimClient.authorize(UmaScimClient.java:96)
	... 37 more

createWrongCustAttrs6(gluu.scim2.client.corner.WrongPayloadUserExtTest)  Time elapsed: 0.024 sec  <<< FAILURE!
gluu.scim2.client.exception.ScimInitializationException
	at gluu.scim2.client.UmaScimClient.authorize(UmaScimClient.java:108)
	at gluu.scim2.client.AbstractScimClient.invoke(AbstractScimClient.java:142)
	at com.sun.proxy.$Proxy45.createUser(Unknown Source)
	at gluu.scim2.client.corner.WrongPayloadUserExtTest.createWrongCustAttrs6(WrongPayloadUserExtTest.java:56)
Caused by: java.lang.NullPointerException
	at java.util.StringTokenizer.<init>(StringTokenizer.java:199)
	at org.gluu.util.StringHelper.split(StringHelper.java:83)
	at org.gluu.util.StringHelper.split(StringHelper.java:79)
	at gluu.scim2.client.UmaScimClient.authorize(UmaScimClient.java:96)
	... 37 more

createWrongAttrs1(gluu.scim2.client.corner.WrongPayloadUserTest)  Time elapsed: 0.023 sec  <<< FAILURE!
gluu.scim2.client.exception.ScimInitializationException
	at gluu.scim2.client.UmaScimClient.authorize(UmaScimClient.java:108)
	at gluu.scim2.client.AbstractScimClient.invoke(AbstractScimClient.java:142)
	at com.sun.proxy.$Proxy45.createUser(Unknown Source)
	at gluu.scim2.client.corner.WrongPayloadUserTest.createWrongAttrs1(WrongPayloadUserTest.java:23)
Caused by: java.lang.NullPointerException
	at java.util.StringTokenizer.<init>(StringTokenizer.java:199)
	at org.gluu.util.StringHelper.split(StringHelper.java:83)
	at org.gluu.util.StringHelper.split(StringHelper.java:79)
	at gluu.scim2.client.UmaScimClient.authorize(UmaScimClient.java:96)
	... 37 more

createWrongAttrs2(gluu.scim2.client.corner.WrongPayloadUserTest)  Time elapsed: 0.022 sec  <<< FAILURE!
gluu.scim2.client.exception.ScimInitializationException
	at gluu.scim2.client.UmaScimClient.authorize(UmaScimClient.java:108)
	at gluu.scim2.client.AbstractScimClient.invoke(AbstractScimClient.java:142)
	at com.sun.proxy.$Proxy45.createUser(Unknown Source)
	at gluu.scim2.client.corner.WrongPayloadUserTest.createWrongAttrs2(WrongPayloadUserTest.java:30)
Caused by: java.lang.NullPointerException
	at java.util.StringTokenizer.<init>(StringTokenizer.java:199)
	at org.gluu.util.StringHelper.split(StringHelper.java:83)
	at org.gluu.util.StringHelper.split(StringHelper.java:79)
	at gluu.scim2.client.UmaScimClient.authorize(UmaScimClient.java:96)
	... 37 more

createWrongAttrs3(gluu.scim2.client.corner.WrongPayloadUserTest)  Time elapsed: 0.022 sec  <<< FAILURE!
gluu.scim2.client.exception.ScimInitializationException
	at gluu.scim2.client.UmaScimClient.authorize(UmaScimClient.java:108)
	at gluu.scim2.client.AbstractScimClient.invoke(AbstractScimClient.java:142)
	at com.sun.proxy.$Proxy45.createUser(Unknown Source)
	at gluu.scim2.client.corner.WrongPayloadUserTest.createWrongAttrs3(WrongPayloadUserTest.java:37)
Caused by: java.lang.NullPointerException
	at java.util.StringTokenizer.<init>(StringTokenizer.java:199)
	at org.gluu.util.StringHelper.split(StringHelper.java:83)
	at org.gluu.util.StringHelper.split(StringHelper.java:79)
	at gluu.scim2.client.UmaScimClient.authorize(UmaScimClient.java:96)
	... 37 more

queryAndRemoval(gluu.scim2.client.corner.PairwiseIdentifiersTest)  Time elapsed: 0.026 sec  <<< FAILURE!
gluu.scim2.client.exception.ScimInitializationException
	at gluu.scim2.client.UmaScimClient.authorize(UmaScimClient.java:108)
	at gluu.scim2.client.AbstractScimClient.invoke(AbstractScimClient.java:142)
	at com.sun.proxy.$Proxy45.searchUsers(Unknown Source)
	at gluu.scim2.client.corner.PairwiseIdentifiersTest.queryAndRemoval(PairwiseIdentifiersTest.java:27)
Caused by: java.lang.NullPointerException
	at java.util.StringTokenizer.<init>(StringTokenizer.java:199)
	at org.gluu.util.StringHelper.split(StringHelper.java:83)
	at org.gluu.util.StringHelper.split(StringHelper.java:79)
	at gluu.scim2.client.UmaScimClient.authorize(UmaScimClient.java:96)
	... 37 more

containabilityAll(gluu.scim2.client.corner.SpecialCharsTest)  Time elapsed: 0.022 sec  <<< FAILURE!
gluu.scim2.client.exception.ScimInitializationException
	at gluu.scim2.client.UmaScimClient.authorize(UmaScimClient.java:108)
	at gluu.scim2.client.AbstractScimClient.invoke(AbstractScimClient.java:142)
	at com.sun.proxy.$Proxy45.searchUsersPost(Unknown Source)
	at gluu.scim2.client.corner.SpecialCharsTest.containabilityAll(SpecialCharsTest.java:72)
Caused by: java.lang.NullPointerException
	at java.util.StringTokenizer.<init>(StringTokenizer.java:199)
	at org.gluu.util.StringHelper.split(StringHelper.java:83)
	at org.gluu.util.StringHelper.split(StringHelper.java:79)
	at gluu.scim2.client.UmaScimClient.authorize(UmaScimClient.java:96)
	... 37 more

containabilityAllInGivenName(gluu.scim2.client.corner.SpecialCharsTest)  Time elapsed: 0.019 sec  <<< FAILURE!
gluu.scim2.client.exception.ScimInitializationException
	at gluu.scim2.client.UmaScimClient.authorize(UmaScimClient.java:108)
	at gluu.scim2.client.AbstractScimClient.invoke(AbstractScimClient.java:142)
	at com.sun.proxy.$Proxy45.searchUsersPost(Unknown Source)
	at gluu.scim2.client.corner.SpecialCharsTest.containabilityAllInGivenName(SpecialCharsTest.java:93)
Caused by: java.lang.NullPointerException
	at java.util.StringTokenizer.<init>(StringTokenizer.java:199)
	at org.gluu.util.StringHelper.split(StringHelper.java:83)
	at org.gluu.util.StringHelper.split(StringHelper.java:79)
	at gluu.scim2.client.UmaScimClient.authorize(UmaScimClient.java:96)
	... 37 more

containabilityAny(gluu.scim2.client.corner.SpecialCharsTest)  Time elapsed: 0.024 sec  <<< FAILURE!
gluu.scim2.client.exception.ScimInitializationException
	at gluu.scim2.client.UmaScimClient.authorize(UmaScimClient.java:108)
	at gluu.scim2.client.AbstractScimClient.invoke(AbstractScimClient.java:142)
	at com.sun.proxy.$Proxy45.searchUsersPost(Unknown Source)
	at gluu.scim2.client.corner.SpecialCharsTest.containabilityAny(SpecialCharsTest.java:49)
Caused by: java.lang.NullPointerException
	at java.util.StringTokenizer.<init>(StringTokenizer.java:199)
	at org.gluu.util.StringHelper.split(StringHelper.java:83)
	at org.gluu.util.StringHelper.split(StringHelper.java:79)
	at gluu.scim2.client.UmaScimClient.authorize(UmaScimClient.java:96)
	... 37 more

delete(gluu.scim2.client.corner.WrongPayloadUserTest)  Time elapsed: 0 sec  <<< FAILURE!
java.lang.NullPointerException
	at gluu.scim2.client.UserBaseTest.deleteUser(UserBaseTest.java:33)
	at gluu.scim2.client.corner.WrongPayloadUserTest.delete(WrongPayloadUserTest.java:57)


Results :

Failed tests:   init(gluu.scim2.client.servicemeta.ResourceTypesTest): com.fasterxml.jackson.databind.exc.MismatchedInputException: Cannot construct instance of `java.util.LinkedHashMap` (although at least one Creator exists): no String-argument constructor/factory method to deserialize from String value ('User')(..)
  createUser(gluu.scim2.client.singleresource.MinimalUserTest)
  delete(gluu.scim2.client.singleresource.MinimalUserTest)
  createGroup(gluu.scim2.client.singleresource.MinimalGroupTest)
  delete(gluu.scim2.client.singleresource.MinimalGroupTest)
  create(gluu.scim2.client.singleresource.AverageUserTest)
  delete(gluu.scim2.client.singleresource.AverageUserTest)
  createFull(gluu.scim2.client.singleresource.FullUserTest)
  delete(gluu.scim2.client.singleresource.FullUserTest)
  create(gluu.scim2.client.search.SimpleSearchUserTest)
  searchAttributesParam(gluu.scim2.client.search.ComplexSearchUserTest)
  searchExcludedAttributesParam(gluu.scim2.client.search.ComplexSearchUserTest)
  searchNoAttributesParam(gluu.scim2.client.search.ComplexSearchUserTest)
  searchSortByExternalId(gluu.scim2.client.search.ComplexSearchUserTest)
  search1(gluu.scim2.client.search.PaginationUserSearchTest)
  delete(gluu.scim2.client.search.SimpleSearchUserTest)
  createUsers(gluu.scim2.client.multipleresource.GroupAssignUserTest)
  multipleRetrieval(gluu.scim2.client.singleresource.QueryParamRetrievalTest)
  create1(gluu.scim2.client.singleresource.QueryParamCreateUpdateTest)
  delete1(gluu.scim2.client.singleresource.QueryParamCreateUpdateTest)
  delete(gluu.scim2.client.singleresource.QueryParamCreateUpdateTest)
  searchJson(gluu.scim2.client.search.MultipleResourcesSearchTest)
  createForReplace(gluu.scim2.client.patch.PatchReplaceUserTest)
  delete(gluu.scim2.client.patch.PatchReplaceUserTest)
  createForAdd(gluu.scim2.client.patch.PatchAddUserTest)
  delete(gluu.scim2.client.patch.PatchAddUserTest)
  createForDel(gluu.scim2.client.patch.PatchDeleteUserTest)
  delete(gluu.scim2.client.patch.PatchDeleteUserTest)
  create(gluu.scim2.client.patch.PatchUserExtTest)
  delete(gluu.scim2.client.patch.PatchUserExtTest)
  create(gluu.scim2.client.patch.PatchValueFilterUserTest)
  delete(gluu.scim2.client.patch.PatchValueFilterUserTest)
  createGroup(gluu.scim2.client.patch.PatchGroupTest)
  delete(gluu.scim2.client.patch.PatchGroupTest)
  bulkJson1(gluu.scim2.client.bulk.UsersBulkTest)
  bulkJson(gluu.scim2.client.bulk.GroupsBulkTest)
  delete(gluu.scim2.client.bulk.GroupsBulkTest)
  createWrongCustAttrs1(gluu.scim2.client.corner.WrongPayloadUserExtTest)
  createWrongCustAttrs2(gluu.scim2.client.corner.WrongPayloadUserExtTest)
  createWrongCustAttrs3(gluu.scim2.client.corner.WrongPayloadUserExtTest)
  createWrongCustAttrs4(gluu.scim2.client.corner.WrongPayloadUserExtTest)
  createWrongCustAttrs5(gluu.scim2.client.corner.WrongPayloadUserExtTest)
  createWrongCustAttrs6(gluu.scim2.client.corner.WrongPayloadUserExtTest)
  createWrongAttrs1(gluu.scim2.client.corner.WrongPayloadUserTest)
  createWrongAttrs2(gluu.scim2.client.corner.WrongPayloadUserTest)
  createWrongAttrs3(gluu.scim2.client.corner.WrongPayloadUserTest)
  queryAndRemoval(gluu.scim2.client.corner.PairwiseIdentifiersTest)
  containabilityAll(gluu.scim2.client.corner.SpecialCharsTest)
  containabilityAllInGivenName(gluu.scim2.client.corner.SpecialCharsTest)
  containabilityAny(gluu.scim2.client.corner.SpecialCharsTest)
  delete(gluu.scim2.client.corner.WrongPayloadUserTest)

Tests run: 113, Failures: 51, Errors: 0, Skipped: 60

[INFO] ------------------------------------------------------------------------
[INFO] BUILD FAILURE
[INFO] ------------------------------------------------------------------------
[INFO] Total time: 16.668 s
[INFO] Finished at: 2020-03-17T13:22:31+00:00
[INFO] Final Memory: 36M/550M
[INFO] ------------------------------------------------------------------------
[ERROR] Failed to execute goal org.apache.maven.plugins:maven-surefire-plugin:2.12.4:test (default-test) on project scim-client2: There are test failures.
[ERROR] 
[ERROR] Please refer to /home/jenkins/.jenkins/jobs/oxScimClient_master_LDAP/workspace/target/surefire-reports for the individual test results.
[ERROR] -> [Help 1]
[ERROR] 
[ERROR] To see the full stack trace of the errors, re-run Maven with the -e switch.
[ERROR] Re-run Maven using the -X switch to enable full debug logging.
[ERROR] 
[ERROR] For more information about the errors and possible solutions, please read the following articles:
[ERROR] [Help 1] http://cwiki.apache.org/confluence/display/MAVEN/MojoFailureException
Build step 'Invoke top-level Maven targets' marked build as failure
[FINDBUGS] Skipping publisher since build result is FAILURE
Publishing Javadoc
TestNG Reports Processing: START
Looking for TestNG results report in workspace using pattern: **/testng-results.xml
Saving reports...
Processing '/home/jenkins/.jenkins/jobs/oxScimClient_master_LDAP/builds/14/testng/testng-results.xml'
45.454544% of tests failed, which exceeded threshold of 0%. Marking build as UNSTABLE
TestNG Reports Processing: FINISH
Not sending mail to unregistered user noreply@github.com
Not sending mail to unregistered user Yuriy.Movchan@gmail.com
Not sending mail to unregistered user bonustrack310@gmail.com
Sending e-mails to: support@gluu.org
Finished: FAILURE