FailedConsole Output

Started by user Jose Gonzalez
Running as SYSTEM
Building on master in workspace /home/jenkins/.jenkins/jobs/oxScimClient_4.0.0/workspace
No JDK named ‘jdk_1.8.0_121’ found
No credentials specified
No JDK named ‘jdk_1.8.0_121’ found
 > git rev-parse --is-inside-work-tree # timeout=10
Fetching changes from the remote Git repository
 > git config remote.origin.url https://github.com/GluuFederation/SCIM-Client # timeout=10
Fetching upstream changes from https://github.com/GluuFederation/SCIM-Client
 > git --version # timeout=10
 > git fetch --tags --progress https://github.com/GluuFederation/SCIM-Client +refs/heads/*:refs/remotes/origin/*
 > git rev-parse refs/remotes/origin/master^{commit} # timeout=10
 > git rev-parse refs/remotes/origin/origin/master^{commit} # timeout=10
No JDK named ‘jdk_1.8.0_121’ found
Checking out Revision 6a07b25c30126a09983dd22288d82e379eaa6823 (refs/remotes/origin/master)
 > git config core.sparsecheckout # timeout=10
 > git checkout -f 6a07b25c30126a09983dd22288d82e379eaa6823
Commit message: "Fix compilation error"
 > git rev-list --no-walk 6a07b25c30126a09983dd22288d82e379eaa6823 # timeout=10
No JDK named ‘jdk_1.8.0_121’ found
[workspace] $ /bin/sh -xe /opt/jetty/temp/jenkins6683556088098080964.sh
+ rm -rf ./oxHudsonProfiles
+ rm -rf ./profiles/ce-dev5.gluu.org
+ git clone github.com:GluuFederation/oxHudsonProfiles.git
Cloning into 'oxHudsonProfiles'...
+ mkdir -p ./profiles
+ cp -rf ./oxHudsonProfiles/scim-client/profiles/ce-dev5.gluu.org/ profiles
+ rm -rf ./oxHudsonProfiles
No JDK named ‘jdk_1.8.0_121’ found
[workspace] $ /home/jenkins/.jenkins/tools/hudson.tasks.Maven_MavenInstallation/maven_3.3.9/bin/mvn -DVERSION_NAME=master -DPROFILE_NAME=ce-dev5.gluu.org -DMAVEN_SKIP_TESTS=false -Dmaven.test.skip=false -Dcfg=ce-dev5.gluu.org clean compile javadoc:javadoc install findbugs:findbugs site
[INFO] Scanning for projects...
[INFO]                                                                         
[INFO] ------------------------------------------------------------------------
[INFO] Building SCIM-Client 4.0.0-SNAPSHOT
[INFO] ------------------------------------------------------------------------
[INFO] 
[INFO] --- maven-clean-plugin:2.5:clean (default-clean) @ scim-client2 ---
[INFO] Deleting /home/jenkins/.jenkins/jobs/oxScimClient_4.0.0/workspace/target
[INFO] 
[INFO] --- maven-resources-plugin:2.6:resources (default-resources) @ scim-client2 ---
[INFO] Using 'UTF-8' encoding to copy filtered resources.
[INFO] Copying 1 resource
[INFO] 
[INFO] --- maven-compiler-plugin:3.1:compile (default-compile) @ scim-client2 ---
[INFO] Changes detected - recompiling the module!
[INFO] Compiling 18 source files to /home/jenkins/.jenkins/jobs/oxScimClient_4.0.0/workspace/target/classes
[WARNING] /home/jenkins/.jenkins/jobs/oxScimClient_4.0.0/workspace/src/main/java/gluu/scim2/client/rest/provider/ListResponseProvider.java: /home/jenkins/.jenkins/jobs/oxScimClient_4.0.0/workspace/src/main/java/gluu/scim2/client/rest/provider/ListResponseProvider.java uses unchecked or unsafe operations.
[WARNING] /home/jenkins/.jenkins/jobs/oxScimClient_4.0.0/workspace/src/main/java/gluu/scim2/client/rest/provider/ListResponseProvider.java: Recompile with -Xlint:unchecked for details.
[INFO] 
[INFO] >>> maven-javadoc-plugin:2.10.4:javadoc (default-cli) > generate-sources @ scim-client2 >>>
[INFO] 
[INFO] <<< maven-javadoc-plugin:2.10.4:javadoc (default-cli) < generate-sources @ scim-client2 <<<
[INFO] 
[INFO] --- maven-javadoc-plugin:2.10.4:javadoc (default-cli) @ scim-client2 ---
[INFO] 
Loading source files for package gluu.scim2.client.exception...
Loading source files for package gluu.scim2.client.factory...
Loading source files for package gluu.scim2.client.rest.provider...
Loading source files for package gluu.scim2.client.rest...
Loading source files for package gluu.scim2.client...
Constructing Javadoc information...
Standard Doclet version 1.8.0_222
Building tree for all the packages and classes...
Generating /home/jenkins/.jenkins/jobs/oxScimClient_4.0.0/workspace/target/site/apidocs/gluu/scim2/client/exception/ScimClientException.html...
Generating /home/jenkins/.jenkins/jobs/oxScimClient_4.0.0/workspace/target/site/apidocs/gluu/scim2/client/exception/ScimInitializationException.html...
Generating /home/jenkins/.jenkins/jobs/oxScimClient_4.0.0/workspace/target/site/apidocs/gluu/scim2/client/factory/ScimClientFactory.html...
Generating /home/jenkins/.jenkins/jobs/oxScimClient_4.0.0/workspace/target/site/apidocs/gluu/scim2/client/rest/provider/AuthorizationInjectionFilter.html...
Generating /home/jenkins/.jenkins/jobs/oxScimClient_4.0.0/workspace/target/site/apidocs/gluu/scim2/client/rest/provider/ListResponseProvider.html...
Generating /home/jenkins/.jenkins/jobs/oxScimClient_4.0.0/workspace/target/site/apidocs/gluu/scim2/client/rest/provider/ScimResourceProvider.html...
Generating /home/jenkins/.jenkins/jobs/oxScimClient_4.0.0/workspace/target/site/apidocs/gluu/scim2/client/rest/ClientSideFido2DeviceService.html...
Generating /home/jenkins/.jenkins/jobs/oxScimClient_4.0.0/workspace/target/site/apidocs/gluu/scim2/client/rest/ClientSideFidoDeviceService.html...
Generating /home/jenkins/.jenkins/jobs/oxScimClient_4.0.0/workspace/target/site/apidocs/gluu/scim2/client/rest/ClientSideGroupService.html...
Generating /home/jenkins/.jenkins/jobs/oxScimClient_4.0.0/workspace/target/site/apidocs/gluu/scim2/client/rest/ClientSideService.html...
Generating /home/jenkins/.jenkins/jobs/oxScimClient_4.0.0/workspace/target/site/apidocs/gluu/scim2/client/rest/ClientSideUserService.html...
Generating /home/jenkins/.jenkins/jobs/oxScimClient_4.0.0/workspace/target/site/apidocs/gluu/scim2/client/rest/CloseableClient.html...
Generating /home/jenkins/.jenkins/jobs/oxScimClient_4.0.0/workspace/target/site/apidocs/gluu/scim2/client/rest/FreelyAccessible.html...
Generating /home/jenkins/.jenkins/jobs/oxScimClient_4.0.0/workspace/target/site/apidocs/gluu/scim2/client/AbstractScimClient.html...
Generating /home/jenkins/.jenkins/jobs/oxScimClient_4.0.0/workspace/target/site/apidocs/gluu/scim2/client/ClientMap.html...
Generating /home/jenkins/.jenkins/jobs/oxScimClient_4.0.0/workspace/target/site/apidocs/gluu/scim2/client/DummyClient.html...
Generating /home/jenkins/.jenkins/jobs/oxScimClient_4.0.0/workspace/target/site/apidocs/gluu/scim2/client/TestModeScimClient.html...
Generating /home/jenkins/.jenkins/jobs/oxScimClient_4.0.0/workspace/target/site/apidocs/gluu/scim2/client/UmaScimClient.html...
Generating /home/jenkins/.jenkins/jobs/oxScimClient_4.0.0/workspace/target/site/apidocs/overview-frame.html...
Generating /home/jenkins/.jenkins/jobs/oxScimClient_4.0.0/workspace/target/site/apidocs/gluu/scim2/client/package-frame.html...
Generating /home/jenkins/.jenkins/jobs/oxScimClient_4.0.0/workspace/target/site/apidocs/gluu/scim2/client/package-summary.html...
Generating /home/jenkins/.jenkins/jobs/oxScimClient_4.0.0/workspace/target/site/apidocs/gluu/scim2/client/package-tree.html...
Generating /home/jenkins/.jenkins/jobs/oxScimClient_4.0.0/workspace/target/site/apidocs/gluu/scim2/client/exception/package-frame.html...
Generating /home/jenkins/.jenkins/jobs/oxScimClient_4.0.0/workspace/target/site/apidocs/gluu/scim2/client/exception/package-summary.html...
Generating /home/jenkins/.jenkins/jobs/oxScimClient_4.0.0/workspace/target/site/apidocs/gluu/scim2/client/exception/package-tree.html...
Generating /home/jenkins/.jenkins/jobs/oxScimClient_4.0.0/workspace/target/site/apidocs/gluu/scim2/client/factory/package-frame.html...
Generating /home/jenkins/.jenkins/jobs/oxScimClient_4.0.0/workspace/target/site/apidocs/gluu/scim2/client/factory/package-summary.html...
Generating /home/jenkins/.jenkins/jobs/oxScimClient_4.0.0/workspace/target/site/apidocs/gluu/scim2/client/factory/package-tree.html...
Generating /home/jenkins/.jenkins/jobs/oxScimClient_4.0.0/workspace/target/site/apidocs/gluu/scim2/client/rest/package-frame.html...
Generating /home/jenkins/.jenkins/jobs/oxScimClient_4.0.0/workspace/target/site/apidocs/gluu/scim2/client/rest/package-summary.html...
Generating /home/jenkins/.jenkins/jobs/oxScimClient_4.0.0/workspace/target/site/apidocs/gluu/scim2/client/rest/package-tree.html...
Generating /home/jenkins/.jenkins/jobs/oxScimClient_4.0.0/workspace/target/site/apidocs/gluu/scim2/client/rest/provider/package-frame.html...
Generating /home/jenkins/.jenkins/jobs/oxScimClient_4.0.0/workspace/target/site/apidocs/gluu/scim2/client/rest/provider/package-summary.html...
Generating /home/jenkins/.jenkins/jobs/oxScimClient_4.0.0/workspace/target/site/apidocs/gluu/scim2/client/rest/provider/package-tree.html...
Generating /home/jenkins/.jenkins/jobs/oxScimClient_4.0.0/workspace/target/site/apidocs/constant-values.html...
Generating /home/jenkins/.jenkins/jobs/oxScimClient_4.0.0/workspace/target/site/apidocs/serialized-form.html...
Generating /home/jenkins/.jenkins/jobs/oxScimClient_4.0.0/workspace/target/site/apidocs/gluu/scim2/client/exception/class-use/ScimInitializationException.html...
Generating /home/jenkins/.jenkins/jobs/oxScimClient_4.0.0/workspace/target/site/apidocs/gluu/scim2/client/exception/class-use/ScimClientException.html...
Generating /home/jenkins/.jenkins/jobs/oxScimClient_4.0.0/workspace/target/site/apidocs/gluu/scim2/client/factory/class-use/ScimClientFactory.html...
Generating /home/jenkins/.jenkins/jobs/oxScimClient_4.0.0/workspace/target/site/apidocs/gluu/scim2/client/rest/provider/class-use/ScimResourceProvider.html...
Generating /home/jenkins/.jenkins/jobs/oxScimClient_4.0.0/workspace/target/site/apidocs/gluu/scim2/client/rest/provider/class-use/ListResponseProvider.html...
Generating /home/jenkins/.jenkins/jobs/oxScimClient_4.0.0/workspace/target/site/apidocs/gluu/scim2/client/rest/provider/class-use/AuthorizationInjectionFilter.html...
Generating /home/jenkins/.jenkins/jobs/oxScimClient_4.0.0/workspace/target/site/apidocs/gluu/scim2/client/rest/class-use/FreelyAccessible.html...
Generating /home/jenkins/.jenkins/jobs/oxScimClient_4.0.0/workspace/target/site/apidocs/gluu/scim2/client/rest/class-use/CloseableClient.html...
Generating /home/jenkins/.jenkins/jobs/oxScimClient_4.0.0/workspace/target/site/apidocs/gluu/scim2/client/rest/class-use/ClientSideUserService.html...
Generating /home/jenkins/.jenkins/jobs/oxScimClient_4.0.0/workspace/target/site/apidocs/gluu/scim2/client/rest/class-use/ClientSideService.html...
Generating /home/jenkins/.jenkins/jobs/oxScimClient_4.0.0/workspace/target/site/apidocs/gluu/scim2/client/rest/class-use/ClientSideGroupService.html...
Generating /home/jenkins/.jenkins/jobs/oxScimClient_4.0.0/workspace/target/site/apidocs/gluu/scim2/client/rest/class-use/ClientSideFidoDeviceService.html...
Generating /home/jenkins/.jenkins/jobs/oxScimClient_4.0.0/workspace/target/site/apidocs/gluu/scim2/client/rest/class-use/ClientSideFido2DeviceService.html...
Generating /home/jenkins/.jenkins/jobs/oxScimClient_4.0.0/workspace/target/site/apidocs/gluu/scim2/client/class-use/UmaScimClient.html...
Generating /home/jenkins/.jenkins/jobs/oxScimClient_4.0.0/workspace/target/site/apidocs/gluu/scim2/client/class-use/TestModeScimClient.html...
Generating /home/jenkins/.jenkins/jobs/oxScimClient_4.0.0/workspace/target/site/apidocs/gluu/scim2/client/class-use/DummyClient.html...
Generating /home/jenkins/.jenkins/jobs/oxScimClient_4.0.0/workspace/target/site/apidocs/gluu/scim2/client/class-use/ClientMap.html...
Generating /home/jenkins/.jenkins/jobs/oxScimClient_4.0.0/workspace/target/site/apidocs/gluu/scim2/client/class-use/AbstractScimClient.html...
Generating /home/jenkins/.jenkins/jobs/oxScimClient_4.0.0/workspace/target/site/apidocs/gluu/scim2/client/package-use.html...
Generating /home/jenkins/.jenkins/jobs/oxScimClient_4.0.0/workspace/target/site/apidocs/gluu/scim2/client/exception/package-use.html...
Generating /home/jenkins/.jenkins/jobs/oxScimClient_4.0.0/workspace/target/site/apidocs/gluu/scim2/client/factory/package-use.html...
Generating /home/jenkins/.jenkins/jobs/oxScimClient_4.0.0/workspace/target/site/apidocs/gluu/scim2/client/rest/package-use.html...
Generating /home/jenkins/.jenkins/jobs/oxScimClient_4.0.0/workspace/target/site/apidocs/gluu/scim2/client/rest/provider/package-use.html...
Building index for all the packages and classes...
Generating /home/jenkins/.jenkins/jobs/oxScimClient_4.0.0/workspace/target/site/apidocs/overview-tree.html...
Generating /home/jenkins/.jenkins/jobs/oxScimClient_4.0.0/workspace/target/site/apidocs/index-all.html...
Generating /home/jenkins/.jenkins/jobs/oxScimClient_4.0.0/workspace/target/site/apidocs/deprecated-list.html...
Building index for all classes...
Generating /home/jenkins/.jenkins/jobs/oxScimClient_4.0.0/workspace/target/site/apidocs/allclasses-frame.html...
Generating /home/jenkins/.jenkins/jobs/oxScimClient_4.0.0/workspace/target/site/apidocs/allclasses-noframe.html...
Generating /home/jenkins/.jenkins/jobs/oxScimClient_4.0.0/workspace/target/site/apidocs/index.html...
Generating /home/jenkins/.jenkins/jobs/oxScimClient_4.0.0/workspace/target/site/apidocs/overview-summary.html...
Generating /home/jenkins/.jenkins/jobs/oxScimClient_4.0.0/workspace/target/site/apidocs/help-doc.html...
[INFO] 
[INFO] --- maven-resources-plugin:2.6:resources (default-resources) @ scim-client2 ---
[INFO] Using 'UTF-8' encoding to copy filtered resources.
[INFO] Copying 1 resource
[INFO] 
[INFO] --- maven-compiler-plugin:3.1:compile (default-compile) @ scim-client2 ---
[INFO] Nothing to compile - all classes are up to date
[INFO] 
[INFO] --- maven-resources-plugin:2.6:testResources (default-testResources) @ scim-client2 ---
[INFO] Using 'UTF-8' encoding to copy filtered resources.
[INFO] Copying 35 resources
[INFO] 
[INFO] --- maven-compiler-plugin:3.1:testCompile (default-testCompile) @ scim-client2 ---
[INFO] Changes detected - recompiling the module!
[INFO] Compiling 32 source files to /home/jenkins/.jenkins/jobs/oxScimClient_4.0.0/workspace/target/test-classes
[INFO] 
[INFO] --- maven-surefire-plugin:2.12.4:test (default-test) @ scim-client2 ---
[INFO] Surefire report directory: /home/jenkins/.jenkins/jobs/oxScimClient_4.0.0/workspace/target/surefire-reports

-------------------------------------------------------
 T E S T S
-------------------------------------------------------
Running TestSuite
21:55:38 INFO  BaseTest.java:43 - Invoked initTestSuite of 'Corner and other weird cases'
21:55:38 INFO  BaseTest.java:71 - Initializing client...
21:55:40 INFO  SchemasTest.java:71 - Found User Schema Extension: GluuUserCustomExtension
21:55:40 INFO  SchemasTest.java:78 - scimCustomFirst found
21:55:40 INFO  SchemasTest.java:84 - scimCustomSecond found
21:55:40 INFO  SchemasTest.java:90 - scimCustomThird found
21:55:40 DEBUG MinimalUserTest.java:29 - Creating mimimal user from json...
21:55:42 DEBUG UserBaseTest.java:26 - User created with id c99ddaa9-c04d-42ff-a458-5e44484f62c9
21:55:42 DEBUG MinimalUserTest.java:37 - Updating user scim_test_bjensen_1 with json
21:55:42 DEBUG MinimalUserTest.java:44 - Updated user Barbara
21:55:42 DEBUG UserBaseTest.java:33 - Deleting user bjensen_1
21:55:42 DEBUG UserBaseTest.java:36 - deleted
21:55:42 DEBUG MinimalGroupTest.java:31 - Creating mimimal group from json...
21:55:42 DEBUG MinimalGroupTest.java:37 - Group created with id 35651c12-0dc8-43db-b29b-4e578e9f642f
21:55:42 DEBUG MinimalGroupTest.java:45 - Updating group scim_test_worldowners with json
21:55:42 DEBUG MinimalGroupTest.java:52 - Updated group scim_test_worldmanagers
21:55:42 DEBUG MinimalGroupTest.java:59 - Deleting group scim_test_worldowners
21:55:42 DEBUG MinimalGroupTest.java:62 - deleted
21:55:42 DEBUG AverageUserTest.java:36 - Creating user from json...
21:55:42 DEBUG UserBaseTest.java:26 - User created with id acaf8362-3f94-4dd2-ab0b-327ad13b53fe
21:55:42 DEBUG AverageUserTest.java:44 - Updating user scim_test_bjensen_1 with json
21:55:43 DEBUG AverageUserTest.java:57 - Updated user Barbara
21:55:43 DEBUG AverageUserTest.java:74 - Updating user scim_test_bjensen_1
21:55:43 DEBUG AverageUserTest.java:86 - Updated user Barbara
21:55:43 DEBUG UserBaseTest.java:33 - Deleting user scim_test_bjensen_1
21:55:43 DEBUG UserBaseTest.java:36 - deleted
21:55:43 DEBUG FullUserTest.java:36 - Creating user from json...
21:55:43 DEBUG UserBaseTest.java:26 - User created with id 6e030817-9245-49cb-9acb-6db847bdcf86
21:55:44 DEBUG FullUserTest.java:54 - Updating user scim_test_bjensen_1 with json
21:55:45 DEBUG UserBaseTest.java:33 - Deleting user null
21:55:45 DEBUG UserBaseTest.java:36 - deleted
21:55:45 DEBUG SimpleSearchUserTest.java:33 - Creating user from json...
21:55:45 DEBUG UserBaseTest.java:26 - User created with id b057f8d0-0a4b-4927-99f5-a767aa07e57d
21:55:45 DEBUG ComplexSearchUserTest.java:68 - Searching at most 3 users using POST verb
21:55:45 DEBUG ComplexSearchUserTest.java:69 - Sorted by family name descending
21:55:45 DEBUG ComplexSearchUserTest.java:70 - Retrieving only the attributes [name.familyName, active]
21:55:45 DEBUG ComplexSearchUserTest.java:140 - Searching at most 3 users using POST verb
21:55:45 DEBUG ComplexSearchUserTest.java:141 - Sorted by displayName ascending
21:55:45 DEBUG ComplexSearchUserTest.java:142 - Excluding the attributes [x509Certificates, entitlements, roles, ims, phoneNumbers, addresses, emails, groups]
21:55:45 DEBUG ComplexSearchUserTest.java:39 - Searching users with attribute nickName existent or ims.value=Skype using POST verb
21:55:46 DEBUG SimpleSearchUserTest.java:61 - Searching user with attribute givenName = Barbara using POST verb
21:55:46 DEBUG SimpleSearchUserTest.java:82 - Searching user with attribute emails.value like gluu.org or phone numbers with type unassigned or value containing '+' using POST verb
21:55:46 DEBUG SimpleSearchUserTest.java:110 - Calculating the total number of users
21:55:47 DEBUG SimpleSearchUserTest.java:119 - There are 23 users!
21:55:47 DEBUG SimpleSearchUserTest.java:42 - Searching user with attribute locale = es_ES and created date >= 2019-08-08T21:55:45.312Z using GET verb
21:55:47 DEBUG UserBaseTest.java:33 - Deleting user scim_test_bjensen_1
21:55:47 DEBUG UserBaseTest.java:36 - deleted
21:55:48 INFO  GroupAssignUserTest.java:40 - Creating 3 users...
21:55:48 INFO  GroupAssignUserTest.java:66 - Assigning users to new group...
21:55:49 INFO  GroupAssignUserTest.java:90 - Creating a secondary group...
21:55:49 INFO  GroupAssignUserTest.java:112 - Issuing query with filter: id eq "8552baec-262c-4bba-a648-b2ebce0860d1" or id eq "7d478eac-d372-4ff6-ba4e-b7a57d28dd74" or id eq "eebca2fe-afc3-4d7c-9908-093e977a274d"
21:55:49 INFO  GroupAssignUserTest.java:116 - Verifying groups and users consistency...
21:55:49 INFO  GroupAssignUserTest.java:143 - Attempting to modify group membership using /Users endpoint...
21:55:49 INFO  GroupAssignUserTest.java:163 - Removing one and adding one member...
21:55:50 INFO  GroupAssignUserTest.java:172 - Group has correct members
21:55:50 INFO  GroupAssignUserTest.java:186 - Users have correct memberships
21:55:50 INFO  GroupAssignUserTest.java:199 - Group '3 best demented buddies' removed
21:55:50 INFO  GroupAssignUserTest.java:199 - Group 'Auxiliary asylum' removed
21:55:50 INFO  GroupAssignUserTest.java:214 - User 'test-0.37355207790407063' removed
21:55:50 INFO  GroupAssignUserTest.java:214 - User 'test-0.3608388205112256' removed
21:55:50 INFO  GroupAssignUserTest.java:214 - User 'test-0.9174089670027761' removed
21:55:50 DEBUG QueryParamRetrievalTest.java:34 - Retrieving test users...
21:55:51 DEBUG QueryParamRetrievalTest.java:54 - Retrieving test users...
21:55:51 DEBUG QueryParamCreateUpdateTest.java:38 - Creating user from json...
21:55:51 DEBUG UserBaseTest.java:33 - Deleting user scim_test_bjensen_1
21:55:52 DEBUG UserBaseTest.java:36 - deleted
21:55:52 DEBUG QueryParamCreateUpdateTest.java:59 - Creating user from json...
21:55:52 DEBUG UserBaseTest.java:33 - Deleting user null
21:55:52 DEBUG UserBaseTest.java:36 - deleted
21:55:53 DEBUG PatchReplaceUserTest.java:39 - Creating user from json...
21:55:54 DEBUG UserBaseTest.java:26 - User created with id 60f22531-0364-48e6-9b76-cec3f1f33f46
21:55:55 DEBUG UserBaseTest.java:33 - Deleting user scim_test_bjensen_1
21:55:55 DEBUG UserBaseTest.java:36 - deleted
21:55:55 DEBUG PatchAddUserTest.java:30 - Creating user from json...
21:55:55 DEBUG UserBaseTest.java:26 - User created with id 0df2f179-01ba-4c53-8b7a-b4988ffc584d
21:55:56 DEBUG UserBaseTest.java:33 - Deleting user scim_test_bjensen_1
21:55:56 DEBUG UserBaseTest.java:36 - deleted
21:55:56 DEBUG PatchDeleteUserTest.java:30 - Creating user from json...
21:55:56 DEBUG UserBaseTest.java:26 - User created with id 7458e641-1919-40a2-add8-ddea30db33d6
21:55:56 DEBUG UserBaseTest.java:33 - Deleting user scim_test_bjensen_1
21:55:56 DEBUG UserBaseTest.java:36 - deleted
21:55:56 DEBUG PatchUserExtTest.java:40 - Creating user from json...
21:55:57 DEBUG UserBaseTest.java:26 - User created with id 39a03ae5-ef3d-498c-9e13-822c4cdc5eee
21:55:57 DEBUG UserBaseTest.java:33 - Deleting user scim_test_bjensen_1
21:55:57 DEBUG UserBaseTest.java:36 - deleted
21:55:57 DEBUG PatchValueFilterUserTest.java:41 - User created with id 96a87ae7-0fad-4515-845b-09cff19c0502
21:55:58 DEBUG UserBaseTest.java:33 - Deleting user 1565301357648
21:55:58 DEBUG UserBaseTest.java:36 - deleted
21:55:58 DEBUG PatchGroupTest.java:47 - Creating group from json...
21:56:00 INFO  UsersBulkTest.java:35 - Sending a bulk with POST, PUT, and PATCH operations...
21:56:00 INFO  UsersBulkTest.java:49 - User id is b29d84f5-9d00-4111-bf56-b483155fa608
21:56:00 INFO  UsersBulkTest.java:56 - Sending a bulk with one DELETE...
21:56:00 INFO  UsersBulkTest.java:80 - Sending a bulk with POSTs and DELETEs operations...
21:56:00 INFO  GroupsBulkTest.java:40 - Creating one user and one group using bulk json string
21:56:01 INFO  GroupsBulkTest.java:53 - User id is 2420cd9f-1f05-4cfe-8ad7-52fb42bb53c3
21:56:01 INFO  GroupsBulkTest.java:59 - Group id is 2af97d3e-20cf-43e5-ab2e-49fda936ddae
21:56:01 INFO  GroupsBulkTest.java:66 - Sending a bulk with a patch to insert admin user into group
21:56:01 INFO  GroupsBulkTest.java:98 - Cleaning...
21:56:03 DEBUG WrongPayloadUserTest.java:49 - Creating mimimal user from json...
21:56:03 DEBUG UserBaseTest.java:26 - User created with id cc4efdb7-d15e-4fa4-9e85-284e18f8b54f
21:56:03 INFO  SpecialCharsTest.java:117 - User Dddd 1111 found with userName dddd1111 *char
21:56:03 INFO  SpecialCharsTest.java:117 - User Dddd 2222 found with userName dddd2222 * \ (char
21:56:03 INFO  SpecialCharsTest.java:117 - User Dddd 3333 found with userName dddd3333 * \ (char) /
21:56:03 DEBUG UserBaseTest.java:33 - Deleting user scim_test_bjensen_1
21:56:03 DEBUG UserBaseTest.java:36 - deleted
21:56:03 INFO  AbstractScimClient.java:126 - Closing RestEasy client
Tests run: 110, Failures: 2, Errors: 0, Skipped: 1, Time elapsed: 27.716 sec <<< FAILURE!
updateWithObject1(gluu.scim2.client.singleresource.AverageUserTest)  Time elapsed: 0.431 sec  <<< FAILURE!
java.lang.AssertionError: expected [{"schemas":["urn:ietf:params:scim:schemas:core:2.0:User"],"id":"acaf8362-3f94-4dd2-ab0b-327ad13b53fe","externalId":"scim_test_bjensen_1-external","userName":"scim_test_bjensen_1","name":{"familyName":"Jensen","givenName":"Barbara","middleName":"Jane","honorificPrefix":"prefix","honorificSuffix":"suffix","formatted":"Ms. Barbara J Jensen III"},"displayName":"Brava","preferredLanguage":"en_US","locale":"es_ES","active":true,"emails":[{"value":"bjane@gluu.org","type":"work","primary":true}],"phoneNumbers":[{"value":"555 123 4568","type":"other","primary":false}],"addresses":[{"streetAddress":"123 Evergreen skid row","locality":"Cartucho","region":"BO","postalCode":"54321","country":"CO","type":"other","primary":true}]}] but found [{"schemas":["urn:ietf:params:scim:schemas:core:2.0:User"],"id":"acaf8362-3f94-4dd2-ab0b-327ad13b53fe","externalId":"scim_test_bjensen_1-external","userName":"scim_test_bjensen_1","name":{"familyName":"Jensen","givenName":"Barbara","middleName":"Jane","honorificPrefix":"prefix","honorificSuffix":"suffix","formatted":"Ms.BarbaraJJensenIII"},"displayName":"Brava","preferredLanguage":"en_US","locale":"es_ES","active":true,"emails":[{"value":"bjane@gluu.org","type":"work","primary":true}],"phoneNumbers":[{"value":"5551234568","type":"other","primary":false}],"addresses":[{"streetAddress":"123Evergreenskidrow","locality":"Cartucho","region":"BO","postalCode":"54321","country":"CO","type":"other","primary":true}]}]
	at org.testng.Assert.fail(Assert.java:93)
	at org.testng.Assert.failNotEquals(Assert.java:512)
	at org.testng.Assert.assertEqualsImpl(Assert.java:134)
	at org.testng.Assert.assertEquals(Assert.java:115)
	at org.testng.Assert.assertEquals(Assert.java:189)
	at org.testng.Assert.assertEquals(Assert.java:199)
	at gluu.scim2.client.singleresource.AverageUserTest.updateWithObject1(AverageUserTest.java:92)

containabilityAllInGivenName(gluu.scim2.client.corner.SpecialCharsTest)  Time elapsed: 0.056 sec  <<< FAILURE!
java.lang.NullPointerException
	at gluu.scim2.client.corner.SpecialCharsTest.containabilityAllInGivenName(SpecialCharsTest.java:96)


Results :

Failed tests:   updateWithObject1(gluu.scim2.client.singleresource.AverageUserTest): expected [{"schemas":["urn:ietf:params:scim:schemas:core:2.0:User"],"id":"acaf8362-3f94-4dd2-ab0b-327ad13b53fe","externalId":"scim_test_bjensen_1-external","userName":"scim_test_bjensen_1","name":{"familyName":"Jensen","givenName":"Barbara","middleName":"Jane","honorificPrefix":"prefix","honorificSuffix":"suffix","formatted":"Ms. Barbara J Jensen III"},"displayName":"Brava","preferredLanguage":"en_US","locale":"es_ES","active":true,"emails":[{"value":"bjane@gluu.org","type":"work","primary":true}],"phoneNumbers":[{"value":"555 123 4568","type":"other","primary":false}],"addresses":[{"streetAddress":"123 Evergreen skid row","locality":"Cartucho","region":"BO","postalCode":"54321","country":"CO","type":"other","primary":true}]}] but found [{"schemas":["urn:ietf:params:scim:schemas:core:2.0:User"],"id":"acaf8362-3f94-4dd2-ab0b-327ad13b53fe","externalId":"scim_test_bjensen_1-external","userName":"scim_test_bjensen_1","name":{"familyName":"Jensen","givenName":"Barbara","middleName":"Jane","honorificPrefix":"prefix","honorificSuffix":"suffix","formatted":"Ms.BarbaraJJensenIII"},"displayName":"Brava","preferredLanguage":"en_US","locale":"es_ES","active":true,"emails":[{"value":"bjane@gluu.org","type":"work","primary":true}],"phoneNumbers":[{"value":"5551234568","type":"other","primary":false}],"addresses":[{"streetAddress":"123Evergreenskidrow","locality":"Cartucho","region":"BO","postalCode":"54321","country":"CO","type":"other","primary":true}]}]
  containabilityAllInGivenName(gluu.scim2.client.corner.SpecialCharsTest)

Tests run: 110, Failures: 2, Errors: 0, Skipped: 1

[INFO] ------------------------------------------------------------------------
[INFO] BUILD FAILURE
[INFO] ------------------------------------------------------------------------
[INFO] Total time: 39.321 s
[INFO] Finished at: 2019-08-08T21:56:04+00:00
[INFO] Final Memory: 33M/358M
[INFO] ------------------------------------------------------------------------
[ERROR] Failed to execute goal org.apache.maven.plugins:maven-surefire-plugin:2.12.4:test (default-test) on project scim-client2: There are test failures.
[ERROR] 
[ERROR] Please refer to /home/jenkins/.jenkins/jobs/oxScimClient_4.0.0/workspace/target/surefire-reports for the individual test results.
[ERROR] -> [Help 1]
[ERROR] 
[ERROR] To see the full stack trace of the errors, re-run Maven with the -e switch.
[ERROR] Re-run Maven using the -X switch to enable full debug logging.
[ERROR] 
[ERROR] For more information about the errors and possible solutions, please read the following articles:
[ERROR] [Help 1] http://cwiki.apache.org/confluence/display/MAVEN/MojoFailureException
Build step 'Invoke top-level Maven targets' marked build as failure
[FINDBUGS] Skipping publisher since build result is FAILURE
Publishing Javadoc
No JDK named ‘jdk_1.8.0_121’ found
No JDK named ‘jdk_1.8.0_121’ found
TestNG Reports Processing: START
Looking for TestNG results report in workspace using pattern: **/testng-results.xml
Saving reports...
Processing '/home/jenkins/.jenkins/jobs/oxScimClient_4.0.0/builds/99/testng/testng-results.xml'
1.818182% of tests failed, which exceeded threshold of 0%. Marking build as UNSTABLE
TestNG Reports Processing: FINISH
No JDK named ‘jdk_1.8.0_121’ found
Not sending mail to unregistered user bonustrack310@gmail.com
Sending e-mails to: support@gluu.org
Finished: FAILURE