FailedConsole Output

Started by an SCM change
Building on master in workspace /home/tomcat/.jenkins/jobs/oxScimClient_4.0.0/workspace
No credentials specified
 > git rev-parse --is-inside-work-tree # timeout=10
Fetching changes from the remote Git repository
 > git config remote.origin.url https://github.com/GluuFederation/SCIM-Client # timeout=10
Fetching upstream changes from https://github.com/GluuFederation/SCIM-Client
 > git --version # timeout=10
 > git fetch --tags --progress https://github.com/GluuFederation/SCIM-Client +refs/heads/*:refs/remotes/origin/*
 > git rev-parse refs/remotes/origin/master^{commit} # timeout=10
 > git rev-parse refs/remotes/origin/origin/master^{commit} # timeout=10
Checking out Revision 4d22127bf67374de7044383209a3f7c9629805fa (refs/remotes/origin/master)
 > git config core.sparsecheckout # timeout=10
 > git checkout -f 4d22127bf67374de7044383209a3f7c9629805fa
Commit message: "Update jackson-databind"
 > git rev-list --no-walk fc2af907a58aad7aa1145015c60feb4995567e54 # timeout=10
[workspace] $ /bin/sh -xe /opt/tomcat/temp/jenkins2579938044357810090.sh
+ rm -rf ./oxHudsonProfiles
+ rm -rf ./profiles/ce-dev5.gluu.org
+ git clone github.com:GluuFederation/oxHudsonProfiles.git
Cloning into 'oxHudsonProfiles'...
+ mkdir -p ./profiles
+ cp -rf ./oxHudsonProfiles/scim-client/profiles/ce-dev5.gluu.org/ profiles
+ rm -rf ./oxHudsonProfiles
[workspace] $ /home/tomcat/.jenkins/tools/hudson.tasks.Maven_MavenInstallation/maven_3.3.9/bin/mvn -DVERSION_NAME=master -DPROFILE_NAME=ce-dev5.gluu.org -DMAVEN_SKIP_TESTS=false -Dmaven.test.skip=false -Dcfg=ce-dev5.gluu.org clean compile javadoc:javadoc install findbugs:findbugs site
[INFO] Scanning for projects...
[INFO]                                                                         
[INFO] ------------------------------------------------------------------------
[INFO] Building SCIM-Client 4.0.0-SNAPSHOT
[INFO] ------------------------------------------------------------------------
[WARNING] The POM for com.fasterxml.jackson.core:jackson-annotations:jar:2.9.9.1 is missing, no dependency information available
[WARNING] The POM for com.fasterxml.jackson.core:jackson-core:jar:2.9.9.1 is missing, no dependency information available
[WARNING] The POM for com.fasterxml.jackson.datatype:jackson-datatype-json-org:jar:2.9.9.1 is missing, no dependency information available
[WARNING] The POM for com.fasterxml.jackson.module:jackson-module-jaxb-annotations:jar:2.9.9.1 is missing, no dependency information available
[INFO] ------------------------------------------------------------------------
[INFO] BUILD FAILURE
[INFO] ------------------------------------------------------------------------
[INFO] Total time: 3.930 s
[INFO] Finished at: 2019-07-18T04:10:21-04:00
[INFO] Final Memory: 18M/217M
[INFO] ------------------------------------------------------------------------
[ERROR] Failed to execute goal on project scim-client2: Could not resolve dependencies for project gluu.scim.client:scim-client2:jar:4.0.0-SNAPSHOT: The following artifacts could not be resolved: com.fasterxml.jackson.core:jackson-core:jar:2.9.9.1, com.fasterxml.jackson.core:jackson-annotations:jar:2.9.9.1, com.fasterxml.jackson.datatype:jackson-datatype-json-org:jar:2.9.9.1, com.fasterxml.jackson.module:jackson-module-jaxb-annotations:jar:2.9.9.1: Failure to find com.fasterxml.jackson.core:jackson-core:jar:2.9.9.1 in http://repository.jboss.org/nexus/content/groups/public-jboss/ was cached in the local repository, resolution will not be reattempted until the update interval of repository.jboss.org has elapsed or updates are forced -> [Help 1]
[ERROR] 
[ERROR] To see the full stack trace of the errors, re-run Maven with the -e switch.
[ERROR] Re-run Maven using the -X switch to enable full debug logging.
[ERROR] 
[ERROR] For more information about the errors and possible solutions, please read the following articles:
[ERROR] [Help 1] http://cwiki.apache.org/confluence/display/MAVEN/DependencyResolutionException
Build step 'Invoke top-level Maven targets' marked build as failure
[FINDBUGS] Skipping publisher since build result is FAILURE
Publishing Javadoc
TestNG Reports Processing: START
Looking for TestNG results report in workspace using pattern: **/testng-results.xml
Did not find any matching files.
Not sending mail to unregistered user Yuriy.Movchan@gmail.com
Not sending mail to unregistered user bonustrack310@gmail.com
Sending e-mails to: support@gluu.org
Finished: FAILURE