FailedConsole Output

Started by an SCM change
Running as SYSTEM
Building on master in workspace /home/jenkins/.jenkins/jobs/oxScimClient_4.0_LDAP/workspace
No JDK named ‘jdk_1.8.0_121’ found
No credentials specified
No JDK named ‘jdk_1.8.0_121’ found
 > git rev-parse --is-inside-work-tree # timeout=10
Fetching changes from the remote Git repository
 > git config remote.origin.url https://github.com/GluuFederation/SCIM-Client # timeout=10
Fetching upstream changes from https://github.com/GluuFederation/SCIM-Client
 > git --version # timeout=10
 > git fetch --tags --progress https://github.com/GluuFederation/SCIM-Client +refs/heads/*:refs/remotes/origin/*
 > git rev-parse refs/remotes/origin/master^{commit} # timeout=10
 > git rev-parse refs/remotes/origin/origin/master^{commit} # timeout=10
No JDK named ‘jdk_1.8.0_121’ found
Checking out Revision bcdc27f2111cb161ba80900a4a8ebcd4bb05147b (refs/remotes/origin/master)
 > git config core.sparsecheckout # timeout=10
 > git checkout -f bcdc27f2111cb161ba80900a4a8ebcd4bb05147b
Commit message: "Branch for version 4.1"
 > git rev-list --no-walk 75c1d3b6d564e93fe034d036ec625daea39d109c # timeout=10
No JDK named ‘jdk_1.8.0_121’ found
[workspace] $ /bin/sh -xe /opt/jetty/temp/jenkins6627345456155015083.sh
+ rm -rf ./oxHudsonProfiles
+ rm -rf ./profiles/ce-dev5.gluu.org
+ git clone github.com:GluuFederation/oxHudsonProfiles.git
Cloning into 'oxHudsonProfiles'...
+ mkdir -p ./profiles
+ cp -rf ./oxHudsonProfiles/scim-client/profiles/ce-dev5.gluu.org/ profiles
+ rm -rf ./oxHudsonProfiles
No JDK named ‘jdk_1.8.0_121’ found
[workspace] $ /home/jenkins/.jenkins/tools/hudson.tasks.Maven_MavenInstallation/maven_3.3.9/bin/mvn -DVERSION_NAME=master -DPROFILE_NAME=ce-dev5.gluu.org -DMAVEN_SKIP_TESTS=false -Dmaven.test.skip=false -Dcfg=ce-dev5.gluu.org clean compile javadoc:javadoc install findbugs:findbugs site
[INFO] Scanning for projects...
[INFO]                                                                         
[INFO] ------------------------------------------------------------------------
[INFO] Building SCIM-Client 4.1.0-SNAPSHOT
[INFO] ------------------------------------------------------------------------
Downloading: http://repository.jboss.org/nexus/content/groups/public-jboss/org/gluu/oxauth-client/4.1.0-SNAPSHOT/maven-metadata.xml
Downloading: http://ox.gluu.org/maven/org/gluu/oxauth-client/4.1.0-SNAPSHOT/maven-metadata.xml


Downloading: http://repository.jboss.org/nexus/content/groups/public-jboss/org/gluu/oxauth-client/4.1.0-SNAPSHOT/oxauth-client-4.1.0-SNAPSHOT.pom

Downloading: http://ox.gluu.org/maven/org/gluu/oxauth-client/4.1.0-SNAPSHOT/oxauth-client-4.1.0-SNAPSHOT.pom

[WARNING] The POM for org.gluu:oxauth-client:jar:4.1.0-SNAPSHOT is missing, no dependency information available
Downloading: http://repository.jboss.org/nexus/content/groups/public-jboss/org/gluu/oxauth-model/4.1.0-SNAPSHOT/maven-metadata.xml
Downloading: http://ox.gluu.org/maven/org/gluu/oxauth-model/4.1.0-SNAPSHOT/maven-metadata.xml


Downloading: http://repository.jboss.org/nexus/content/groups/public-jboss/org/gluu/oxauth-model/4.1.0-SNAPSHOT/oxauth-model-4.1.0-SNAPSHOT.pom

Downloading: http://ox.gluu.org/maven/org/gluu/oxauth-model/4.1.0-SNAPSHOT/oxauth-model-4.1.0-SNAPSHOT.pom

[WARNING] The POM for org.gluu:oxauth-model:jar:4.1.0-SNAPSHOT is missing, no dependency information available
Downloading: http://repository.jboss.org/nexus/content/groups/public-jboss/org/gluu/oxtrust-scim/4.1.0-SNAPSHOT/maven-metadata.xml
Downloading: http://ox.gluu.org/maven/org/gluu/oxtrust-scim/4.1.0-SNAPSHOT/maven-metadata.xml


Downloading: http://repository.jboss.org/nexus/content/groups/public-jboss/org/gluu/oxtrust-scim/4.1.0-SNAPSHOT/oxtrust-scim-4.1.0-SNAPSHOT.pom

Downloading: http://ox.gluu.org/maven/org/gluu/oxtrust-scim/4.1.0-SNAPSHOT/oxtrust-scim-4.1.0-SNAPSHOT.pom

[WARNING] The POM for org.gluu:oxtrust-scim:jar:4.1.0-SNAPSHOT is missing, no dependency information available
Downloading: http://repository.jboss.org/nexus/content/groups/public-jboss/org/gluu/oxauth-client/4.1.0-SNAPSHOT/oxauth-client-4.1.0-SNAPSHOT.jar
Downloading: http://repository.jboss.org/nexus/content/groups/public-jboss/org/gluu/oxauth-model/4.1.0-SNAPSHOT/oxauth-model-4.1.0-SNAPSHOT.jar
Downloading: http://repository.jboss.org/nexus/content/groups/public-jboss/org/gluu/oxtrust-scim/4.1.0-SNAPSHOT/oxtrust-scim-4.1.0-SNAPSHOT.jar
Downloading: http://repository.jboss.org/nexus/content/groups/public-jboss/com/fasterxml/jackson/module/jackson-module-jaxb-annotations/2.8.6/jackson-module-jaxb-annotations-2.8.6.jar




Downloaded: http://repository.jboss.org/nexus/content/groups/public-jboss/com/fasterxml/jackson/module/jackson-module-jaxb-annotations/2.8.6/jackson-module-jaxb-annotations-2.8.6.jar (0 B at 0.0 KB/sec)
Downloading: http://ox.gluu.org/maven/org/gluu/oxauth-client/4.1.0-SNAPSHOT/oxauth-client-4.1.0-SNAPSHOT.jar
Downloading: http://ox.gluu.org/maven/org/gluu/oxauth-model/4.1.0-SNAPSHOT/oxauth-model-4.1.0-SNAPSHOT.jar
Downloading: http://ox.gluu.org/maven/org/gluu/oxtrust-scim/4.1.0-SNAPSHOT/oxtrust-scim-4.1.0-SNAPSHOT.jar



[INFO] ------------------------------------------------------------------------
[INFO] BUILD FAILURE
[INFO] ------------------------------------------------------------------------
[INFO] Total time: 6.424 s
[INFO] Finished at: 2019-10-03T17:24:19+00:00
[INFO] Final Memory: 18M/316M
[INFO] ------------------------------------------------------------------------
[ERROR] Failed to execute goal on project scim-client2: Could not resolve dependencies for project gluu.scim.client:scim-client2:jar:4.1.0-SNAPSHOT: The following artifacts could not be resolved: org.gluu:oxauth-client:jar:4.1.0-SNAPSHOT, org.gluu:oxauth-model:jar:4.1.0-SNAPSHOT, org.gluu:oxtrust-scim:jar:4.1.0-SNAPSHOT: Could not find artifact org.gluu:oxauth-client:jar:4.1.0-SNAPSHOT in repository.jboss.org (http://repository.jboss.org/nexus/content/groups/public-jboss/) -> [Help 1]
[ERROR] 
[ERROR] To see the full stack trace of the errors, re-run Maven with the -e switch.
[ERROR] Re-run Maven using the -X switch to enable full debug logging.
[ERROR] 
[ERROR] For more information about the errors and possible solutions, please read the following articles:
[ERROR] [Help 1] http://cwiki.apache.org/confluence/display/MAVEN/DependencyResolutionException
Build step 'Invoke top-level Maven targets' marked build as failure
[FINDBUGS] Skipping publisher since build result is FAILURE
Publishing Javadoc
No JDK named ‘jdk_1.8.0_121’ found
No JDK named ‘jdk_1.8.0_121’ found
TestNG Reports Processing: START
Looking for TestNG results report in workspace using pattern: **/testng-results.xml
testng-results.xml was last modified before this build started. Ignoring it.
Saving reports...
Found matching files but did not find any TestNG results.
No JDK named ‘jdk_1.8.0_121’ found
Not sending mail to unregistered user Yuriy.Movchan@gmail.com
Sending e-mails to: support@gluu.org
Finished: FAILURE