FailedConsole Output

Started by user Yuriy Movchan
Running as SYSTEM
Building on master in workspace /home/jenkins/.jenkins/jobs/oxScimClient_4.0_LDAP/workspace
No JDK named ‘jdk_1.8.0_121’ found
No credentials specified
No JDK named ‘jdk_1.8.0_121’ found
 > git rev-parse --is-inside-work-tree # timeout=10
Fetching changes from the remote Git repository
 > git config remote.origin.url https://github.com/GluuFederation/SCIM-Client # timeout=10
Fetching upstream changes from https://github.com/GluuFederation/SCIM-Client
 > git --version # timeout=10
 > git fetch --tags --progress https://github.com/GluuFederation/SCIM-Client +refs/heads/*:refs/remotes/origin/*
 > git rev-parse refs/remotes/origin/master^{commit} # timeout=10
 > git rev-parse refs/remotes/origin/origin/master^{commit} # timeout=10
No JDK named ‘jdk_1.8.0_121’ found
Checking out Revision 75c1d3b6d564e93fe034d036ec625daea39d109c (refs/remotes/origin/master)
 > git config core.sparsecheckout # timeout=10
 > git checkout -f 75c1d3b6d564e93fe034d036ec625daea39d109c
Commit message: "Misc accomodations (cb friendlier)"
 > git rev-list --no-walk 75c1d3b6d564e93fe034d036ec625daea39d109c # timeout=10
No JDK named ‘jdk_1.8.0_121’ found
[workspace] $ /bin/sh -xe /opt/jetty/temp/jenkins8837717011187717436.sh
+ rm -rf ./oxHudsonProfiles
+ rm -rf ./profiles/ce-dev5.gluu.org
+ git clone github.com:GluuFederation/oxHudsonProfiles.git
Cloning into 'oxHudsonProfiles'...
+ mkdir -p ./profiles
+ cp -rf ./oxHudsonProfiles/scim-client/profiles/ce-dev5.gluu.org/ profiles
+ rm -rf ./oxHudsonProfiles
No JDK named ‘jdk_1.8.0_121’ found
[workspace] $ /home/jenkins/.jenkins/tools/hudson.tasks.Maven_MavenInstallation/maven_3.3.9/bin/mvn -DVERSION_NAME=master -DPROFILE_NAME=ce-dev5.gluu.org -DMAVEN_SKIP_TESTS=false -Dmaven.test.skip=false -Dcfg=ce-dev5.gluu.org clean compile javadoc:javadoc install findbugs:findbugs site
[INFO] Scanning for projects...
[INFO]                                                                         
[INFO] ------------------------------------------------------------------------
[INFO] Building SCIM-Client 4.0.0-SNAPSHOT
[INFO] ------------------------------------------------------------------------
[INFO] 
[INFO] --- maven-clean-plugin:2.5:clean (default-clean) @ scim-client2 ---
[INFO] Deleting /home/jenkins/.jenkins/jobs/oxScimClient_4.0_LDAP/workspace/target
[INFO] 
[INFO] --- maven-resources-plugin:2.6:resources (default-resources) @ scim-client2 ---
[INFO] Using 'UTF-8' encoding to copy filtered resources.
[INFO] Copying 1 resource
[INFO] 
[INFO] --- maven-compiler-plugin:3.1:compile (default-compile) @ scim-client2 ---
[INFO] Changes detected - recompiling the module!
[INFO] Compiling 18 source files to /home/jenkins/.jenkins/jobs/oxScimClient_4.0_LDAP/workspace/target/classes
[WARNING] /home/jenkins/.jenkins/jobs/oxScimClient_4.0_LDAP/workspace/src/main/java/gluu/scim2/client/rest/provider/ListResponseProvider.java: /home/jenkins/.jenkins/jobs/oxScimClient_4.0_LDAP/workspace/src/main/java/gluu/scim2/client/rest/provider/ListResponseProvider.java uses unchecked or unsafe operations.
[WARNING] /home/jenkins/.jenkins/jobs/oxScimClient_4.0_LDAP/workspace/src/main/java/gluu/scim2/client/rest/provider/ListResponseProvider.java: Recompile with -Xlint:unchecked for details.
[INFO] 
[INFO] >>> maven-javadoc-plugin:2.10.4:javadoc (default-cli) > generate-sources @ scim-client2 >>>
[INFO] 
[INFO] <<< maven-javadoc-plugin:2.10.4:javadoc (default-cli) < generate-sources @ scim-client2 <<<
[INFO] 
[INFO] --- maven-javadoc-plugin:2.10.4:javadoc (default-cli) @ scim-client2 ---
[INFO] 
Loading source files for package gluu.scim2.client.exception...
Loading source files for package gluu.scim2.client.factory...
Loading source files for package gluu.scim2.client.rest.provider...
Loading source files for package gluu.scim2.client.rest...
Loading source files for package gluu.scim2.client...
Constructing Javadoc information...
Standard Doclet version 1.8.0_222
Building tree for all the packages and classes...
Generating /home/jenkins/.jenkins/jobs/oxScimClient_4.0_LDAP/workspace/target/site/apidocs/gluu/scim2/client/exception/ScimClientException.html...
Generating /home/jenkins/.jenkins/jobs/oxScimClient_4.0_LDAP/workspace/target/site/apidocs/gluu/scim2/client/exception/ScimInitializationException.html...
Generating /home/jenkins/.jenkins/jobs/oxScimClient_4.0_LDAP/workspace/target/site/apidocs/gluu/scim2/client/factory/ScimClientFactory.html...
Generating /home/jenkins/.jenkins/jobs/oxScimClient_4.0_LDAP/workspace/target/site/apidocs/gluu/scim2/client/rest/provider/AuthorizationInjectionFilter.html...
Generating /home/jenkins/.jenkins/jobs/oxScimClient_4.0_LDAP/workspace/target/site/apidocs/gluu/scim2/client/rest/provider/ListResponseProvider.html...
Generating /home/jenkins/.jenkins/jobs/oxScimClient_4.0_LDAP/workspace/target/site/apidocs/gluu/scim2/client/rest/provider/ScimResourceProvider.html...
Generating /home/jenkins/.jenkins/jobs/oxScimClient_4.0_LDAP/workspace/target/site/apidocs/gluu/scim2/client/rest/ClientSideFido2DeviceService.html...
Generating /home/jenkins/.jenkins/jobs/oxScimClient_4.0_LDAP/workspace/target/site/apidocs/gluu/scim2/client/rest/ClientSideFidoDeviceService.html...
Generating /home/jenkins/.jenkins/jobs/oxScimClient_4.0_LDAP/workspace/target/site/apidocs/gluu/scim2/client/rest/ClientSideGroupService.html...
Generating /home/jenkins/.jenkins/jobs/oxScimClient_4.0_LDAP/workspace/target/site/apidocs/gluu/scim2/client/rest/ClientSideService.html...
Generating /home/jenkins/.jenkins/jobs/oxScimClient_4.0_LDAP/workspace/target/site/apidocs/gluu/scim2/client/rest/ClientSideUserService.html...
Generating /home/jenkins/.jenkins/jobs/oxScimClient_4.0_LDAP/workspace/target/site/apidocs/gluu/scim2/client/rest/CloseableClient.html...
Generating /home/jenkins/.jenkins/jobs/oxScimClient_4.0_LDAP/workspace/target/site/apidocs/gluu/scim2/client/rest/FreelyAccessible.html...
Generating /home/jenkins/.jenkins/jobs/oxScimClient_4.0_LDAP/workspace/target/site/apidocs/gluu/scim2/client/AbstractScimClient.html...
Generating /home/jenkins/.jenkins/jobs/oxScimClient_4.0_LDAP/workspace/target/site/apidocs/gluu/scim2/client/ClientMap.html...
Generating /home/jenkins/.jenkins/jobs/oxScimClient_4.0_LDAP/workspace/target/site/apidocs/gluu/scim2/client/DummyClient.html...
Generating /home/jenkins/.jenkins/jobs/oxScimClient_4.0_LDAP/workspace/target/site/apidocs/gluu/scim2/client/TestModeScimClient.html...
Generating /home/jenkins/.jenkins/jobs/oxScimClient_4.0_LDAP/workspace/target/site/apidocs/gluu/scim2/client/UmaScimClient.html...
Generating /home/jenkins/.jenkins/jobs/oxScimClient_4.0_LDAP/workspace/target/site/apidocs/overview-frame.html...
Generating /home/jenkins/.jenkins/jobs/oxScimClient_4.0_LDAP/workspace/target/site/apidocs/gluu/scim2/client/package-frame.html...
Generating /home/jenkins/.jenkins/jobs/oxScimClient_4.0_LDAP/workspace/target/site/apidocs/gluu/scim2/client/package-summary.html...
Generating /home/jenkins/.jenkins/jobs/oxScimClient_4.0_LDAP/workspace/target/site/apidocs/gluu/scim2/client/package-tree.html...
Generating /home/jenkins/.jenkins/jobs/oxScimClient_4.0_LDAP/workspace/target/site/apidocs/gluu/scim2/client/exception/package-frame.html...
Generating /home/jenkins/.jenkins/jobs/oxScimClient_4.0_LDAP/workspace/target/site/apidocs/gluu/scim2/client/exception/package-summary.html...
Generating /home/jenkins/.jenkins/jobs/oxScimClient_4.0_LDAP/workspace/target/site/apidocs/gluu/scim2/client/exception/package-tree.html...
Generating /home/jenkins/.jenkins/jobs/oxScimClient_4.0_LDAP/workspace/target/site/apidocs/gluu/scim2/client/factory/package-frame.html...
Generating /home/jenkins/.jenkins/jobs/oxScimClient_4.0_LDAP/workspace/target/site/apidocs/gluu/scim2/client/factory/package-summary.html...
Generating /home/jenkins/.jenkins/jobs/oxScimClient_4.0_LDAP/workspace/target/site/apidocs/gluu/scim2/client/factory/package-tree.html...
Generating /home/jenkins/.jenkins/jobs/oxScimClient_4.0_LDAP/workspace/target/site/apidocs/gluu/scim2/client/rest/package-frame.html...
Generating /home/jenkins/.jenkins/jobs/oxScimClient_4.0_LDAP/workspace/target/site/apidocs/gluu/scim2/client/rest/package-summary.html...
Generating /home/jenkins/.jenkins/jobs/oxScimClient_4.0_LDAP/workspace/target/site/apidocs/gluu/scim2/client/rest/package-tree.html...
Generating /home/jenkins/.jenkins/jobs/oxScimClient_4.0_LDAP/workspace/target/site/apidocs/gluu/scim2/client/rest/provider/package-frame.html...
Generating /home/jenkins/.jenkins/jobs/oxScimClient_4.0_LDAP/workspace/target/site/apidocs/gluu/scim2/client/rest/provider/package-summary.html...
Generating /home/jenkins/.jenkins/jobs/oxScimClient_4.0_LDAP/workspace/target/site/apidocs/gluu/scim2/client/rest/provider/package-tree.html...
Generating /home/jenkins/.jenkins/jobs/oxScimClient_4.0_LDAP/workspace/target/site/apidocs/constant-values.html...
Generating /home/jenkins/.jenkins/jobs/oxScimClient_4.0_LDAP/workspace/target/site/apidocs/serialized-form.html...
Generating /home/jenkins/.jenkins/jobs/oxScimClient_4.0_LDAP/workspace/target/site/apidocs/gluu/scim2/client/exception/class-use/ScimInitializationException.html...
Generating /home/jenkins/.jenkins/jobs/oxScimClient_4.0_LDAP/workspace/target/site/apidocs/gluu/scim2/client/exception/class-use/ScimClientException.html...
Generating /home/jenkins/.jenkins/jobs/oxScimClient_4.0_LDAP/workspace/target/site/apidocs/gluu/scim2/client/factory/class-use/ScimClientFactory.html...
Generating /home/jenkins/.jenkins/jobs/oxScimClient_4.0_LDAP/workspace/target/site/apidocs/gluu/scim2/client/rest/provider/class-use/ScimResourceProvider.html...
Generating /home/jenkins/.jenkins/jobs/oxScimClient_4.0_LDAP/workspace/target/site/apidocs/gluu/scim2/client/rest/provider/class-use/ListResponseProvider.html...
Generating /home/jenkins/.jenkins/jobs/oxScimClient_4.0_LDAP/workspace/target/site/apidocs/gluu/scim2/client/rest/provider/class-use/AuthorizationInjectionFilter.html...
Generating /home/jenkins/.jenkins/jobs/oxScimClient_4.0_LDAP/workspace/target/site/apidocs/gluu/scim2/client/rest/class-use/FreelyAccessible.html...
Generating /home/jenkins/.jenkins/jobs/oxScimClient_4.0_LDAP/workspace/target/site/apidocs/gluu/scim2/client/rest/class-use/CloseableClient.html...
Generating /home/jenkins/.jenkins/jobs/oxScimClient_4.0_LDAP/workspace/target/site/apidocs/gluu/scim2/client/rest/class-use/ClientSideUserService.html...
Generating /home/jenkins/.jenkins/jobs/oxScimClient_4.0_LDAP/workspace/target/site/apidocs/gluu/scim2/client/rest/class-use/ClientSideService.html...
Generating /home/jenkins/.jenkins/jobs/oxScimClient_4.0_LDAP/workspace/target/site/apidocs/gluu/scim2/client/rest/class-use/ClientSideGroupService.html...
Generating /home/jenkins/.jenkins/jobs/oxScimClient_4.0_LDAP/workspace/target/site/apidocs/gluu/scim2/client/rest/class-use/ClientSideFidoDeviceService.html...
Generating /home/jenkins/.jenkins/jobs/oxScimClient_4.0_LDAP/workspace/target/site/apidocs/gluu/scim2/client/rest/class-use/ClientSideFido2DeviceService.html...
Generating /home/jenkins/.jenkins/jobs/oxScimClient_4.0_LDAP/workspace/target/site/apidocs/gluu/scim2/client/class-use/UmaScimClient.html...
Generating /home/jenkins/.jenkins/jobs/oxScimClient_4.0_LDAP/workspace/target/site/apidocs/gluu/scim2/client/class-use/TestModeScimClient.html...
Generating /home/jenkins/.jenkins/jobs/oxScimClient_4.0_LDAP/workspace/target/site/apidocs/gluu/scim2/client/class-use/DummyClient.html...
Generating /home/jenkins/.jenkins/jobs/oxScimClient_4.0_LDAP/workspace/target/site/apidocs/gluu/scim2/client/class-use/ClientMap.html...
Generating /home/jenkins/.jenkins/jobs/oxScimClient_4.0_LDAP/workspace/target/site/apidocs/gluu/scim2/client/class-use/AbstractScimClient.html...
Generating /home/jenkins/.jenkins/jobs/oxScimClient_4.0_LDAP/workspace/target/site/apidocs/gluu/scim2/client/package-use.html...
Generating /home/jenkins/.jenkins/jobs/oxScimClient_4.0_LDAP/workspace/target/site/apidocs/gluu/scim2/client/exception/package-use.html...
Generating /home/jenkins/.jenkins/jobs/oxScimClient_4.0_LDAP/workspace/target/site/apidocs/gluu/scim2/client/factory/package-use.html...
Generating /home/jenkins/.jenkins/jobs/oxScimClient_4.0_LDAP/workspace/target/site/apidocs/gluu/scim2/client/rest/package-use.html...
Generating /home/jenkins/.jenkins/jobs/oxScimClient_4.0_LDAP/workspace/target/site/apidocs/gluu/scim2/client/rest/provider/package-use.html...
Building index for all the packages and classes...
Generating /home/jenkins/.jenkins/jobs/oxScimClient_4.0_LDAP/workspace/target/site/apidocs/overview-tree.html...
Generating /home/jenkins/.jenkins/jobs/oxScimClient_4.0_LDAP/workspace/target/site/apidocs/index-all.html...
Generating /home/jenkins/.jenkins/jobs/oxScimClient_4.0_LDAP/workspace/target/site/apidocs/deprecated-list.html...
Building index for all classes...
Generating /home/jenkins/.jenkins/jobs/oxScimClient_4.0_LDAP/workspace/target/site/apidocs/allclasses-frame.html...
Generating /home/jenkins/.jenkins/jobs/oxScimClient_4.0_LDAP/workspace/target/site/apidocs/allclasses-noframe.html...
Generating /home/jenkins/.jenkins/jobs/oxScimClient_4.0_LDAP/workspace/target/site/apidocs/index.html...
Generating /home/jenkins/.jenkins/jobs/oxScimClient_4.0_LDAP/workspace/target/site/apidocs/overview-summary.html...
Generating /home/jenkins/.jenkins/jobs/oxScimClient_4.0_LDAP/workspace/target/site/apidocs/help-doc.html...
[INFO] 
[INFO] --- maven-resources-plugin:2.6:resources (default-resources) @ scim-client2 ---
[INFO] Using 'UTF-8' encoding to copy filtered resources.
[INFO] Copying 1 resource
[INFO] 
[INFO] --- maven-compiler-plugin:3.1:compile (default-compile) @ scim-client2 ---
[INFO] Nothing to compile - all classes are up to date
[INFO] 
[INFO] --- maven-resources-plugin:2.6:testResources (default-testResources) @ scim-client2 ---
[INFO] Using 'UTF-8' encoding to copy filtered resources.
[INFO] Copying 35 resources
[INFO] 
[INFO] --- maven-compiler-plugin:3.1:testCompile (default-testCompile) @ scim-client2 ---
[INFO] Changes detected - recompiling the module!
[INFO] Compiling 32 source files to /home/jenkins/.jenkins/jobs/oxScimClient_4.0_LDAP/workspace/target/test-classes
[INFO] 
[INFO] --- maven-surefire-plugin:2.12.4:test (default-test) @ scim-client2 ---
[INFO] Surefire report directory: /home/jenkins/.jenkins/jobs/oxScimClient_4.0_LDAP/workspace/target/surefire-reports

-------------------------------------------------------
 T E S T S
-------------------------------------------------------
Running TestSuite
18:34:08 INFO  BaseTest.java:43 - Invoked initTestSuite of 'Corner and other weird cases'
18:34:08 INFO  BaseTest.java:71 - Initializing client...
18:34:09 DEBUG MinimalUserTest.java:29 - Creating mimimal user from json...
18:34:09 DEBUG MinimalGroupTest.java:31 - Creating mimimal group from json...
18:34:09 DEBUG AverageUserTest.java:36 - Creating user from json...
18:34:09 DEBUG FullUserTest.java:36 - Creating user from json...
18:34:09 DEBUG SimpleSearchUserTest.java:33 - Creating user from json...
18:34:09 DEBUG ComplexSearchUserTest.java:68 - Searching at most 3 users using POST verb
18:34:09 DEBUG ComplexSearchUserTest.java:69 - Sorted by family name descending
18:34:09 DEBUG ComplexSearchUserTest.java:70 - Retrieving only the attributes [name.familyName, active]
18:34:09 DEBUG ComplexSearchUserTest.java:154 - Searching at most 3 users using POST verb
18:34:09 DEBUG ComplexSearchUserTest.java:155 - Sorted by displayName ascending
18:34:09 DEBUG ComplexSearchUserTest.java:156 - Excluding the attributes [x509Certificates, entitlements, roles, ims, phoneNumbers, addresses, emails, groups]
18:34:09 DEBUG ComplexSearchUserTest.java:39 - Searching users with attribute nickName existent or ims.value=Skype using POST verb
18:34:09 INFO  GroupAssignUserTest.java:40 - Creating 3 users...
18:34:09 DEBUG QueryParamRetrievalTest.java:34 - Retrieving test users...
18:34:09 DEBUG QueryParamCreateUpdateTest.java:38 - Creating user from json...
18:34:09 DEBUG PatchReplaceUserTest.java:39 - Creating user from json...
18:34:09 DEBUG PatchAddUserTest.java:30 - Creating user from json...
18:34:09 DEBUG PatchDeleteUserTest.java:30 - Creating user from json...
18:34:09 DEBUG PatchUserExtTest.java:40 - Creating user from json...
18:34:09 DEBUG UserBaseTest.java:33 - Deleting user 1569954849854
18:34:09 DEBUG PatchGroupTest.java:47 - Creating group from json...
18:34:09 INFO  UsersBulkTest.java:35 - Sending a bulk with POST, PUT, and PATCH operations...
18:34:09 INFO  GroupsBulkTest.java:40 - Creating one user and one group using bulk json string
18:34:09 INFO  GroupsBulkTest.java:98 - Cleaning...
18:34:10 DEBUG WrongPayloadUserTest.java:49 - Creating mimimal user from json...
18:34:10 INFO  AbstractScimClient.java:126 - Closing RestEasy client
Tests run: 113, Failures: 49, Errors: 0, Skipped: 59, Time elapsed: 4.502 sec <<< FAILURE!
init(gluu.scim2.client.servicemeta.ResourceTypesTest)  Time elapsed: 3.182 sec  <<< FAILURE!
javax.ws.rs.ProcessingException: RESTEASY003145: Unable to find a MessageBodyReader of content-type */* and type class org.gluu.oxtrust.model.scim2.ListResponse
	at org.jboss.resteasy.core.interception.ClientReaderInterceptorContext.throwReaderNotFound(ClientReaderInterceptorContext.java:42)
	at org.jboss.resteasy.core.interception.AbstractReaderInterceptorContext.getReader(AbstractReaderInterceptorContext.java:80)
	at org.jboss.resteasy.core.interception.AbstractReaderInterceptorContext.proceed(AbstractReaderInterceptorContext.java:53)
	at org.jboss.resteasy.client.jaxrs.internal.ClientResponse.readFrom(ClientResponse.java:248)
	at org.jboss.resteasy.client.jaxrs.internal.ClientResponse.readEntity(ClientResponse.java:178)
	at org.jboss.resteasy.specimpl.BuiltResponse.readEntity(BuiltResponse.java:237)
	at gluu.scim2.client.servicemeta.ResourceTypesTest.init(ResourceTypesTest.java:27)

createUser(gluu.scim2.client.singleresource.MinimalUserTest)  Time elapsed: 0.031 sec  <<< FAILURE!
java.lang.AssertionError: expected [201] but found [503]
	at org.testng.Assert.fail(Assert.java:93)
	at org.testng.Assert.failNotEquals(Assert.java:512)
	at org.testng.Assert.assertEqualsImpl(Assert.java:134)
	at org.testng.Assert.assertEquals(Assert.java:115)
	at org.testng.Assert.assertEquals(Assert.java:388)
	at org.testng.Assert.assertEquals(Assert.java:398)
	at gluu.scim2.client.UserBaseTest.createUserFromJson(UserBaseTest.java:22)
	at gluu.scim2.client.singleresource.MinimalUserTest.createUser(MinimalUserTest.java:30)

delete(gluu.scim2.client.singleresource.MinimalUserTest)  Time elapsed: 0 sec  <<< FAILURE!
java.lang.NullPointerException
	at gluu.scim2.client.UserBaseTest.deleteUser(UserBaseTest.java:33)
	at gluu.scim2.client.singleresource.MinimalUserTest.delete(MinimalUserTest.java:50)

createGroup(gluu.scim2.client.singleresource.MinimalGroupTest)  Time elapsed: 0.014 sec  <<< FAILURE!
java.lang.AssertionError: expected [201] but found [503]
	at org.testng.Assert.fail(Assert.java:93)
	at org.testng.Assert.failNotEquals(Assert.java:512)
	at org.testng.Assert.assertEqualsImpl(Assert.java:134)
	at org.testng.Assert.assertEquals(Assert.java:115)
	at org.testng.Assert.assertEquals(Assert.java:388)
	at org.testng.Assert.assertEquals(Assert.java:398)
	at gluu.scim2.client.singleresource.MinimalGroupTest.createGroup(MinimalGroupTest.java:33)

delete(gluu.scim2.client.singleresource.MinimalGroupTest)  Time elapsed: 0.001 sec  <<< FAILURE!
java.lang.NullPointerException
	at gluu.scim2.client.singleresource.MinimalGroupTest.delete(MinimalGroupTest.java:59)

create(gluu.scim2.client.singleresource.AverageUserTest)  Time elapsed: 0.016 sec  <<< FAILURE!
java.lang.AssertionError: expected [201] but found [503]
	at org.testng.Assert.fail(Assert.java:93)
	at org.testng.Assert.failNotEquals(Assert.java:512)
	at org.testng.Assert.assertEqualsImpl(Assert.java:134)
	at org.testng.Assert.assertEquals(Assert.java:115)
	at org.testng.Assert.assertEquals(Assert.java:388)
	at org.testng.Assert.assertEquals(Assert.java:398)
	at gluu.scim2.client.UserBaseTest.createUserFromJson(UserBaseTest.java:22)
	at gluu.scim2.client.singleresource.AverageUserTest.create(AverageUserTest.java:37)

delete(gluu.scim2.client.singleresource.AverageUserTest)  Time elapsed: 0.001 sec  <<< FAILURE!
java.lang.NullPointerException
	at gluu.scim2.client.UserBaseTest.deleteUser(UserBaseTest.java:33)
	at gluu.scim2.client.singleresource.AverageUserTest.delete(AverageUserTest.java:126)

createFull(gluu.scim2.client.singleresource.FullUserTest)  Time elapsed: 0.015 sec  <<< FAILURE!
java.lang.AssertionError: expected [201] but found [503]
	at org.testng.Assert.fail(Assert.java:93)
	at org.testng.Assert.failNotEquals(Assert.java:512)
	at org.testng.Assert.assertEqualsImpl(Assert.java:134)
	at org.testng.Assert.assertEquals(Assert.java:115)
	at org.testng.Assert.assertEquals(Assert.java:388)
	at org.testng.Assert.assertEquals(Assert.java:398)
	at gluu.scim2.client.UserBaseTest.createUserFromJson(UserBaseTest.java:22)
	at gluu.scim2.client.singleresource.FullUserTest.createFull(FullUserTest.java:37)

delete(gluu.scim2.client.singleresource.FullUserTest)  Time elapsed: 0.001 sec  <<< FAILURE!
java.lang.NullPointerException
	at gluu.scim2.client.UserBaseTest.deleteUser(UserBaseTest.java:33)
	at gluu.scim2.client.singleresource.FullUserTest.delete(FullUserTest.java:157)

create(gluu.scim2.client.search.SimpleSearchUserTest)  Time elapsed: 0.016 sec  <<< FAILURE!
java.lang.AssertionError: expected [201] but found [503]
	at org.testng.Assert.fail(Assert.java:93)
	at org.testng.Assert.failNotEquals(Assert.java:512)
	at org.testng.Assert.assertEqualsImpl(Assert.java:134)
	at org.testng.Assert.assertEquals(Assert.java:115)
	at org.testng.Assert.assertEquals(Assert.java:388)
	at org.testng.Assert.assertEquals(Assert.java:398)
	at gluu.scim2.client.UserBaseTest.createUserFromJson(UserBaseTest.java:22)
	at gluu.scim2.client.search.SimpleSearchUserTest.create(SimpleSearchUserTest.java:34)

searchAttributesParam(gluu.scim2.client.search.ComplexSearchUserTest)  Time elapsed: 0.125 sec  <<< FAILURE!
java.lang.AssertionError: expected [200] but found [503]
	at org.testng.Assert.fail(Assert.java:93)
	at org.testng.Assert.failNotEquals(Assert.java:512)
	at org.testng.Assert.assertEqualsImpl(Assert.java:134)
	at org.testng.Assert.assertEquals(Assert.java:115)
	at org.testng.Assert.assertEquals(Assert.java:388)
	at org.testng.Assert.assertEquals(Assert.java:398)
	at gluu.scim2.client.search.ComplexSearchUserTest.searchAttributesParam(ComplexSearchUserTest.java:81)

searchExcludedAttributesParam(gluu.scim2.client.search.ComplexSearchUserTest)  Time elapsed: 0.022 sec  <<< FAILURE!
java.lang.AssertionError: expected [200] but found [503]
	at org.testng.Assert.fail(Assert.java:93)
	at org.testng.Assert.failNotEquals(Assert.java:512)
	at org.testng.Assert.assertEqualsImpl(Assert.java:134)
	at org.testng.Assert.assertEquals(Assert.java:115)
	at org.testng.Assert.assertEquals(Assert.java:388)
	at org.testng.Assert.assertEquals(Assert.java:398)
	at gluu.scim2.client.search.ComplexSearchUserTest.searchExcludedAttributesParam(ComplexSearchUserTest.java:167)

searchNoAttributesParam(gluu.scim2.client.search.ComplexSearchUserTest)  Time elapsed: 0.014 sec  <<< FAILURE!
java.lang.AssertionError: expected [200] but found [503]
	at org.testng.Assert.fail(Assert.java:93)
	at org.testng.Assert.failNotEquals(Assert.java:512)
	at org.testng.Assert.assertEqualsImpl(Assert.java:134)
	at org.testng.Assert.assertEquals(Assert.java:115)
	at org.testng.Assert.assertEquals(Assert.java:388)
	at org.testng.Assert.assertEquals(Assert.java:398)
	at gluu.scim2.client.search.ComplexSearchUserTest.searchNoAttributesParam(ComplexSearchUserTest.java:44)

searchSortByExternalId(gluu.scim2.client.search.ComplexSearchUserTest)  Time elapsed: 0.017 sec  <<< FAILURE!
java.lang.AssertionError: expected [200] but found [503]
	at org.testng.Assert.fail(Assert.java:93)
	at org.testng.Assert.failNotEquals(Assert.java:512)
	at org.testng.Assert.assertEqualsImpl(Assert.java:134)
	at org.testng.Assert.assertEquals(Assert.java:115)
	at org.testng.Assert.assertEquals(Assert.java:388)
	at org.testng.Assert.assertEquals(Assert.java:398)
	at gluu.scim2.client.search.ComplexSearchUserTest.searchSortByExternalId(ComplexSearchUserTest.java:250)

search1(gluu.scim2.client.search.PaginationUserSearchTest)  Time elapsed: 0.014 sec  <<< FAILURE!
java.lang.AssertionError: expected [200] but found [503]
	at org.testng.Assert.fail(Assert.java:93)
	at org.testng.Assert.failNotEquals(Assert.java:512)
	at org.testng.Assert.assertEqualsImpl(Assert.java:134)
	at org.testng.Assert.assertEquals(Assert.java:115)
	at org.testng.Assert.assertEquals(Assert.java:388)
	at org.testng.Assert.assertEquals(Assert.java:398)
	at gluu.scim2.client.search.PaginationUserSearchTest.search1(PaginationUserSearchTest.java:42)

delete(gluu.scim2.client.search.SimpleSearchUserTest)  Time elapsed: 0 sec  <<< FAILURE!
java.lang.NullPointerException
	at gluu.scim2.client.UserBaseTest.deleteUser(UserBaseTest.java:33)
	at gluu.scim2.client.search.SimpleSearchUserTest.delete(SimpleSearchUserTest.java:141)

createUsers(gluu.scim2.client.multipleresource.GroupAssignUserTest)  Time elapsed: 0.068 sec  <<< FAILURE!
java.lang.AssertionError: expected [201] but found [503]
	at org.testng.Assert.fail(Assert.java:93)
	at org.testng.Assert.failNotEquals(Assert.java:512)
	at org.testng.Assert.assertEqualsImpl(Assert.java:134)
	at org.testng.Assert.assertEquals(Assert.java:115)
	at org.testng.Assert.assertEquals(Assert.java:388)
	at org.testng.Assert.assertEquals(Assert.java:398)
	at gluu.scim2.client.multipleresource.GroupAssignUserTest.createUsers(GroupAssignUserTest.java:46)

multipleRetrieval(gluu.scim2.client.singleresource.QueryParamRetrievalTest)  Time elapsed: 0.017 sec  <<< FAILURE!
java.lang.AssertionError: expected [200] but found [503]
	at org.testng.Assert.fail(Assert.java:93)
	at org.testng.Assert.failNotEquals(Assert.java:512)
	at org.testng.Assert.assertEqualsImpl(Assert.java:134)
	at org.testng.Assert.assertEquals(Assert.java:115)
	at org.testng.Assert.assertEquals(Assert.java:388)
	at org.testng.Assert.assertEquals(Assert.java:398)
	at gluu.scim2.client.singleresource.QueryParamRetrievalTest.multipleRetrieval(QueryParamRetrievalTest.java:38)

create1(gluu.scim2.client.singleresource.QueryParamCreateUpdateTest)  Time elapsed: 0.017 sec  <<< FAILURE!
java.lang.AssertionError: expected [201] but found [503]
	at org.testng.Assert.fail(Assert.java:93)
	at org.testng.Assert.failNotEquals(Assert.java:512)
	at org.testng.Assert.assertEqualsImpl(Assert.java:134)
	at org.testng.Assert.assertEquals(Assert.java:115)
	at org.testng.Assert.assertEquals(Assert.java:388)
	at org.testng.Assert.assertEquals(Assert.java:398)
	at gluu.scim2.client.singleresource.QueryParamCreateUpdateTest.create1(QueryParamCreateUpdateTest.java:44)

delete1(gluu.scim2.client.singleresource.QueryParamCreateUpdateTest)  Time elapsed: 0 sec  <<< FAILURE!
java.lang.NullPointerException
	at gluu.scim2.client.UserBaseTest.deleteUser(UserBaseTest.java:33)
	at gluu.scim2.client.singleresource.QueryParamCreateUpdateTest.delete1(QueryParamCreateUpdateTest.java:53)

delete(gluu.scim2.client.singleresource.QueryParamCreateUpdateTest)  Time elapsed: 0 sec  <<< FAILURE!
java.lang.NullPointerException
	at gluu.scim2.client.UserBaseTest.deleteUser(UserBaseTest.java:33)
	at gluu.scim2.client.singleresource.QueryParamCreateUpdateTest.delete(QueryParamCreateUpdateTest.java:149)

searchJson(gluu.scim2.client.search.MultipleResourcesSearchTest)  Time elapsed: 0.012 sec  <<< FAILURE!
java.lang.AssertionError: expected [200] but found [503]
	at org.testng.Assert.fail(Assert.java:93)
	at org.testng.Assert.failNotEquals(Assert.java:512)
	at org.testng.Assert.assertEqualsImpl(Assert.java:134)
	at org.testng.Assert.assertEquals(Assert.java:115)
	at org.testng.Assert.assertEquals(Assert.java:388)
	at org.testng.Assert.assertEquals(Assert.java:398)
	at gluu.scim2.client.search.MultipleResourcesSearchTest.searchJson(MultipleResourcesSearchTest.java:32)

createForReplace(gluu.scim2.client.patch.PatchReplaceUserTest)  Time elapsed: 0.014 sec  <<< FAILURE!
java.lang.AssertionError: expected [201] but found [503]
	at org.testng.Assert.fail(Assert.java:93)
	at org.testng.Assert.failNotEquals(Assert.java:512)
	at org.testng.Assert.assertEqualsImpl(Assert.java:134)
	at org.testng.Assert.assertEquals(Assert.java:115)
	at org.testng.Assert.assertEquals(Assert.java:388)
	at org.testng.Assert.assertEquals(Assert.java:398)
	at gluu.scim2.client.UserBaseTest.createUserFromJson(UserBaseTest.java:22)
	at gluu.scim2.client.patch.PatchReplaceUserTest.createForReplace(PatchReplaceUserTest.java:40)

delete(gluu.scim2.client.patch.PatchReplaceUserTest)  Time elapsed: 0.001 sec  <<< FAILURE!
java.lang.NullPointerException
	at gluu.scim2.client.UserBaseTest.deleteUser(UserBaseTest.java:33)
	at gluu.scim2.client.patch.PatchReplaceUserTest.delete(PatchReplaceUserTest.java:204)

createForAdd(gluu.scim2.client.patch.PatchAddUserTest)  Time elapsed: 0.011 sec  <<< FAILURE!
java.lang.AssertionError: expected [201] but found [503]
	at org.testng.Assert.fail(Assert.java:93)
	at org.testng.Assert.failNotEquals(Assert.java:512)
	at org.testng.Assert.assertEqualsImpl(Assert.java:134)
	at org.testng.Assert.assertEquals(Assert.java:115)
	at org.testng.Assert.assertEquals(Assert.java:388)
	at org.testng.Assert.assertEquals(Assert.java:398)
	at gluu.scim2.client.UserBaseTest.createUserFromJson(UserBaseTest.java:22)
	at gluu.scim2.client.patch.PatchAddUserTest.createForAdd(PatchAddUserTest.java:31)

delete(gluu.scim2.client.patch.PatchAddUserTest)  Time elapsed: 0.001 sec  <<< FAILURE!
java.lang.NullPointerException
	at gluu.scim2.client.UserBaseTest.deleteUser(UserBaseTest.java:33)
	at gluu.scim2.client.patch.PatchAddUserTest.delete(PatchAddUserTest.java:53)

createForDel(gluu.scim2.client.patch.PatchDeleteUserTest)  Time elapsed: 0.013 sec  <<< FAILURE!
java.lang.AssertionError: expected [201] but found [503]
	at org.testng.Assert.fail(Assert.java:93)
	at org.testng.Assert.failNotEquals(Assert.java:512)
	at org.testng.Assert.assertEqualsImpl(Assert.java:134)
	at org.testng.Assert.assertEquals(Assert.java:115)
	at org.testng.Assert.assertEquals(Assert.java:388)
	at org.testng.Assert.assertEquals(Assert.java:398)
	at gluu.scim2.client.UserBaseTest.createUserFromJson(UserBaseTest.java:22)
	at gluu.scim2.client.patch.PatchDeleteUserTest.createForDel(PatchDeleteUserTest.java:31)

delete(gluu.scim2.client.patch.PatchDeleteUserTest)  Time elapsed: 0 sec  <<< FAILURE!
java.lang.NullPointerException
	at gluu.scim2.client.UserBaseTest.deleteUser(UserBaseTest.java:33)
	at gluu.scim2.client.patch.PatchDeleteUserTest.delete(PatchDeleteUserTest.java:60)

create(gluu.scim2.client.patch.PatchUserExtTest)  Time elapsed: 0.014 sec  <<< FAILURE!
java.lang.AssertionError: expected [201] but found [503]
	at org.testng.Assert.fail(Assert.java:93)
	at org.testng.Assert.failNotEquals(Assert.java:512)
	at org.testng.Assert.assertEqualsImpl(Assert.java:134)
	at org.testng.Assert.assertEquals(Assert.java:115)
	at org.testng.Assert.assertEquals(Assert.java:388)
	at org.testng.Assert.assertEquals(Assert.java:398)
	at gluu.scim2.client.UserBaseTest.createUserFromJson(UserBaseTest.java:22)
	at gluu.scim2.client.patch.PatchUserExtTest.create(PatchUserExtTest.java:41)

delete(gluu.scim2.client.patch.PatchUserExtTest)  Time elapsed: 0.001 sec  <<< FAILURE!
java.lang.NullPointerException
	at gluu.scim2.client.UserBaseTest.deleteUser(UserBaseTest.java:33)
	at gluu.scim2.client.patch.PatchUserExtTest.delete(PatchUserExtTest.java:105)

create(gluu.scim2.client.patch.PatchValueFilterUserTest)  Time elapsed: 0.026 sec  <<< FAILURE!
java.lang.AssertionError: expected [201] but found [503]
	at org.testng.Assert.fail(Assert.java:93)
	at org.testng.Assert.failNotEquals(Assert.java:512)
	at org.testng.Assert.assertEqualsImpl(Assert.java:134)
	at org.testng.Assert.assertEquals(Assert.java:115)
	at org.testng.Assert.assertEquals(Assert.java:388)
	at org.testng.Assert.assertEquals(Assert.java:398)
	at gluu.scim2.client.patch.PatchValueFilterUserTest.create(PatchValueFilterUserTest.java:38)

delete(gluu.scim2.client.patch.PatchValueFilterUserTest)  Time elapsed: 0.006 sec  <<< FAILURE!
java.lang.reflect.UndeclaredThrowableException
	at com.sun.proxy.$Proxy45.deleteUser(Unknown Source)
	at gluu.scim2.client.UserBaseTest.deleteUser(UserBaseTest.java:34)
	at gluu.scim2.client.patch.PatchValueFilterUserTest.delete(PatchValueFilterUserTest.java:94)
Caused by: java.lang.reflect.InvocationTargetException
	at sun.reflect.NativeMethodAccessorImpl.invoke0(Native Method)
	at sun.reflect.NativeMethodAccessorImpl.invoke(NativeMethodAccessorImpl.java:62)
	at sun.reflect.DelegatingMethodAccessorImpl.invoke(DelegatingMethodAccessorImpl.java:43)
	at java.lang.reflect.Method.invoke(Method.java:498)
	at gluu.scim2.client.AbstractScimClient.invokeServiceMethod(AbstractScimClient.java:99)
	at gluu.scim2.client.AbstractScimClient.invoke(AbstractScimClient.java:140)
	... 37 more
Caused by: java.lang.NullPointerException: RESTEASY004670: value was null
	at org.jboss.resteasy.client.jaxrs.internal.ClientWebTarget.resolveTemplate(ClientWebTarget.java:186)
	at org.jboss.resteasy.client.jaxrs.internal.ClientWebTarget.resolveTemplate(ClientWebTarget.java:25)
	at org.jboss.resteasy.client.jaxrs.internal.proxy.processors.webtarget.PathParamProcessor.build(PathParamProcessor.java:31)
	at org.jboss.resteasy.client.jaxrs.internal.proxy.ClientInvoker.createRequest(ClientInvoker.java:115)
	at org.jboss.resteasy.client.jaxrs.internal.proxy.ClientInvoker.invoke(ClientInvoker.java:101)
	at org.jboss.resteasy.client.jaxrs.internal.proxy.ClientProxy.invoke(ClientProxy.java:76)
	at com.sun.proxy.$Proxy44.deleteUser(Unknown Source)
	... 43 more

createGroup(gluu.scim2.client.patch.PatchGroupTest)  Time elapsed: 0.012 sec  <<< FAILURE!
java.lang.AssertionError: expected [201] but found [503]
	at org.testng.Assert.fail(Assert.java:93)
	at org.testng.Assert.failNotEquals(Assert.java:512)
	at org.testng.Assert.assertEqualsImpl(Assert.java:134)
	at org.testng.Assert.assertEquals(Assert.java:115)
	at org.testng.Assert.assertEquals(Assert.java:388)
	at org.testng.Assert.assertEquals(Assert.java:398)
	at gluu.scim2.client.patch.PatchGroupTest.createGroup(PatchGroupTest.java:49)

delete(gluu.scim2.client.patch.PatchGroupTest)  Time elapsed: 0.003 sec  <<< FAILURE!
java.lang.NullPointerException
	at gluu.scim2.client.patch.PatchGroupTest.delete(PatchGroupTest.java:151)

bulkJson1(gluu.scim2.client.bulk.UsersBulkTest)  Time elapsed: 0.013 sec  <<< FAILURE!
java.lang.AssertionError: expected [200] but found [503]
	at org.testng.Assert.fail(Assert.java:93)
	at org.testng.Assert.failNotEquals(Assert.java:512)
	at org.testng.Assert.assertEqualsImpl(Assert.java:134)
	at org.testng.Assert.assertEquals(Assert.java:115)
	at org.testng.Assert.assertEquals(Assert.java:388)
	at org.testng.Assert.assertEquals(Assert.java:398)
	at gluu.scim2.client.bulk.UsersBulkTest.bulkJson1(UsersBulkTest.java:37)

bulkJson(gluu.scim2.client.bulk.GroupsBulkTest)  Time elapsed: 0.014 sec  <<< FAILURE!
java.lang.AssertionError: expected [200] but found [503]
	at org.testng.Assert.fail(Assert.java:93)
	at org.testng.Assert.failNotEquals(Assert.java:512)
	at org.testng.Assert.assertEqualsImpl(Assert.java:134)
	at org.testng.Assert.assertEquals(Assert.java:115)
	at org.testng.Assert.assertEquals(Assert.java:388)
	at org.testng.Assert.assertEquals(Assert.java:398)
	at gluu.scim2.client.bulk.GroupsBulkTest.bulkJson(GroupsBulkTest.java:43)

delete(gluu.scim2.client.bulk.GroupsBulkTest)  Time elapsed: 0.028 sec  <<< FAILURE!
java.lang.AssertionError: expected [200] but found [503]
	at org.testng.Assert.fail(Assert.java:93)
	at org.testng.Assert.failNotEquals(Assert.java:512)
	at org.testng.Assert.assertEqualsImpl(Assert.java:134)
	at org.testng.Assert.assertEquals(Assert.java:115)
	at org.testng.Assert.assertEquals(Assert.java:388)
	at org.testng.Assert.assertEquals(Assert.java:398)
	at gluu.scim2.client.bulk.GroupsBulkTest.delete(GroupsBulkTest.java:118)

createWrongCustAttrs1(gluu.scim2.client.corner.WrongPayloadUserExtTest)  Time elapsed: 0.013 sec  <<< FAILURE!
java.lang.AssertionError: expected [400] but found [503]
	at org.testng.Assert.fail(Assert.java:93)
	at org.testng.Assert.failNotEquals(Assert.java:512)
	at org.testng.Assert.assertEqualsImpl(Assert.java:134)
	at org.testng.Assert.assertEquals(Assert.java:115)
	at org.testng.Assert.assertEquals(Assert.java:388)
	at org.testng.Assert.assertEquals(Assert.java:398)
	at gluu.scim2.client.corner.WrongPayloadUserExtTest.createWrongCustAttrs1(WrongPayloadUserExtTest.java:27)

createWrongCustAttrs2(gluu.scim2.client.corner.WrongPayloadUserExtTest)  Time elapsed: 0.016 sec  <<< FAILURE!
java.lang.AssertionError: expected [400] but found [503]
	at org.testng.Assert.fail(Assert.java:93)
	at org.testng.Assert.failNotEquals(Assert.java:512)
	at org.testng.Assert.assertEqualsImpl(Assert.java:134)
	at org.testng.Assert.assertEquals(Assert.java:115)
	at org.testng.Assert.assertEquals(Assert.java:388)
	at org.testng.Assert.assertEquals(Assert.java:398)
	at gluu.scim2.client.corner.WrongPayloadUserExtTest.createWrongCustAttrs2(WrongPayloadUserExtTest.java:34)

createWrongCustAttrs3(gluu.scim2.client.corner.WrongPayloadUserExtTest)  Time elapsed: 0.014 sec  <<< FAILURE!
java.lang.AssertionError: expected [400] but found [503]
	at org.testng.Assert.fail(Assert.java:93)
	at org.testng.Assert.failNotEquals(Assert.java:512)
	at org.testng.Assert.assertEqualsImpl(Assert.java:134)
	at org.testng.Assert.assertEquals(Assert.java:115)
	at org.testng.Assert.assertEquals(Assert.java:388)
	at org.testng.Assert.assertEquals(Assert.java:398)
	at gluu.scim2.client.corner.WrongPayloadUserExtTest.createWrongCustAttrs3(WrongPayloadUserExtTest.java:41)

createWrongCustAttrs4(gluu.scim2.client.corner.WrongPayloadUserExtTest)  Time elapsed: 0.013 sec  <<< FAILURE!
java.lang.AssertionError: expected [400] but found [503]
	at org.testng.Assert.fail(Assert.java:93)
	at org.testng.Assert.failNotEquals(Assert.java:512)
	at org.testng.Assert.assertEqualsImpl(Assert.java:134)
	at org.testng.Assert.assertEquals(Assert.java:115)
	at org.testng.Assert.assertEquals(Assert.java:388)
	at org.testng.Assert.assertEquals(Assert.java:398)
	at gluu.scim2.client.corner.WrongPayloadUserExtTest.createWrongCustAttrs4(WrongPayloadUserExtTest.java:48)

createWrongCustAttrs5(gluu.scim2.client.corner.WrongPayloadUserExtTest)  Time elapsed: 0.012 sec  <<< FAILURE!
java.lang.AssertionError: expected [400] but found [503]
	at org.testng.Assert.fail(Assert.java:93)
	at org.testng.Assert.failNotEquals(Assert.java:512)
	at org.testng.Assert.assertEqualsImpl(Assert.java:134)
	at org.testng.Assert.assertEquals(Assert.java:115)
	at org.testng.Assert.assertEquals(Assert.java:388)
	at org.testng.Assert.assertEquals(Assert.java:398)
	at gluu.scim2.client.corner.WrongPayloadUserExtTest.createWrongCustAttrs5(WrongPayloadUserExtTest.java:55)

createWrongCustAttrs6(gluu.scim2.client.corner.WrongPayloadUserExtTest)  Time elapsed: 0.013 sec  <<< FAILURE!
java.lang.AssertionError: expected [400] but found [503]
	at org.testng.Assert.fail(Assert.java:93)
	at org.testng.Assert.failNotEquals(Assert.java:512)
	at org.testng.Assert.assertEqualsImpl(Assert.java:134)
	at org.testng.Assert.assertEquals(Assert.java:115)
	at org.testng.Assert.assertEquals(Assert.java:388)
	at org.testng.Assert.assertEquals(Assert.java:398)
	at gluu.scim2.client.corner.WrongPayloadUserExtTest.createWrongCustAttrs6(WrongPayloadUserExtTest.java:62)

queryAndRemoval(gluu.scim2.client.corner.PairwiseIdentifiersTest)  Time elapsed: 0.012 sec  <<< FAILURE!
java.lang.AssertionError: expected [200] but found [503]
	at org.testng.Assert.fail(Assert.java:93)
	at org.testng.Assert.failNotEquals(Assert.java:512)
	at org.testng.Assert.assertEqualsImpl(Assert.java:134)
	at org.testng.Assert.assertEquals(Assert.java:115)
	at org.testng.Assert.assertEquals(Assert.java:388)
	at org.testng.Assert.assertEquals(Assert.java:398)
	at gluu.scim2.client.corner.PairwiseIdentifiersTest.queryAndRemoval(PairwiseIdentifiersTest.java:33)

containabilityAll(gluu.scim2.client.corner.SpecialCharsTest)  Time elapsed: 0.016 sec  <<< FAILURE!
java.lang.AssertionError: expected [200] but found [503]
	at org.testng.Assert.fail(Assert.java:93)
	at org.testng.Assert.failNotEquals(Assert.java:512)
	at org.testng.Assert.assertEqualsImpl(Assert.java:134)
	at org.testng.Assert.assertEquals(Assert.java:115)
	at org.testng.Assert.assertEquals(Assert.java:388)
	at org.testng.Assert.assertEquals(Assert.java:398)
	at gluu.scim2.client.corner.SpecialCharsTest.containabilityAll(SpecialCharsTest.java:73)

containabilityAllInGivenName(gluu.scim2.client.corner.SpecialCharsTest)  Time elapsed: 0.015 sec  <<< FAILURE!
java.lang.AssertionError: expected [200] but found [503]
	at org.testng.Assert.fail(Assert.java:93)
	at org.testng.Assert.failNotEquals(Assert.java:512)
	at org.testng.Assert.assertEqualsImpl(Assert.java:134)
	at org.testng.Assert.assertEquals(Assert.java:115)
	at org.testng.Assert.assertEquals(Assert.java:388)
	at org.testng.Assert.assertEquals(Assert.java:398)
	at gluu.scim2.client.corner.SpecialCharsTest.containabilityAllInGivenName(SpecialCharsTest.java:94)

containabilityAny(gluu.scim2.client.corner.SpecialCharsTest)  Time elapsed: 0.015 sec  <<< FAILURE!
java.lang.AssertionError: expected [200] but found [503]
	at org.testng.Assert.fail(Assert.java:93)
	at org.testng.Assert.failNotEquals(Assert.java:512)
	at org.testng.Assert.assertEqualsImpl(Assert.java:134)
	at org.testng.Assert.assertEquals(Assert.java:115)
	at org.testng.Assert.assertEquals(Assert.java:388)
	at org.testng.Assert.assertEquals(Assert.java:398)
	at gluu.scim2.client.corner.SpecialCharsTest.containabilityAny(SpecialCharsTest.java:50)

create(gluu.scim2.client.corner.WrongPayloadUserTest)  Time elapsed: 0.015 sec  <<< FAILURE!
java.lang.AssertionError: expected [201] but found [503]
	at org.testng.Assert.fail(Assert.java:93)
	at org.testng.Assert.failNotEquals(Assert.java:512)
	at org.testng.Assert.assertEqualsImpl(Assert.java:134)
	at org.testng.Assert.assertEquals(Assert.java:115)
	at org.testng.Assert.assertEquals(Assert.java:388)
	at org.testng.Assert.assertEquals(Assert.java:398)
	at gluu.scim2.client.UserBaseTest.createUserFromJson(UserBaseTest.java:22)
	at gluu.scim2.client.corner.WrongPayloadUserTest.create(WrongPayloadUserTest.java:50)

delete(gluu.scim2.client.corner.WrongPayloadUserTest)  Time elapsed: 0 sec  <<< FAILURE!
java.lang.NullPointerException
	at gluu.scim2.client.UserBaseTest.deleteUser(UserBaseTest.java:33)
	at gluu.scim2.client.corner.WrongPayloadUserTest.delete(WrongPayloadUserTest.java:62)


Results :

Failed tests:   init(gluu.scim2.client.servicemeta.ResourceTypesTest): RESTEASY003145: Unable to find a MessageBodyReader of content-type */* and type class org.gluu.oxtrust.model.scim2.ListResponse
  createUser(gluu.scim2.client.singleresource.MinimalUserTest): expected [201] but found [503]
  delete(gluu.scim2.client.singleresource.MinimalUserTest)
  createGroup(gluu.scim2.client.singleresource.MinimalGroupTest): expected [201] but found [503]
  delete(gluu.scim2.client.singleresource.MinimalGroupTest)
  create(gluu.scim2.client.singleresource.AverageUserTest): expected [201] but found [503]
  delete(gluu.scim2.client.singleresource.AverageUserTest)
  createFull(gluu.scim2.client.singleresource.FullUserTest): expected [201] but found [503]
  delete(gluu.scim2.client.singleresource.FullUserTest)
  create(gluu.scim2.client.search.SimpleSearchUserTest): expected [201] but found [503]
  searchAttributesParam(gluu.scim2.client.search.ComplexSearchUserTest): expected [200] but found [503]
  searchExcludedAttributesParam(gluu.scim2.client.search.ComplexSearchUserTest): expected [200] but found [503]
  searchNoAttributesParam(gluu.scim2.client.search.ComplexSearchUserTest): expected [200] but found [503]
  searchSortByExternalId(gluu.scim2.client.search.ComplexSearchUserTest): expected [200] but found [503]
  search1(gluu.scim2.client.search.PaginationUserSearchTest): expected [200] but found [503]
  delete(gluu.scim2.client.search.SimpleSearchUserTest)
  createUsers(gluu.scim2.client.multipleresource.GroupAssignUserTest): expected [201] but found [503]
  multipleRetrieval(gluu.scim2.client.singleresource.QueryParamRetrievalTest): expected [200] but found [503]
  create1(gluu.scim2.client.singleresource.QueryParamCreateUpdateTest): expected [201] but found [503]
  delete1(gluu.scim2.client.singleresource.QueryParamCreateUpdateTest)
  delete(gluu.scim2.client.singleresource.QueryParamCreateUpdateTest)
  searchJson(gluu.scim2.client.search.MultipleResourcesSearchTest): expected [200] but found [503]
  createForReplace(gluu.scim2.client.patch.PatchReplaceUserTest): expected [201] but found [503]
  delete(gluu.scim2.client.patch.PatchReplaceUserTest)
  createForAdd(gluu.scim2.client.patch.PatchAddUserTest): expected [201] but found [503]
  delete(gluu.scim2.client.patch.PatchAddUserTest)
  createForDel(gluu.scim2.client.patch.PatchDeleteUserTest): expected [201] but found [503]
  delete(gluu.scim2.client.patch.PatchDeleteUserTest)
  create(gluu.scim2.client.patch.PatchUserExtTest): expected [201] but found [503]
  delete(gluu.scim2.client.patch.PatchUserExtTest)
  create(gluu.scim2.client.patch.PatchValueFilterUserTest): expected [201] but found [503]
  delete(gluu.scim2.client.patch.PatchValueFilterUserTest)
  createGroup(gluu.scim2.client.patch.PatchGroupTest): expected [201] but found [503]
  delete(gluu.scim2.client.patch.PatchGroupTest)
  bulkJson1(gluu.scim2.client.bulk.UsersBulkTest): expected [200] but found [503]
  bulkJson(gluu.scim2.client.bulk.GroupsBulkTest): expected [200] but found [503]
  delete(gluu.scim2.client.bulk.GroupsBulkTest): expected [200] but found [503]
  createWrongCustAttrs1(gluu.scim2.client.corner.WrongPayloadUserExtTest): expected [400] but found [503]
  createWrongCustAttrs2(gluu.scim2.client.corner.WrongPayloadUserExtTest): expected [400] but found [503]
  createWrongCustAttrs3(gluu.scim2.client.corner.WrongPayloadUserExtTest): expected [400] but found [503]
  createWrongCustAttrs4(gluu.scim2.client.corner.WrongPayloadUserExtTest): expected [400] but found [503]
  createWrongCustAttrs5(gluu.scim2.client.corner.WrongPayloadUserExtTest): expected [400] but found [503]
  createWrongCustAttrs6(gluu.scim2.client.corner.WrongPayloadUserExtTest): expected [400] but found [503]
  queryAndRemoval(gluu.scim2.client.corner.PairwiseIdentifiersTest): expected [200] but found [503]
  containabilityAll(gluu.scim2.client.corner.SpecialCharsTest): expected [200] but found [503]
  containabilityAllInGivenName(gluu.scim2.client.corner.SpecialCharsTest): expected [200] but found [503]
  containabilityAny(gluu.scim2.client.corner.SpecialCharsTest): expected [200] but found [503]
  create(gluu.scim2.client.corner.WrongPayloadUserTest): expected [201] but found [503]
  delete(gluu.scim2.client.corner.WrongPayloadUserTest)

Tests run: 113, Failures: 49, Errors: 0, Skipped: 59

[INFO] ------------------------------------------------------------------------
[INFO] BUILD FAILURE
[INFO] ------------------------------------------------------------------------
[INFO] Total time: 17.727 s
[INFO] Finished at: 2019-10-01T18:34:10+00:00
[INFO] Final Memory: 35M/516M
[INFO] ------------------------------------------------------------------------
[ERROR] Failed to execute goal org.apache.maven.plugins:maven-surefire-plugin:2.12.4:test (default-test) on project scim-client2: There are test failures.
[ERROR] 
[ERROR] Please refer to /home/jenkins/.jenkins/jobs/oxScimClient_4.0_LDAP/workspace/target/surefire-reports for the individual test results.
[ERROR] -> [Help 1]
[ERROR] 
[ERROR] To see the full stack trace of the errors, re-run Maven with the -e switch.
[ERROR] Re-run Maven using the -X switch to enable full debug logging.
[ERROR] 
[ERROR] For more information about the errors and possible solutions, please read the following articles:
[ERROR] [Help 1] http://cwiki.apache.org/confluence/display/MAVEN/MojoFailureException
Build step 'Invoke top-level Maven targets' marked build as failure
[FINDBUGS] Skipping publisher since build result is FAILURE
Publishing Javadoc
No JDK named ‘jdk_1.8.0_121’ found
No JDK named ‘jdk_1.8.0_121’ found
TestNG Reports Processing: START
Looking for TestNG results report in workspace using pattern: **/testng-results.xml
Saving reports...
Processing '/home/jenkins/.jenkins/jobs/oxScimClient_4.0_LDAP/builds/129/testng/testng-results.xml'
43.636364% of tests failed, which exceeded threshold of 0%. Marking build as UNSTABLE
TestNG Reports Processing: FINISH
No JDK named ‘jdk_1.8.0_121’ found
Sending e-mails to: support@gluu.org
Finished: FAILURE