FailedConsole Output

Started by an SCM change
Running as SYSTEM
Building on master in workspace /home/jenkins/.jenkins/jobs/oxScimClient_4.0.0/workspace
No JDK named ‘jdk_1.8.0_121’ found
No credentials specified
No JDK named ‘jdk_1.8.0_121’ found
 > git rev-parse --is-inside-work-tree # timeout=10
Fetching changes from the remote Git repository
 > git config remote.origin.url https://github.com/GluuFederation/SCIM-Client # timeout=10
Fetching upstream changes from https://github.com/GluuFederation/SCIM-Client
 > git --version # timeout=10
 > git fetch --tags --progress https://github.com/GluuFederation/SCIM-Client +refs/heads/*:refs/remotes/origin/*
 > git rev-parse refs/remotes/origin/master^{commit} # timeout=10
 > git rev-parse refs/remotes/origin/origin/master^{commit} # timeout=10
No JDK named ‘jdk_1.8.0_121’ found
Checking out Revision b9542e34747fa86156cf9efeae11a5ad87edcd38 (refs/remotes/origin/master)
 > git config core.sparsecheckout # timeout=10
 > git checkout -f b9542e34747fa86156cf9efeae11a5ad87edcd38
Commit message: "Fix broken cases"
 > git rev-list --no-walk 6a07b25c30126a09983dd22288d82e379eaa6823 # timeout=10
No JDK named ‘jdk_1.8.0_121’ found
[workspace] $ /bin/sh -xe /opt/jetty/temp/jenkins8442182556009953363.sh
+ rm -rf ./oxHudsonProfiles
+ rm -rf ./profiles/ce-dev5.gluu.org
+ git clone github.com:GluuFederation/oxHudsonProfiles.git
Cloning into 'oxHudsonProfiles'...
+ mkdir -p ./profiles
+ cp -rf ./oxHudsonProfiles/scim-client/profiles/ce-dev5.gluu.org/ profiles
+ rm -rf ./oxHudsonProfiles
No JDK named ‘jdk_1.8.0_121’ found
[workspace] $ /home/jenkins/.jenkins/tools/hudson.tasks.Maven_MavenInstallation/maven_3.3.9/bin/mvn -DVERSION_NAME=master -DPROFILE_NAME=ce-dev5.gluu.org -DMAVEN_SKIP_TESTS=false -Dmaven.test.skip=false -Dcfg=ce-dev5.gluu.org clean compile javadoc:javadoc install findbugs:findbugs site
[INFO] Scanning for projects...
[INFO]                                                                         
[INFO] ------------------------------------------------------------------------
[INFO] Building SCIM-Client 4.0.0-SNAPSHOT
[INFO] ------------------------------------------------------------------------
[INFO] 
[INFO] --- maven-clean-plugin:2.5:clean (default-clean) @ scim-client2 ---
[INFO] Deleting /home/jenkins/.jenkins/jobs/oxScimClient_4.0.0/workspace/target
[INFO] 
[INFO] --- maven-resources-plugin:2.6:resources (default-resources) @ scim-client2 ---
[INFO] Using 'UTF-8' encoding to copy filtered resources.
[INFO] Copying 1 resource
[INFO] 
[INFO] --- maven-compiler-plugin:3.1:compile (default-compile) @ scim-client2 ---
[INFO] Changes detected - recompiling the module!
[INFO] Compiling 18 source files to /home/jenkins/.jenkins/jobs/oxScimClient_4.0.0/workspace/target/classes
[WARNING] /home/jenkins/.jenkins/jobs/oxScimClient_4.0.0/workspace/src/main/java/gluu/scim2/client/rest/provider/ListResponseProvider.java: /home/jenkins/.jenkins/jobs/oxScimClient_4.0.0/workspace/src/main/java/gluu/scim2/client/rest/provider/ListResponseProvider.java uses unchecked or unsafe operations.
[WARNING] /home/jenkins/.jenkins/jobs/oxScimClient_4.0.0/workspace/src/main/java/gluu/scim2/client/rest/provider/ListResponseProvider.java: Recompile with -Xlint:unchecked for details.
[INFO] 
[INFO] >>> maven-javadoc-plugin:2.10.4:javadoc (default-cli) > generate-sources @ scim-client2 >>>
[INFO] 
[INFO] <<< maven-javadoc-plugin:2.10.4:javadoc (default-cli) < generate-sources @ scim-client2 <<<
[INFO] 
[INFO] --- maven-javadoc-plugin:2.10.4:javadoc (default-cli) @ scim-client2 ---
[INFO] 
Loading source files for package gluu.scim2.client.exception...
Loading source files for package gluu.scim2.client.factory...
Loading source files for package gluu.scim2.client.rest.provider...
Loading source files for package gluu.scim2.client.rest...
Loading source files for package gluu.scim2.client...
Constructing Javadoc information...
Standard Doclet version 1.8.0_222
Building tree for all the packages and classes...
Generating /home/jenkins/.jenkins/jobs/oxScimClient_4.0.0/workspace/target/site/apidocs/gluu/scim2/client/exception/ScimClientException.html...
Generating /home/jenkins/.jenkins/jobs/oxScimClient_4.0.0/workspace/target/site/apidocs/gluu/scim2/client/exception/ScimInitializationException.html...
Generating /home/jenkins/.jenkins/jobs/oxScimClient_4.0.0/workspace/target/site/apidocs/gluu/scim2/client/factory/ScimClientFactory.html...
Generating /home/jenkins/.jenkins/jobs/oxScimClient_4.0.0/workspace/target/site/apidocs/gluu/scim2/client/rest/provider/AuthorizationInjectionFilter.html...
Generating /home/jenkins/.jenkins/jobs/oxScimClient_4.0.0/workspace/target/site/apidocs/gluu/scim2/client/rest/provider/ListResponseProvider.html...
Generating /home/jenkins/.jenkins/jobs/oxScimClient_4.0.0/workspace/target/site/apidocs/gluu/scim2/client/rest/provider/ScimResourceProvider.html...
Generating /home/jenkins/.jenkins/jobs/oxScimClient_4.0.0/workspace/target/site/apidocs/gluu/scim2/client/rest/ClientSideFido2DeviceService.html...
Generating /home/jenkins/.jenkins/jobs/oxScimClient_4.0.0/workspace/target/site/apidocs/gluu/scim2/client/rest/ClientSideFidoDeviceService.html...
Generating /home/jenkins/.jenkins/jobs/oxScimClient_4.0.0/workspace/target/site/apidocs/gluu/scim2/client/rest/ClientSideGroupService.html...
Generating /home/jenkins/.jenkins/jobs/oxScimClient_4.0.0/workspace/target/site/apidocs/gluu/scim2/client/rest/ClientSideService.html...
Generating /home/jenkins/.jenkins/jobs/oxScimClient_4.0.0/workspace/target/site/apidocs/gluu/scim2/client/rest/ClientSideUserService.html...
Generating /home/jenkins/.jenkins/jobs/oxScimClient_4.0.0/workspace/target/site/apidocs/gluu/scim2/client/rest/CloseableClient.html...
Generating /home/jenkins/.jenkins/jobs/oxScimClient_4.0.0/workspace/target/site/apidocs/gluu/scim2/client/rest/FreelyAccessible.html...
Generating /home/jenkins/.jenkins/jobs/oxScimClient_4.0.0/workspace/target/site/apidocs/gluu/scim2/client/AbstractScimClient.html...
Generating /home/jenkins/.jenkins/jobs/oxScimClient_4.0.0/workspace/target/site/apidocs/gluu/scim2/client/ClientMap.html...
Generating /home/jenkins/.jenkins/jobs/oxScimClient_4.0.0/workspace/target/site/apidocs/gluu/scim2/client/DummyClient.html...
Generating /home/jenkins/.jenkins/jobs/oxScimClient_4.0.0/workspace/target/site/apidocs/gluu/scim2/client/TestModeScimClient.html...
Generating /home/jenkins/.jenkins/jobs/oxScimClient_4.0.0/workspace/target/site/apidocs/gluu/scim2/client/UmaScimClient.html...
Generating /home/jenkins/.jenkins/jobs/oxScimClient_4.0.0/workspace/target/site/apidocs/overview-frame.html...
Generating /home/jenkins/.jenkins/jobs/oxScimClient_4.0.0/workspace/target/site/apidocs/gluu/scim2/client/package-frame.html...
Generating /home/jenkins/.jenkins/jobs/oxScimClient_4.0.0/workspace/target/site/apidocs/gluu/scim2/client/package-summary.html...
Generating /home/jenkins/.jenkins/jobs/oxScimClient_4.0.0/workspace/target/site/apidocs/gluu/scim2/client/package-tree.html...
Generating /home/jenkins/.jenkins/jobs/oxScimClient_4.0.0/workspace/target/site/apidocs/gluu/scim2/client/exception/package-frame.html...
Generating /home/jenkins/.jenkins/jobs/oxScimClient_4.0.0/workspace/target/site/apidocs/gluu/scim2/client/exception/package-summary.html...
Generating /home/jenkins/.jenkins/jobs/oxScimClient_4.0.0/workspace/target/site/apidocs/gluu/scim2/client/exception/package-tree.html...
Generating /home/jenkins/.jenkins/jobs/oxScimClient_4.0.0/workspace/target/site/apidocs/gluu/scim2/client/factory/package-frame.html...
Generating /home/jenkins/.jenkins/jobs/oxScimClient_4.0.0/workspace/target/site/apidocs/gluu/scim2/client/factory/package-summary.html...
Generating /home/jenkins/.jenkins/jobs/oxScimClient_4.0.0/workspace/target/site/apidocs/gluu/scim2/client/factory/package-tree.html...
Generating /home/jenkins/.jenkins/jobs/oxScimClient_4.0.0/workspace/target/site/apidocs/gluu/scim2/client/rest/package-frame.html...
Generating /home/jenkins/.jenkins/jobs/oxScimClient_4.0.0/workspace/target/site/apidocs/gluu/scim2/client/rest/package-summary.html...
Generating /home/jenkins/.jenkins/jobs/oxScimClient_4.0.0/workspace/target/site/apidocs/gluu/scim2/client/rest/package-tree.html...
Generating /home/jenkins/.jenkins/jobs/oxScimClient_4.0.0/workspace/target/site/apidocs/gluu/scim2/client/rest/provider/package-frame.html...
Generating /home/jenkins/.jenkins/jobs/oxScimClient_4.0.0/workspace/target/site/apidocs/gluu/scim2/client/rest/provider/package-summary.html...
Generating /home/jenkins/.jenkins/jobs/oxScimClient_4.0.0/workspace/target/site/apidocs/gluu/scim2/client/rest/provider/package-tree.html...
Generating /home/jenkins/.jenkins/jobs/oxScimClient_4.0.0/workspace/target/site/apidocs/constant-values.html...
Generating /home/jenkins/.jenkins/jobs/oxScimClient_4.0.0/workspace/target/site/apidocs/serialized-form.html...
Generating /home/jenkins/.jenkins/jobs/oxScimClient_4.0.0/workspace/target/site/apidocs/gluu/scim2/client/exception/class-use/ScimInitializationException.html...
Generating /home/jenkins/.jenkins/jobs/oxScimClient_4.0.0/workspace/target/site/apidocs/gluu/scim2/client/exception/class-use/ScimClientException.html...
Generating /home/jenkins/.jenkins/jobs/oxScimClient_4.0.0/workspace/target/site/apidocs/gluu/scim2/client/factory/class-use/ScimClientFactory.html...
Generating /home/jenkins/.jenkins/jobs/oxScimClient_4.0.0/workspace/target/site/apidocs/gluu/scim2/client/rest/provider/class-use/ScimResourceProvider.html...
Generating /home/jenkins/.jenkins/jobs/oxScimClient_4.0.0/workspace/target/site/apidocs/gluu/scim2/client/rest/provider/class-use/ListResponseProvider.html...
Generating /home/jenkins/.jenkins/jobs/oxScimClient_4.0.0/workspace/target/site/apidocs/gluu/scim2/client/rest/provider/class-use/AuthorizationInjectionFilter.html...
Generating /home/jenkins/.jenkins/jobs/oxScimClient_4.0.0/workspace/target/site/apidocs/gluu/scim2/client/rest/class-use/FreelyAccessible.html...
Generating /home/jenkins/.jenkins/jobs/oxScimClient_4.0.0/workspace/target/site/apidocs/gluu/scim2/client/rest/class-use/CloseableClient.html...
Generating /home/jenkins/.jenkins/jobs/oxScimClient_4.0.0/workspace/target/site/apidocs/gluu/scim2/client/rest/class-use/ClientSideUserService.html...
Generating /home/jenkins/.jenkins/jobs/oxScimClient_4.0.0/workspace/target/site/apidocs/gluu/scim2/client/rest/class-use/ClientSideService.html...
Generating /home/jenkins/.jenkins/jobs/oxScimClient_4.0.0/workspace/target/site/apidocs/gluu/scim2/client/rest/class-use/ClientSideGroupService.html...
Generating /home/jenkins/.jenkins/jobs/oxScimClient_4.0.0/workspace/target/site/apidocs/gluu/scim2/client/rest/class-use/ClientSideFidoDeviceService.html...
Generating /home/jenkins/.jenkins/jobs/oxScimClient_4.0.0/workspace/target/site/apidocs/gluu/scim2/client/rest/class-use/ClientSideFido2DeviceService.html...
Generating /home/jenkins/.jenkins/jobs/oxScimClient_4.0.0/workspace/target/site/apidocs/gluu/scim2/client/class-use/UmaScimClient.html...
Generating /home/jenkins/.jenkins/jobs/oxScimClient_4.0.0/workspace/target/site/apidocs/gluu/scim2/client/class-use/TestModeScimClient.html...
Generating /home/jenkins/.jenkins/jobs/oxScimClient_4.0.0/workspace/target/site/apidocs/gluu/scim2/client/class-use/DummyClient.html...
Generating /home/jenkins/.jenkins/jobs/oxScimClient_4.0.0/workspace/target/site/apidocs/gluu/scim2/client/class-use/ClientMap.html...
Generating /home/jenkins/.jenkins/jobs/oxScimClient_4.0.0/workspace/target/site/apidocs/gluu/scim2/client/class-use/AbstractScimClient.html...
Generating /home/jenkins/.jenkins/jobs/oxScimClient_4.0.0/workspace/target/site/apidocs/gluu/scim2/client/package-use.html...
Generating /home/jenkins/.jenkins/jobs/oxScimClient_4.0.0/workspace/target/site/apidocs/gluu/scim2/client/exception/package-use.html...
Generating /home/jenkins/.jenkins/jobs/oxScimClient_4.0.0/workspace/target/site/apidocs/gluu/scim2/client/factory/package-use.html...
Generating /home/jenkins/.jenkins/jobs/oxScimClient_4.0.0/workspace/target/site/apidocs/gluu/scim2/client/rest/package-use.html...
Generating /home/jenkins/.jenkins/jobs/oxScimClient_4.0.0/workspace/target/site/apidocs/gluu/scim2/client/rest/provider/package-use.html...
Building index for all the packages and classes...
Generating /home/jenkins/.jenkins/jobs/oxScimClient_4.0.0/workspace/target/site/apidocs/overview-tree.html...
Generating /home/jenkins/.jenkins/jobs/oxScimClient_4.0.0/workspace/target/site/apidocs/index-all.html...
Generating /home/jenkins/.jenkins/jobs/oxScimClient_4.0.0/workspace/target/site/apidocs/deprecated-list.html...
Building index for all classes...
Generating /home/jenkins/.jenkins/jobs/oxScimClient_4.0.0/workspace/target/site/apidocs/allclasses-frame.html...
Generating /home/jenkins/.jenkins/jobs/oxScimClient_4.0.0/workspace/target/site/apidocs/allclasses-noframe.html...
Generating /home/jenkins/.jenkins/jobs/oxScimClient_4.0.0/workspace/target/site/apidocs/index.html...
Generating /home/jenkins/.jenkins/jobs/oxScimClient_4.0.0/workspace/target/site/apidocs/overview-summary.html...
Generating /home/jenkins/.jenkins/jobs/oxScimClient_4.0.0/workspace/target/site/apidocs/help-doc.html...
[INFO] 
[INFO] --- maven-resources-plugin:2.6:resources (default-resources) @ scim-client2 ---
[INFO] Using 'UTF-8' encoding to copy filtered resources.
[INFO] Copying 1 resource
[INFO] 
[INFO] --- maven-compiler-plugin:3.1:compile (default-compile) @ scim-client2 ---
[INFO] Nothing to compile - all classes are up to date
[INFO] 
[INFO] --- maven-resources-plugin:2.6:testResources (default-testResources) @ scim-client2 ---
[INFO] Using 'UTF-8' encoding to copy filtered resources.
[INFO] Copying 35 resources
[INFO] 
[INFO] --- maven-compiler-plugin:3.1:testCompile (default-testCompile) @ scim-client2 ---
[INFO] Changes detected - recompiling the module!
[INFO] Compiling 32 source files to /home/jenkins/.jenkins/jobs/oxScimClient_4.0.0/workspace/target/test-classes
[INFO] 
[INFO] --- maven-surefire-plugin:2.12.4:test (default-test) @ scim-client2 ---
[INFO] Surefire report directory: /home/jenkins/.jenkins/jobs/oxScimClient_4.0.0/workspace/target/surefire-reports

-------------------------------------------------------
 T E S T S
-------------------------------------------------------
Running TestSuite
14:02:35 INFO  BaseTest.java:43 - Invoked initTestSuite of 'Corner and other weird cases'
14:02:36 INFO  BaseTest.java:71 - Initializing client...
14:02:38 INFO  SchemasTest.java:71 - Found User Schema Extension: GluuUserCustomExtension
14:02:38 INFO  SchemasTest.java:78 - scimCustomFirst found
14:02:38 INFO  SchemasTest.java:84 - scimCustomSecond found
14:02:38 INFO  SchemasTest.java:90 - scimCustomThird found
14:02:38 DEBUG MinimalUserTest.java:29 - Creating mimimal user from json...
14:02:41 DEBUG UserBaseTest.java:26 - User created with id 920e9f56-671f-4bb3-8361-a172e1559576
14:02:41 DEBUG MinimalUserTest.java:37 - Updating user scim_test_bjensen_1 with json
14:02:41 DEBUG MinimalUserTest.java:44 - Updated user Barbara
14:02:41 DEBUG UserBaseTest.java:33 - Deleting user bjensen_1
14:02:41 DEBUG UserBaseTest.java:36 - deleted
14:02:41 DEBUG MinimalGroupTest.java:31 - Creating mimimal group from json...
14:02:41 DEBUG MinimalGroupTest.java:37 - Group created with id 8bfce642-4c22-48e8-9209-bd55c92f17a3
14:02:41 DEBUG MinimalGroupTest.java:45 - Updating group scim_test_worldowners with json
14:02:41 DEBUG MinimalGroupTest.java:52 - Updated group scim_test_worldmanagers
14:02:41 DEBUG MinimalGroupTest.java:59 - Deleting group scim_test_worldowners
14:02:41 DEBUG MinimalGroupTest.java:62 - deleted
14:02:41 DEBUG AverageUserTest.java:36 - Creating user from json...
14:02:42 DEBUG UserBaseTest.java:26 - User created with id 991f6aa4-bf3e-42ff-a829-3b9029631f57
14:02:42 DEBUG AverageUserTest.java:44 - Updating user scim_test_bjensen_1 with json
14:02:42 DEBUG AverageUserTest.java:57 - Updated user Barbara
14:02:42 DEBUG AverageUserTest.java:74 - Updating user scim_test_bjensen_1
14:02:42 DEBUG AverageUserTest.java:86 - Updated user Barbara
14:02:42 DEBUG AverageUserTest.java:120 - Updated user scim_test_bjensen_1
14:02:42 DEBUG UserBaseTest.java:33 - Deleting user scim_test_bjensen_1
14:02:42 DEBUG UserBaseTest.java:36 - deleted
14:02:42 DEBUG FullUserTest.java:36 - Creating user from json...
14:02:42 DEBUG UserBaseTest.java:26 - User created with id 8a3f6502-32a3-43e4-9df9-925c6cbb8554
14:02:43 DEBUG FullUserTest.java:54 - Updating user scim_test_bjensen_1 with json
14:02:43 DEBUG UserBaseTest.java:33 - Deleting user null
14:02:43 DEBUG UserBaseTest.java:36 - deleted
14:02:43 DEBUG SimpleSearchUserTest.java:33 - Creating user from json...
14:02:43 DEBUG UserBaseTest.java:26 - User created with id 5a172fdb-c6f2-4fe9-a0fc-bf167672f901
14:02:43 DEBUG ComplexSearchUserTest.java:68 - Searching at most 3 users using POST verb
14:02:43 DEBUG ComplexSearchUserTest.java:69 - Sorted by family name descending
14:02:43 DEBUG ComplexSearchUserTest.java:70 - Retrieving only the attributes [name.familyName, active]
14:02:44 DEBUG ComplexSearchUserTest.java:140 - Searching at most 3 users using POST verb
14:02:44 DEBUG ComplexSearchUserTest.java:141 - Sorted by displayName ascending
14:02:44 DEBUG ComplexSearchUserTest.java:142 - Excluding the attributes [x509Certificates, entitlements, roles, ims, phoneNumbers, addresses, emails, groups]
14:02:44 DEBUG ComplexSearchUserTest.java:39 - Searching users with attribute nickName existent or ims.value=Skype using POST verb
14:02:44 DEBUG SimpleSearchUserTest.java:61 - Searching user with attribute givenName = Barbara using POST verb
14:02:44 DEBUG SimpleSearchUserTest.java:82 - Searching user with attribute emails.value like gluu.org or phone numbers with type unassigned or value containing '+' using POST verb
14:02:45 DEBUG SimpleSearchUserTest.java:110 - Calculating the total number of users
14:02:45 DEBUG SimpleSearchUserTest.java:119 - There are 23 users!
14:02:45 DEBUG SimpleSearchUserTest.java:42 - Searching user with attribute locale = es_ES and created date >= 2019-08-09T14:02:43.957Z using GET verb
14:02:45 DEBUG UserBaseTest.java:33 - Deleting user scim_test_bjensen_1
14:02:45 DEBUG UserBaseTest.java:36 - deleted
14:02:46 INFO  GroupAssignUserTest.java:40 - Creating 3 users...
14:02:46 INFO  GroupAssignUserTest.java:66 - Assigning users to new group...
14:02:46 INFO  GroupAssignUserTest.java:90 - Creating a secondary group...
14:02:46 INFO  GroupAssignUserTest.java:112 - Issuing query with filter: id eq "3f9abc59-b2fd-4619-b3ce-2b70ba79e737" or id eq "1dcb1c66-e387-4b4c-8eaa-62aa5cf864c2" or id eq "77ecec3e-1407-4398-9bb8-a022796a4e11"
14:02:46 INFO  GroupAssignUserTest.java:116 - Verifying groups and users consistency...
14:02:46 INFO  GroupAssignUserTest.java:143 - Attempting to modify group membership using /Users endpoint...
14:02:47 INFO  GroupAssignUserTest.java:163 - Removing one and adding one member...
14:02:47 INFO  GroupAssignUserTest.java:172 - Group has correct members
14:02:47 INFO  GroupAssignUserTest.java:186 - Users have correct memberships
14:02:47 INFO  GroupAssignUserTest.java:199 - Group '3 best demented buddies' removed
14:02:47 INFO  GroupAssignUserTest.java:199 - Group 'Auxiliary asylum' removed
14:02:47 INFO  GroupAssignUserTest.java:214 - User 'test-0.6454042782602979' removed
14:02:47 INFO  GroupAssignUserTest.java:214 - User 'test-0.26618719258331003' removed
14:02:47 INFO  GroupAssignUserTest.java:214 - User 'test-0.7469086634945373' removed
14:02:47 DEBUG QueryParamRetrievalTest.java:34 - Retrieving test users...
14:02:48 DEBUG QueryParamRetrievalTest.java:54 - Retrieving test users...
14:02:48 DEBUG QueryParamCreateUpdateTest.java:38 - Creating user from json...
14:02:48 DEBUG UserBaseTest.java:33 - Deleting user scim_test_bjensen_1
14:02:48 DEBUG UserBaseTest.java:36 - deleted
14:02:48 DEBUG QueryParamCreateUpdateTest.java:59 - Creating user from json...
14:02:48 DEBUG UserBaseTest.java:33 - Deleting user null
14:02:49 DEBUG UserBaseTest.java:36 - deleted
14:02:50 DEBUG PatchReplaceUserTest.java:39 - Creating user from json...
14:02:50 DEBUG UserBaseTest.java:26 - User created with id f5e1c47f-0a45-4529-8e15-506e2d39a7fc
14:02:50 DEBUG UserBaseTest.java:33 - Deleting user scim_test_bjensen_1
14:02:51 DEBUG UserBaseTest.java:36 - deleted
14:02:51 DEBUG PatchAddUserTest.java:30 - Creating user from json...
14:02:51 DEBUG UserBaseTest.java:26 - User created with id 7ebf407b-e893-4b53-83dc-6278b6c72e1f
14:02:51 DEBUG UserBaseTest.java:33 - Deleting user scim_test_bjensen_1
14:02:51 DEBUG UserBaseTest.java:36 - deleted
14:02:51 DEBUG PatchDeleteUserTest.java:30 - Creating user from json...
14:02:51 DEBUG UserBaseTest.java:26 - User created with id f0fd2274-17d3-4cd3-a970-2ad4bfb0755a
14:02:51 DEBUG UserBaseTest.java:33 - Deleting user scim_test_bjensen_1
14:02:51 DEBUG UserBaseTest.java:36 - deleted
14:02:51 DEBUG PatchUserExtTest.java:40 - Creating user from json...
14:02:51 DEBUG UserBaseTest.java:26 - User created with id 7b0a4e7a-e48b-4304-af71-f980023ec2a9
14:02:52 DEBUG UserBaseTest.java:33 - Deleting user scim_test_bjensen_1
14:02:52 DEBUG UserBaseTest.java:36 - deleted
14:02:52 DEBUG PatchValueFilterUserTest.java:41 - User created with id da21fd7b-9285-4959-9a07-5b4c15fd0358
14:02:52 DEBUG UserBaseTest.java:33 - Deleting user 1565359372291
14:02:52 DEBUG UserBaseTest.java:36 - deleted
14:02:52 DEBUG PatchGroupTest.java:47 - Creating group from json...
14:02:53 INFO  UsersBulkTest.java:35 - Sending a bulk with POST, PUT, and PATCH operations...
14:02:54 INFO  UsersBulkTest.java:49 - User id is e2703492-3854-46a6-bce5-02b289321f0e
14:02:54 INFO  UsersBulkTest.java:56 - Sending a bulk with one DELETE...
14:02:54 INFO  UsersBulkTest.java:80 - Sending a bulk with POSTs and DELETEs operations...
14:02:54 INFO  GroupsBulkTest.java:40 - Creating one user and one group using bulk json string
14:02:54 INFO  GroupsBulkTest.java:53 - User id is bf8f9b17-90fb-4c9b-b055-380aa9c20e0a
14:02:54 INFO  GroupsBulkTest.java:59 - Group id is 7fe84c6c-4f45-458f-8cd5-da5fe543a80c
14:02:54 INFO  GroupsBulkTest.java:66 - Sending a bulk with a patch to insert admin user into group
14:02:54 INFO  GroupsBulkTest.java:98 - Cleaning...
14:02:56 DEBUG WrongPayloadUserTest.java:49 - Creating mimimal user from json...
14:02:56 DEBUG UserBaseTest.java:26 - User created with id b66ed0f0-dfa4-4c29-9f95-02832aee23ff
14:02:56 INFO  SpecialCharsTest.java:117 - User Dddd 1111 found with userName dddd1111 *char
14:02:56 INFO  SpecialCharsTest.java:117 - User Dddd 2222 found with userName dddd2222 * \ (char
14:02:56 INFO  SpecialCharsTest.java:117 - User Dddd 3333 found with userName dddd3333 * \ (char) /
14:02:56 DEBUG UserBaseTest.java:33 - Deleting user scim_test_bjensen_1
14:02:56 DEBUG UserBaseTest.java:36 - deleted
14:02:56 INFO  AbstractScimClient.java:126 - Closing RestEasy client
Tests run: 110, Failures: 1, Errors: 0, Skipped: 0, Time elapsed: 24.017 sec <<< FAILURE!
containabilityAllInGivenName(gluu.scim2.client.corner.SpecialCharsTest)  Time elapsed: 0.082 sec  <<< FAILURE!
java.lang.NullPointerException
	at gluu.scim2.client.corner.SpecialCharsTest.containabilityAllInGivenName(SpecialCharsTest.java:96)


Results :

Failed tests:   containabilityAllInGivenName(gluu.scim2.client.corner.SpecialCharsTest)

Tests run: 110, Failures: 1, Errors: 0, Skipped: 0

[INFO] ------------------------------------------------------------------------
[INFO] BUILD FAILURE
[INFO] ------------------------------------------------------------------------
[INFO] Total time: 40.739 s
[INFO] Finished at: 2019-08-09T14:02:56+00:00
[INFO] Final Memory: 33M/354M
[INFO] ------------------------------------------------------------------------
[ERROR] Failed to execute goal org.apache.maven.plugins:maven-surefire-plugin:2.12.4:test (default-test) on project scim-client2: There are test failures.
[ERROR] 
[ERROR] Please refer to /home/jenkins/.jenkins/jobs/oxScimClient_4.0.0/workspace/target/surefire-reports for the individual test results.
[ERROR] -> [Help 1]
[ERROR] 
[ERROR] To see the full stack trace of the errors, re-run Maven with the -e switch.
[ERROR] Re-run Maven using the -X switch to enable full debug logging.
[ERROR] 
[ERROR] For more information about the errors and possible solutions, please read the following articles:
[ERROR] [Help 1] http://cwiki.apache.org/confluence/display/MAVEN/MojoFailureException
Build step 'Invoke top-level Maven targets' marked build as failure
[FINDBUGS] Skipping publisher since build result is FAILURE
Publishing Javadoc
No JDK named ‘jdk_1.8.0_121’ found
No JDK named ‘jdk_1.8.0_121’ found
TestNG Reports Processing: START
Looking for TestNG results report in workspace using pattern: **/testng-results.xml
Saving reports...
Processing '/home/jenkins/.jenkins/jobs/oxScimClient_4.0.0/builds/100/testng/testng-results.xml'
0.909091% of tests failed, which exceeded threshold of 0%. Marking build as UNSTABLE
TestNG Reports Processing: FINISH
No JDK named ‘jdk_1.8.0_121’ found
Not sending mail to unregistered user bonustrack310@gmail.com
Sending e-mails to: support@gluu.org
Finished: FAILURE