FailedConsole Output

Started by an SCM change
Building on master in workspace /home/tomcat/.jenkins/jobs/oxScimClient_3.1.6/workspace
No credentials specified
 > git rev-parse --is-inside-work-tree # timeout=10
Fetching changes from the remote Git repository
 > git config remote.origin.url https://github.com/GluuFederation/SCIM-Client # timeout=10
Fetching upstream changes from https://github.com/GluuFederation/SCIM-Client
 > git --version # timeout=10
 > git fetch --tags --progress https://github.com/GluuFederation/SCIM-Client +refs/heads/*:refs/remotes/origin/*
 > git rev-parse refs/remotes/origin/version_3.1.6.sp1^{commit} # timeout=10
 > git rev-parse refs/remotes/origin/origin/version_3.1.6.sp1^{commit} # timeout=10
Checking out Revision 420461c9364fa9295a38fb8e4da7203e4f0824ef (refs/remotes/origin/version_3.1.6.sp1)
 > git config core.sparsecheckout # timeout=10
 > git checkout -f 420461c9364fa9295a38fb8e4da7203e4f0824ef
Commit message: "Final 3.1.6.sp1 code"
First time build. Skipping changelog.
[workspace] $ /bin/sh -xe /opt/tomcat/temp/jenkins8406720202696725171.sh
+ rm -rf ./oxHudsonProfiles
+ rm -rf ./scim-client/profiles/ce-dev3
+ rm -rf ./scim-client2/profiles/ce-dev3
+ git clone github.com:GluuFederation/oxHudsonProfiles.git
Cloning into 'oxHudsonProfiles'...
+ mkdir -p ./scim-client/profiles
+ mkdir -p ./scim-client2/profiles
+ cp -rf ./oxHudsonProfiles/scim-client/profiles/ce-dev3/ scim-client/profiles
+ cp -rf ./oxHudsonProfiles/scim-client/profiles/ce-dev3/ scim-client2/profiles
+ rm -rf ./oxHudsonProfiles
[workspace] $ /home/tomcat/.jenkins/tools/hudson.tasks.Maven_MavenInstallation/maven_3.3.9/bin/mvn -DVERSION_NAME=version_3.1.6.sp1 -DPROFILE_NAME=ce-dev3 -DMAVEN_SKIP_TESTS=false -Dmaven.test.skip=false -Dcfg=ce-dev3 clean compile javadoc:javadoc install findbugs:findbugs site
[INFO] Scanning for projects...
[INFO] ------------------------------------------------------------------------
[INFO] Reactor Build Order:
[INFO] 
[INFO] oxScim
[INFO] SCIM-Client (deprecated)
[INFO] SCIM-Client
[INFO]                                                                         
[INFO] ------------------------------------------------------------------------
[INFO] Building oxScim 3.1.6.sp1
[INFO] ------------------------------------------------------------------------
[INFO] 
[INFO] --- maven-clean-plugin:2.4.1:clean (default-clean) @ oxscim ---
[INFO] Deleting /home/tomcat/.jenkins/jobs/oxScimClient_3.1.6/workspace/target
[INFO] 
[INFO] >>> maven-javadoc-plugin:3.0.1:javadoc (default-cli) > generate-sources @ oxscim >>>
[INFO] 
[INFO] <<< maven-javadoc-plugin:3.0.1:javadoc (default-cli) < generate-sources @ oxscim <<<
[INFO] 
[INFO] --- maven-javadoc-plugin:3.0.1:javadoc (default-cli) @ oxscim ---
[INFO] 
[INFO] --- maven-install-plugin:2.3.1:install (default-install) @ oxscim ---
[INFO] Installing /home/tomcat/.jenkins/jobs/oxScimClient_3.1.6/workspace/pom.xml to /var/www/html/maven/org/xdi/oxscim/3.1.6.sp1/oxscim-3.1.6.sp1.pom
[INFO] 
[INFO] --- findbugs-maven-plugin:3.0.4:findbugs (default-cli) @ oxscim ---
[INFO] 
[INFO] --- maven-site-plugin:2.1.1:site (default-site) @ oxscim ---
[INFO]                                                                         
[INFO] ------------------------------------------------------------------------
[INFO] Building SCIM-Client (deprecated) 3.1.6.sp1
[INFO] ------------------------------------------------------------------------
[WARNING] The POM for org.xdi:oxcore-model:jar:3.1.6.sp1 is missing, no dependency information available
[INFO] ------------------------------------------------------------------------
[INFO] Reactor Summary:
[INFO] 
[INFO] oxScim ............................................. SUCCESS [  6.479 s]
[INFO] SCIM-Client (deprecated) ........................... FAILURE [  1.814 s]
[INFO] SCIM-Client ........................................ SKIPPED
[INFO] ------------------------------------------------------------------------
[INFO] BUILD FAILURE
[INFO] ------------------------------------------------------------------------
[INFO] Total time: 9.610 s
[INFO] Finished at: 2019-05-07T07:40:29-04:00
[INFO] Final Memory: 33M/288M
[INFO] ------------------------------------------------------------------------
[ERROR] Failed to execute goal on project SCIM-Client: Could not resolve dependencies for project gluu.scim.client:SCIM-Client:jar:3.1.6.sp1: Failure to find org.xdi:oxcore-model:jar:3.1.6.sp1 in http://repo1.maven.org/maven2 was cached in the local repository, resolution will not be reattempted until the update interval of central has elapsed or updates are forced -> [Help 1]
[ERROR] 
[ERROR] To see the full stack trace of the errors, re-run Maven with the -e switch.
[ERROR] Re-run Maven using the -X switch to enable full debug logging.
[ERROR] 
[ERROR] For more information about the errors and possible solutions, please read the following articles:
[ERROR] [Help 1] http://cwiki.apache.org/confluence/display/MAVEN/DependencyResolutionException
[ERROR] 
[ERROR] After correcting the problems, you can resume the build with the command
[ERROR]   mvn <goals> -rf :SCIM-Client
Build step 'Invoke top-level Maven targets' marked build as failure
[FINDBUGS] Skipping publisher since build result is FAILURE
Publishing Javadoc
TestNG Reports Processing: START
Looking for TestNG results report in workspace using pattern: **/testng-results.xml
testng-results.xml was last modified before this build started. Ignoring it.
testng-results.xml was last modified before this build started. Ignoring it.
Saving reports...
Found matching files but did not find any TestNG results.
Sending e-mails to: support@gluu.org
Finished: FAILURE