FailedConsole Output

Skipping 44 KB.. Full Log
XTQjfI46q1+8hvn1p2IAAAAYB+LCAAAAAAAAP9b85aBtbiIQSmjNKU4P0+vJLE4u1gvPjexLDVPzxdEGvvmZ+X75ZekLlOVfvTjc8FPJgaGiiIGKaiG5Py84vycVD1nCA1SyAABjCCFBQCV27OjYAAAAA==[INFO] --- maven-surefire-plugin:2.12.4:test (default-test) @ gluu-orm-filter ---
[INFO] No tests to run.
[INFO] 
[INFO] --- maven-jar-plugin:2.4:jar (default-jar) @ gluu-orm-filter ---
[INFO] Building jar: /home/jenkins/.jenkins/jobs/oxOrm/workspace/filter/target/gluu-orm-filter-4.3.0-SNAPSHOT.jar
[INFO] 
[INFO] --- maven-install-plugin:2.4:install (default-install) @ gluu-orm-filter ---
[INFO] Installing /home/jenkins/.jenkins/jobs/oxOrm/workspace/filter/target/gluu-orm-filter-4.3.0-SNAPSHOT.jar to /var/www/html/maven/org/gluu/gluu-orm-filter/4.3.0-SNAPSHOT/gluu-orm-filter-4.3.0-SNAPSHOT.jar
[INFO] Installing /home/jenkins/.jenkins/jobs/oxOrm/workspace/filter/pom.xml to /var/www/html/maven/org/gluu/gluu-orm-filter/4.3.0-SNAPSHOT/gluu-orm-filter-4.3.0-SNAPSHOT.pom
[INFO] 
[INFO] >>> maven-javadoc-plugin:3.0.1:javadoc (default-cli) > generate-sources @ gluu-orm-filter >>>
[INFO] 
[INFO] <<< maven-javadoc-plugin:3.0.1:javadoc (default-cli) < generate-sources @ gluu-orm-filter <<<
[INFO] 
[INFO] 
[INFO] --- maven-javadoc-plugin:3.0.1:javadoc (default-cli) @ gluu-orm-filter ---
[INFO] 
Loading source files for package org.gluu.search.filter...
Constructing Javadoc information...
Standard Doclet version 11.0.7
Building tree for all the packages and classes...
Generating /home/jenkins/.jenkins/jobs/oxOrm/workspace/filter/target/site/apidocs/org/gluu/search/filter/Filter.html...
Generating /home/jenkins/.jenkins/jobs/oxOrm/workspace/filter/target/site/apidocs/org/gluu/search/filter/FilterProcessor.html...
Generating /home/jenkins/.jenkins/jobs/oxOrm/workspace/filter/target/site/apidocs/org/gluu/search/filter/FilterType.html...
Generating /home/jenkins/.jenkins/jobs/oxOrm/workspace/filter/target/site/apidocs/org/gluu/search/filter/package-summary.html...
Generating /home/jenkins/.jenkins/jobs/oxOrm/workspace/filter/target/site/apidocs/org/gluu/search/filter/package-tree.html...
Generating /home/jenkins/.jenkins/jobs/oxOrm/workspace/filter/target/site/apidocs/constant-values.html...
Generating /home/jenkins/.jenkins/jobs/oxOrm/workspace/filter/target/site/apidocs/org/gluu/search/filter/class-use/Filter.html...
Generating /home/jenkins/.jenkins/jobs/oxOrm/workspace/filter/target/site/apidocs/org/gluu/search/filter/class-use/FilterProcessor.html...
Generating /home/jenkins/.jenkins/jobs/oxOrm/workspace/filter/target/site/apidocs/org/gluu/search/filter/class-use/FilterType.html...
Generating /home/jenkins/.jenkins/jobs/oxOrm/workspace/filter/target/site/apidocs/org/gluu/search/filter/package-use.html...
Building index for all the packages and classes...
Generating /home/jenkins/.jenkins/jobs/oxOrm/workspace/filter/target/site/apidocs/overview-tree.html...
Generating /home/jenkins/.jenkins/jobs/oxOrm/workspace/filter/target/site/apidocs/index-all.html...
Building index for all classes...
Generating /home/jenkins/.jenkins/jobs/oxOrm/workspace/filter/target/site/apidocs/allclasses-index.html...
Generating /home/jenkins/.jenkins/jobs/oxOrm/workspace/filter/target/site/apidocs/allpackages-index.html...
Generating /home/jenkins/.jenkins/jobs/oxOrm/workspace/filter/target/site/apidocs/deprecated-list.html...
Building index for all classes...
Generating /home/jenkins/.jenkins/jobs/oxOrm/workspace/filter/target/site/apidocs/allclasses.html...
Generating /home/jenkins/.jenkins/jobs/oxOrm/workspace/filter/target/site/apidocs/allclasses.html...
Generating /home/jenkins/.jenkins/jobs/oxOrm/workspace/filter/target/site/apidocs/index.html...
Generating /home/jenkins/.jenkins/jobs/oxOrm/workspace/filter/target/site/apidocs/help-doc.html...
1 error
[ERROR] Error while creating javadoc report: 
Exit code: 1 - javadoc: error - The code being documented uses modules but the packages defined in https://docs.oracle.com/javase/8/docs/api/ are in the unnamed module.

Command line was: /opt/java/amazon-corretto-11.0.7.10.1-linux-x64/bin/javadoc @options @packages

Refer to the generated Javadoc files in '/home/jenkins/.jenkins/jobs/oxOrm/workspace/filter/target/site/apidocs' dir.

org.apache.maven.reporting.MavenReportException: 
Exit code: 1 - javadoc: error - The code being documented uses modules but the packages defined in https://docs.oracle.com/javase/8/docs/api/ are in the unnamed module.

Command line was: /opt/java/amazon-corretto-11.0.7.10.1-linux-x64/bin/javadoc @options @packages

Refer to the generated Javadoc files in '/home/jenkins/.jenkins/jobs/oxOrm/workspace/filter/target/site/apidocs' dir.

    at org.apache.maven.plugins.javadoc.AbstractJavadocMojo.executeJavadocCommandLine (AbstractJavadocMojo.java:5298)
    at org.apache.maven.plugins.javadoc.AbstractJavadocMojo.executeReport (AbstractJavadocMojo.java:2134)
    at org.apache.maven.plugins.javadoc.JavadocReport.generate (JavadocReport.java:134)
    at org.apache.maven.plugins.javadoc.JavadocReport.doExecute (JavadocReport.java:329)
    at org.apache.maven.plugins.javadoc.AbstractJavadocMojo.execute (AbstractJavadocMojo.java:1912)
    at org.apache.maven.plugin.DefaultBuildPluginManager.executeMojo (DefaultBuildPluginManager.java:137)
    at org.apache.maven.lifecycle.internal.MojoExecutor.execute (MojoExecutor.java:210)
    at org.apache.maven.lifecycle.internal.MojoExecutor.execute (MojoExecutor.java:156)
    at org.apache.maven.lifecycle.internal.MojoExecutor.execute (MojoExecutor.java:148)
    at org.apache.maven.lifecycle.internal.LifecycleModuleBuilder.buildProject (LifecycleModuleBuilder.java:117)
    at org.apache.maven.lifecycle.internal.LifecycleModuleBuilder.buildProject (LifecycleModuleBuilder.java:81)
    at org.apache.maven.lifecycle.internal.builder.singlethreaded.SingleThreadedBuilder.build (SingleThreadedBuilder.java:56)
    at org.apache.maven.lifecycle.internal.LifecycleStarter.execute (LifecycleStarter.java:128)
    at org.apache.maven.DefaultMaven.doExecute (DefaultMaven.java:305)
    at org.apache.maven.DefaultMaven.doExecute (DefaultMaven.java:192)
    at org.apache.maven.DefaultMaven.execute (DefaultMaven.java:105)
    at org.apache.maven.cli.MavenCli.execute (MavenCli.java:957)
    at org.apache.maven.cli.MavenCli.doMain (MavenCli.java:289)
    at org.apache.maven.cli.MavenCli.main (MavenCli.java:193)
    at jdk.internal.reflect.NativeMethodAccessorImpl.invoke0 (Native Method)
    at jdk.internal.reflect.NativeMethodAccessorImpl.invoke (NativeMethodAccessorImpl.java:62)
    at jdk.internal.reflect.DelegatingMethodAccessorImpl.invoke (DelegatingMethodAccessorImpl.java:43)
    at java.lang.reflect.Method.invoke (Method.java:566)
    at org.codehaus.plexus.classworlds.launcher.Launcher.launchEnhanced (Launcher.java:282)
    at org.codehaus.plexus.classworlds.launcher.Launcher.launch (Launcher.java:225)
    at org.codehaus.plexus.classworlds.launcher.Launcher.mainWithExitCode (Launcher.java:406)
    at org.codehaus.plexus.classworlds.launcher.Launcher.main (Launcher.java:347)
[INFO] 
[INFO] --- maven-site-plugin:2.1.1:site (default-site) @ gluu-orm-filter ---
[WARNING] No URL defined for the project - decoration links will not be resolved
[INFO] 
[INFO] ----------------------< org.gluu:gluu-orm-model >-----------------------
[INFO] Building gluu-orm-model 4.3.0-SNAPSHOT                            [5/17]
[INFO] --------------------------------[ jar ]---------------------------------
[INFO] 
[INFO] --- maven-clean-plugin:2.5:clean (default-clean) @ gluu-orm-model ---
[INFO] Deleting /home/jenkins/.jenkins/jobs/oxOrm/workspace/model/target
[INFO] 
[INFO] --- maven-resources-plugin:2.6:resources (default-resources) @ gluu-orm-model ---
[INFO] Using 'UTF-8' encoding to copy filtered resources.
[INFO] skip non existing resourceDirectory /home/jenkins/.jenkins/jobs/oxOrm/workspace/model/src/main/resources
[INFO] 
[INFO] --- maven-compiler-plugin:2.3.2:compile (default-compile) @ gluu-orm-model ---
[INFO] Compiling 11 source files to /home/jenkins/.jenkins/jobs/oxOrm/workspace/model/target/classes
[INFO] 
[INFO] --- maven-resources-plugin:2.6:resources (default-resources) @ gluu-orm-model ---
[INFO] Using 'UTF-8' encoding to copy filtered resources.
[INFO] skip non existing resourceDirectory /home/jenkins/.jenkins/jobs/oxOrm/workspace/model/src/main/resources
[INFO] 
[INFO] --- maven-compiler-plugin:2.3.2:compile (default-compile) @ gluu-orm-model ---
[INFO] Nothing to compile - all classes are up to date
[INFO] 
[INFO] --- maven-resources-plugin:2.6:testResources (default-testResources) @ gluu-orm-model ---
[INFO] Using 'UTF-8' encoding to copy filtered resources.
[INFO] skip non existing resourceDirectory /home/jenkins/.jenkins/jobs/oxOrm/workspace/model/src/test/resources
[INFO] 
[INFO] --- maven-compiler-plugin:2.3.2:testCompile (default-testCompile) @ gluu-orm-model ---
[INFO] No sources to compile
[INFO] 
[INFO] --- maven-surefire-plugin:2.12.4:test (default-test) @ gluu-orm-model ---
[INFO] No tests to run.
[INFO] 
[INFO] --- maven-jar-plugin:2.4:jar (default-jar) @ gluu-orm-model ---
[INFO] Building jar: /home/jenkins/.jenkins/jobs/oxOrm/workspace/model/target/gluu-orm-model-4.3.0-SNAPSHOT.jar
[INFO] 
[INFO] --- maven-install-plugin:2.4:install (default-install) @ gluu-orm-model ---
[INFO] Installing /home/jenkins/.jenkins/jobs/oxOrm/workspace/model/target/gluu-orm-model-4.3.0-SNAPSHOT.jar to /var/www/html/maven/org/gluu/gluu-orm-model/4.3.0-SNAPSHOT/gluu-orm-model-4.3.0-SNAPSHOT.jar
[INFO] Installing /home/jenkins/.jenkins/jobs/oxOrm/workspace/model/pom.xml to /var/www/html/maven/org/gluu/gluu-orm-model/4.3.0-SNAPSHOT/gluu-orm-model-4.3.0-SNAPSHOT.pom
[INFO] 
[INFO] >>> maven-javadoc-plugin:3.0.1:javadoc (default-cli) > generate-sources @ gluu-orm-model >>>
[INFO] 
[INFO] <<< maven-javadoc-plugin:3.0.1:javadoc (default-cli) < generate-sources @ gluu-orm-model <<<
[INFO] 
[INFO] 
[INFO] --- maven-javadoc-plugin:3.0.1:javadoc (default-cli) @ gluu-orm-model ---
[INFO] 
Loading source files for package org.gluu.persist.model.base...
Constructing Javadoc information...
Standard Doclet version 11.0.7
Building tree for all the packages and classes...
Generating /home/jenkins/.jenkins/jobs/oxOrm/workspace/model/target/site/apidocs/org/gluu/persist/model/base/BaseEntry.html...
Generating /home/jenkins/.jenkins/jobs/oxOrm/workspace/model/target/site/apidocs/org/gluu/persist/model/base/CustomAttribute.html...
Generating /home/jenkins/.jenkins/jobs/oxOrm/workspace/model/target/site/apidocs/org/gluu/persist/model/base/CustomEntry.html...
Generating /home/jenkins/.jenkins/jobs/oxOrm/workspace/model/target/site/apidocs/org/gluu/persist/model/base/CustomObjectAttribute.html...
Generating /home/jenkins/.jenkins/jobs/oxOrm/workspace/model/target/site/apidocs/org/gluu/persist/model/base/Deletable.html...
Generating /home/jenkins/.jenkins/jobs/oxOrm/workspace/model/target/site/apidocs/org/gluu/persist/model/base/DeletableEntity.html...
Generating /home/jenkins/.jenkins/jobs/oxOrm/workspace/model/target/site/apidocs/org/gluu/persist/model/base/DummyEntry.html...
Generating /home/jenkins/.jenkins/jobs/oxOrm/workspace/model/target/site/apidocs/org/gluu/persist/model/base/Entry.html...
Generating /home/jenkins/.jenkins/jobs/oxOrm/workspace/model/target/site/apidocs/org/gluu/persist/model/base/InumEntry.html...
Generating /home/jenkins/.jenkins/jobs/oxOrm/workspace/model/target/site/apidocs/org/gluu/persist/model/base/SimpleBranch.html...
Generating /home/jenkins/.jenkins/jobs/oxOrm/workspace/model/target/site/apidocs/org/gluu/persist/model/base/SimpleUser.html...
Generating /home/jenkins/.jenkins/jobs/oxOrm/workspace/model/target/site/apidocs/org/gluu/persist/model/base/package-summary.html...
Generating /home/jenkins/.jenkins/jobs/oxOrm/workspace/model/target/site/apidocs/org/gluu/persist/model/base/package-tree.html...
Generating /home/jenkins/.jenkins/jobs/oxOrm/workspace/model/target/site/apidocs/constant-values.html...
Generating /home/jenkins/.jenkins/jobs/oxOrm/workspace/model/target/site/apidocs/serialized-form.html...
Generating /home/jenkins/.jenkins/jobs/oxOrm/workspace/model/target/site/apidocs/org/gluu/persist/model/base/class-use/CustomAttribute.html...
Generating /home/jenkins/.jenkins/jobs/oxOrm/workspace/model/target/site/apidocs/org/gluu/persist/model/base/class-use/CustomEntry.html...
Generating /home/jenkins/.jenkins/jobs/oxOrm/workspace/model/target/site/apidocs/org/gluu/persist/model/base/class-use/CustomObjectAttribute.html...
Generating /home/jenkins/.jenkins/jobs/oxOrm/workspace/model/target/site/apidocs/org/gluu/persist/model/base/class-use/Deletable.html...
Generating /home/jenkins/.jenkins/jobs/oxOrm/workspace/model/target/site/apidocs/org/gluu/persist/model/base/class-use/DeletableEntity.html...
Generating /home/jenkins/.jenkins/jobs/oxOrm/workspace/model/target/site/apidocs/org/gluu/persist/model/base/class-use/DummyEntry.html...
Generating /home/jenkins/.jenkins/jobs/oxOrm/workspace/model/target/site/apidocs/org/gluu/persist/model/base/class-use/Entry.html...
Generating /home/jenkins/.jenkins/jobs/oxOrm/workspace/model/target/site/apidocs/org/gluu/persist/model/base/class-use/InumEntry.html...
Generating /home/jenkins/.jenkins/jobs/oxOrm/workspace/model/target/site/apidocs/org/gluu/persist/model/base/class-use/SimpleBranch.html...
Generating /home/jenkins/.jenkins/jobs/oxOrm/workspace/model/target/site/apidocs/org/gluu/persist/model/base/class-use/SimpleUser.html...
Generating /home/jenkins/.jenkins/jobs/oxOrm/workspace/model/target/site/apidocs/org/gluu/persist/model/base/class-use/BaseEntry.html...
Generating /home/jenkins/.jenkins/jobs/oxOrm/workspace/model/target/site/apidocs/org/gluu/persist/model/base/package-use.html...
Building index for all the packages and classes...
Generating /home/jenkins/.jenkins/jobs/oxOrm/workspace/model/target/site/apidocs/overview-tree.html...
Generating /home/jenkins/.jenkins/jobs/oxOrm/workspace/model/target/site/apidocs/index-all.html...
Building index for all classes...
Generating /home/jenkins/.jenkins/jobs/oxOrm/workspace/model/target/site/apidocs/allclasses-index.html...
Generating /home/jenkins/.jenkins/jobs/oxOrm/workspace/model/target/site/apidocs/allpackages-index.html...
Generating /home/jenkins/.jenkins/jobs/oxOrm/workspace/model/target/site/apidocs/deprecated-list.html...
Building index for all classes...
Generating /home/jenkins/.jenkins/jobs/oxOrm/workspace/model/target/site/apidocs/allclasses.html...
Generating /home/jenkins/.jenkins/jobs/oxOrm/workspace/model/target/site/apidocs/allclasses.html...
Generating /home/jenkins/.jenkins/jobs/oxOrm/workspace/model/target/site/apidocs/index.html...
Generating /home/jenkins/.jenkins/jobs/oxOrm/workspace/model/target/site/apidocs/help-doc.html...
1 error
[ERROR] Error while creating javadoc report: 
Exit code: 1 - javadoc: error - The code being documented uses modules but the packages defined in https://docs.oracle.com/javase/8/docs/api/ are in the unnamed module.

Command line was: /opt/java/amazon-corretto-11.0.7.10.1-linux-x64/bin/javadoc @options @packages

Refer to the generated Javadoc files in '/home/jenkins/.jenkins/jobs/oxOrm/workspace/model/target/site/apidocs' dir.

org.apache.maven.reporting.MavenReportException: 
Exit code: 1 - javadoc: error - The code being documented uses modules but the packages defined in https://docs.oracle.com/javase/8/docs/api/ are in the unnamed module.

Command line was: /opt/java/amazon-corretto-11.0.7.10.1-linux-x64/bin/javadoc @options @packages

Refer to the generated Javadoc files in '/home/jenkins/.jenkins/jobs/oxOrm/workspace/model/target/site/apidocs' dir.

    at org.apache.maven.plugins.javadoc.AbstractJavadocMojo.executeJavadocCommandLine (AbstractJavadocMojo.java:5298)
    at org.apache.maven.plugins.javadoc.AbstractJavadocMojo.executeReport (AbstractJavadocMojo.java:2134)
    at org.apache.maven.plugins.javadoc.JavadocReport.generate (JavadocReport.java:134)
    at org.apache.maven.plugins.javadoc.JavadocReport.doExecute (JavadocReport.java:329)
    at org.apache.maven.plugins.javadoc.AbstractJavadocMojo.execute (AbstractJavadocMojo.java:1912)
    at org.apache.maven.plugin.DefaultBuildPluginManager.executeMojo (DefaultBuildPluginManager.java:137)
    at org.apache.maven.lifecycle.internal.MojoExecutor.execute (MojoExecutor.java:210)
    at org.apache.maven.lifecycle.internal.MojoExecutor.execute (MojoExecutor.java:156)
    at org.apache.maven.lifecycle.internal.MojoExecutor.execute (MojoExecutor.java:148)
    at org.apache.maven.lifecycle.internal.LifecycleModuleBuilder.buildProject (LifecycleModuleBuilder.java:117)
    at org.apache.maven.lifecycle.internal.LifecycleModuleBuilder.buildProject (LifecycleModuleBuilder.java:81)
    at org.apache.maven.lifecycle.internal.builder.singlethreaded.SingleThreadedBuilder.build (SingleThreadedBuilder.java:56)
    at org.apache.maven.lifecycle.internal.LifecycleStarter.execute (LifecycleStarter.java:128)
    at org.apache.maven.DefaultMaven.doExecute (DefaultMaven.java:305)
    at org.apache.maven.DefaultMaven.doExecute (DefaultMaven.java:192)
    at org.apache.maven.DefaultMaven.execute (DefaultMaven.java:105)
    at org.apache.maven.cli.MavenCli.execute (MavenCli.java:957)
    at org.apache.maven.cli.MavenCli.doMain (MavenCli.java:289)
    at org.apache.maven.cli.MavenCli.main (MavenCli.java:193)
    at jdk.internal.reflect.NativeMethodAccessorImpl.invoke0 (Native Method)
    at jdk.internal.reflect.NativeMethodAccessorImpl.invoke (NativeMethodAccessorImpl.java:62)
    at jdk.internal.reflect.DelegatingMethodAccessorImpl.invoke (DelegatingMethodAccessorImpl.java:43)
    at java.lang.reflect.Method.invoke (Method.java:566)
    at org.codehaus.plexus.classworlds.launcher.Launcher.launchEnhanced (Launcher.java:282)
    at org.codehaus.plexus.classworlds.launcher.Launcher.launch (Launcher.java:225)
    at org.codehaus.plexus.classworlds.launcher.Launcher.mainWithExitCode (Launcher.java:406)
    at org.codehaus.plexus.classworlds.launcher.Launcher.main (Launcher.java:347)
[INFO] 
[INFO] --- maven-site-plugin:2.1.1:site (default-site) @ gluu-orm-model ---
[WARNING] No URL defined for the project - decoration links will not be resolved
[INFO] 
[INFO] -----------------------< org.gluu:gluu-orm-core >-----------------------
[INFO] Building gluu-orm-core 4.3.0-SNAPSHOT                             [6/17]
[INFO] --------------------------------[ jar ]---------------------------------
[INFO] 
[INFO] --- maven-clean-plugin:2.5:clean (default-clean) @ gluu-orm-core ---
[INFO] Deleting /home/jenkins/.jenkins/jobs/oxOrm/workspace/core/target
[INFO] 
[INFO] --- maven-resources-plugin:2.6:resources (default-resources) @ gluu-orm-core ---
[INFO] Using 'UTF-8' encoding to copy filtered resources.
[INFO] skip non existing resourceDirectory /home/jenkins/.jenkins/jobs/oxOrm/workspace/core/src/main/resources
[INFO] 
[INFO] --- maven-compiler-plugin:2.3.2:compile (default-compile) @ gluu-orm-core ---
[INFO] Compiling 54 source files to /home/jenkins/.jenkins/jobs/oxOrm/workspace/core/target/classes
[INFO] 
[INFO] --- maven-resources-plugin:2.6:resources (default-resources) @ gluu-orm-core ---
[INFO] Using 'UTF-8' encoding to copy filtered resources.
[INFO] skip non existing resourceDirectory /home/jenkins/.jenkins/jobs/oxOrm/workspace/core/src/main/resources
[INFO] 
[INFO] --- maven-compiler-plugin:2.3.2:compile (default-compile) @ gluu-orm-core ---
[INFO] Nothing to compile - all classes are up to date
[INFO] 
[INFO] --- maven-resources-plugin:2.6:testResources (default-testResources) @ gluu-orm-core ---
[INFO] Using 'UTF-8' encoding to copy filtered resources.
[INFO] skip non existing resourceDirectory /home/jenkins/.jenkins/jobs/oxOrm/workspace/core/src/test/resources
[INFO] 
[INFO] --- maven-compiler-plugin:2.3.2:testCompile (default-testCompile) @ gluu-orm-core ---
[INFO] No sources to compile
[INFO] 
[INFO] --- maven-surefire-plugin:2.12.4:test (default-test) @ gluu-orm-core ---
[INFO] No tests to run.
[INFO] 
[INFO] --- maven-jar-plugin:2.4:jar (default-jar) @ gluu-orm-core ---
[INFO] Building jar: /home/jenkins/.jenkins/jobs/oxOrm/workspace/core/target/gluu-orm-core-4.3.0-SNAPSHOT.jar
[INFO] 
[INFO] --- maven-install-plugin:2.4:install (default-install) @ gluu-orm-core ---
[INFO] Installing /home/jenkins/.jenkins/jobs/oxOrm/workspace/core/target/gluu-orm-core-4.3.0-SNAPSHOT.jar to /var/www/html/maven/org/gluu/gluu-orm-core/4.3.0-SNAPSHOT/gluu-orm-core-4.3.0-SNAPSHOT.jar
[INFO] Installing /home/jenkins/.jenkins/jobs/oxOrm/workspace/core/pom.xml to /var/www/html/maven/org/gluu/gluu-orm-core/4.3.0-SNAPSHOT/gluu-orm-core-4.3.0-SNAPSHOT.pom
[INFO] 
[INFO] >>> maven-javadoc-plugin:3.0.1:javadoc (default-cli) > generate-sources @ gluu-orm-core >>>
[INFO] 
[INFO] <<< maven-javadoc-plugin:3.0.1:javadoc (default-cli) < generate-sources @ gluu-orm-core <<<
[INFO] 
[INFO] 
[INFO] --- maven-javadoc-plugin:3.0.1:javadoc (default-cli) @ gluu-orm-core ---
[INFO] 
Loading source files for package org.gluu.persist...
Loading source files for package org.gluu.persist.event...
Loading source files for package org.gluu.persist.exception...
Loading source files for package org.gluu.persist.exception.extension...
Loading source files for package org.gluu.persist.exception.operation...
Loading source files for package org.gluu.persist.impl...
Loading source files for package org.gluu.persist.impl.model...
Loading source files for package org.gluu.persist.model...
Loading source files for package org.gluu.persist.operation...
Loading source files for package org.gluu.persist.operation.auth...
Loading source files for package org.gluu.persist.reflect.property...
Loading source files for package org.gluu.persist.reflect.util...
Loading source files for package org.gluu.persist.service...
Loading source files for package org.gluu.persist.watch...
Constructing Javadoc information...
Standard Doclet version 11.0.7
Building tree for all the packages and classes...
Generating /home/jenkins/.jenkins/jobs/oxOrm/workspace/core/target/site/apidocs/org/gluu/persist/PersistenceEntryManager.html...
Generating /home/jenkins/.jenkins/jobs/oxOrm/workspace/core/target/site/apidocs/org/gluu/persist/PersistenceEntryManager.PERSITENCE_TYPES.html...
Generating /home/jenkins/.jenkins/jobs/oxOrm/workspace/core/target/site/apidocs/org/gluu/persist/PersistenceEntryManagerFactory.html...
Generating /home/jenkins/.jenkins/jobs/oxOrm/workspace/core/target/site/apidocs/org/gluu/persist/event/DeleteNotifier.html...
Generating /home/jenkins/.jenkins/jobs/oxOrm/workspace/core/target/site/apidocs/org/gluu/persist/exception/AuthenticationException.html...
Generating /home/jenkins/.jenkins/jobs/oxOrm/workspace/core/target/site/apidocs/org/gluu/persist/exception/BasePersistenceException.html...
Generating /home/jenkins/.jenkins/jobs/oxOrm/workspace/core/target/site/apidocs/org/gluu/persist/exception/EntryDeleteException.html...
Generating /home/jenkins/.jenkins/jobs/oxOrm/workspace/core/target/site/apidocs/org/gluu/persist/exception/EntryPersistenceException.html...
Generating /home/jenkins/.jenkins/jobs/oxOrm/workspace/core/target/site/apidocs/org/gluu/persist/exception/InvalidArgumentException.html...
Generating /home/jenkins/.jenkins/jobs/oxOrm/workspace/core/target/site/apidocs/org/gluu/persist/exception/KeyConversionException.html...
Generating /home/jenkins/.jenkins/jobs/oxOrm/workspace/core/target/site/apidocs/org/gluu/persist/exception/MappingException.html...
Generating /home/jenkins/.jenkins/jobs/oxOrm/workspace/core/target/site/apidocs/org/gluu/persist/exception/PropertyAccessException.html...
Generating /home/jenkins/.jenkins/jobs/oxOrm/workspace/core/target/site/apidocs/org/gluu/persist/exception/PropertyNotFoundException.html...
Generating /home/jenkins/.jenkins/jobs/oxOrm/workspace/core/target/site/apidocs/org/gluu/persist/exception/UnsupportedOperationException.html...
Generating /home/jenkins/.jenkins/jobs/oxOrm/workspace/core/target/site/apidocs/org/gluu/persist/exception/extension/PersistenceExtension.html...
Generating /home/jenkins/.jenkins/jobs/oxOrm/workspace/core/target/site/apidocs/org/gluu/persist/exception/operation/ConfigurationException.html...
Generating /home/jenkins/.jenkins/jobs/oxOrm/workspace/core/target/site/apidocs/org/gluu/persist/exception/operation/ConnectionException.html...
Generating /home/jenkins/.jenkins/jobs/oxOrm/workspace/core/target/site/apidocs/org/gluu/persist/exception/operation/DeleteException.html...
Generating /home/jenkins/.jenkins/jobs/oxOrm/workspace/core/target/site/apidocs/org/gluu/persist/exception/operation/DuplicateEntryException.html...
Generating /home/jenkins/.jenkins/jobs/oxOrm/workspace/core/target/site/apidocs/org/gluu/persist/exception/operation/EntryConvertationException.html...
Generating /home/jenkins/.jenkins/jobs/oxOrm/workspace/core/target/site/apidocs/org/gluu/persist/exception/operation/EntryNotFoundException.html...
Generating /home/jenkins/.jenkins/jobs/oxOrm/workspace/core/target/site/apidocs/org/gluu/persist/exception/operation/IncompatibleTypeException.html...
Generating /home/jenkins/.jenkins/jobs/oxOrm/workspace/core/target/site/apidocs/org/gluu/persist/exception/operation/PersistenceException.html...
Generating /home/jenkins/.jenkins/jobs/oxOrm/workspace/core/target/site/apidocs/org/gluu/persist/exception/operation/SearchException.html...
Generating /home/jenkins/.jenkins/jobs/oxOrm/workspace/core/target/site/apidocs/org/gluu/persist/exception/operation/SearchScopeException.html...
Generating /home/jenkins/.jenkins/jobs/oxOrm/workspace/core/target/site/apidocs/org/gluu/persist/impl/BaseEntryManager.html...
Generating /home/jenkins/.jenkins/jobs/oxOrm/workspace/core/target/site/apidocs/org/gluu/persist/impl/BaseEntryManager.LineLenghtComparator.html...
Generating /home/jenkins/.jenkins/jobs/oxOrm/workspace/core/target/site/apidocs/org/gluu/persist/impl/BaseEntryManager.PropertyComparator.html...
Generating /home/jenkins/.jenkins/jobs/oxOrm/workspace/core/target/site/apidocs/org/gluu/persist/impl/GenericKeyConverter.html...
Generating /home/jenkins/.jenkins/jobs/oxOrm/workspace/core/target/site/apidocs/org/gluu/persist/impl/model/ParsedKey.html...
Generating /home/jenkins/.jenkins/jobs/oxOrm/workspace/core/target/site/apidocs/org/gluu/persist/model/AttributeData.html...
Generating /home/jenkins/.jenkins/jobs/oxOrm/workspace/core/target/site/apidocs/org/gluu/persist/model/AttributeDataModification.html...
Generating /home/jenkins/.jenkins/jobs/oxOrm/workspace/core/target/site/apidocs/org/gluu/persist/model/AttributeDataModification.AttributeModificationType.html...
Generating /home/jenkins/.jenkins/jobs/oxOrm/workspace/core/target/site/apidocs/org/gluu/persist/model/BatchOperation.html...
Generating /home/jenkins/.jenkins/jobs/oxOrm/workspace/core/target/site/apidocs/org/gluu/persist/model/DefaultBatchOperation.html...
Generating /home/jenkins/.jenkins/jobs/oxOrm/workspace/core/target/site/apidocs/org/gluu/persist/model/EntryData.html...
Generating /home/jenkins/.jenkins/jobs/oxOrm/workspace/core/target/site/apidocs/org/gluu/persist/model/PagedResult.html...
Generating /home/jenkins/.jenkins/jobs/oxOrm/workspace/core/target/site/apidocs/org/gluu/persist/model/PersistenceConfiguration.html...
Generating /home/jenkins/.jenkins/jobs/oxOrm/workspace/core/target/site/apidocs/org/gluu/persist/model/ProcessBatchOperation.html...
Generating /home/jenkins/.jenkins/jobs/oxOrm/workspace/core/target/site/apidocs/org/gluu/persist/model/SearchScope.html...
Generating /home/jenkins/.jenkins/jobs/oxOrm/workspace/core/target/site/apidocs/org/gluu/persist/model/Sort.html...
Generating /home/jenkins/.jenkins/jobs/oxOrm/workspace/core/target/site/apidocs/org/gluu/persist/model/SortOrder.html...
Generating /home/jenkins/.jenkins/jobs/oxOrm/workspace/core/target/site/apidocs/org/gluu/persist/operation/PersistenceOperationService.html...
Generating /home/jenkins/.jenkins/jobs/oxOrm/workspace/core/target/site/apidocs/org/gluu/persist/operation/auth/BCrypt.html...
Generating /home/jenkins/.jenkins/jobs/oxOrm/workspace/core/target/site/apidocs/org/gluu/persist/operation/auth/PasswordDetails.html...
Generating /home/jenkins/.jenkins/jobs/oxOrm/workspace/core/target/site/apidocs/org/gluu/persist/operation/auth/PasswordEncryptionHelper.html...
Generating /home/jenkins/.jenkins/jobs/oxOrm/workspace/core/target/site/apidocs/org/gluu/persist/operation/auth/PasswordEncryptionMethod.html...
Generating /home/jenkins/.jenkins/jobs/oxOrm/workspace/core/target/site/apidocs/org/gluu/persist/reflect/property/BasicPropertyAccessor.html...
Generating /home/jenkins/.jenkins/jobs/oxOrm/workspace/core/target/site/apidocs/org/gluu/persist/reflect/property/BasicPropertyAccessor.BasicGetter.html...
Generating /home/jenkins/.jenkins/jobs/oxOrm/workspace/core/target/site/apidocs/org/gluu/persist/reflect/property/BasicPropertyAccessor.BasicSetter.html...
Generating /home/jenkins/.jenkins/jobs/oxOrm/workspace/core/target/site/apidocs/org/gluu/persist/reflect/property/BasicPropertyAnnotationResolver.html...
Generating /home/jenkins/.jenkins/jobs/oxOrm/workspace/core/target/site/apidocs/org/gluu/persist/reflect/property/DirectPropertyAccessor.html...
Generating /home/jenkins/.jenkins/jobs/oxOrm/workspace/core/target/site/apidocs/org/gluu/persist/reflect/property/DirectPropertyAccessor.DirectGetter.html...
Generating /home/jenkins/.jenkins/jobs/oxOrm/workspace/core/target/site/apidocs/org/gluu/persist/reflect/property/DirectPropertyAccessor.DirectSetter.html...
Generating /home/jenkins/.jenkins/jobs/oxOrm/workspace/core/target/site/apidocs/org/gluu/persist/reflect/property/Getter.html...
Generating /home/jenkins/.jenkins/jobs/oxOrm/workspace/core/target/site/apidocs/org/gluu/persist/reflect/property/PropertyAccessor.html...
Generating /home/jenkins/.jenkins/jobs/oxOrm/workspace/core/target/site/apidocs/org/gluu/persist/reflect/property/PropertyAnnotation.html...
Generating /home/jenkins/.jenkins/jobs/oxOrm/workspace/core/target/site/apidocs/org/gluu/persist/reflect/property/PropertyAnnotationResolver.html...
Generating /home/jenkins/.jenkins/jobs/oxOrm/workspace/core/target/site/apidocs/org/gluu/persist/reflect/property/Setter.html...
Generating /home/jenkins/.jenkins/jobs/oxOrm/workspace/core/target/site/apidocs/org/gluu/persist/reflect/util/ReflectHelper.html...
Generating /home/jenkins/.jenkins/jobs/oxOrm/workspace/core/target/site/apidocs/org/gluu/persist/service/BaseFactoryService.html...
Generating /home/jenkins/.jenkins/jobs/oxOrm/workspace/core/target/site/apidocs/org/gluu/persist/watch/DurationUtil.html...
Generating /home/jenkins/.jenkins/jobs/oxOrm/workspace/core/target/site/apidocs/org/gluu/persist/package-summary.html...
Generating /home/jenkins/.jenkins/jobs/oxOrm/workspace/core/target/site/apidocs/org/gluu/persist/package-tree.html...
Generating /home/jenkins/.jenkins/jobs/oxOrm/workspace/core/target/site/apidocs/org/gluu/persist/event/package-summary.html...
Generating /home/jenkins/.jenkins/jobs/oxOrm/workspace/core/target/site/apidocs/org/gluu/persist/event/package-tree.html...
Generating /home/jenkins/.jenkins/jobs/oxOrm/workspace/core/target/site/apidocs/org/gluu/persist/exception/package-summary.html...
Generating /home/jenkins/.jenkins/jobs/oxOrm/workspace/core/target/site/apidocs/org/gluu/persist/exception/package-tree.html...
Generating /home/jenkins/.jenkins/jobs/oxOrm/workspace/core/target/site/apidocs/org/gluu/persist/exception/extension/package-summary.html...
Generating /home/jenkins/.jenkins/jobs/oxOrm/workspace/core/target/site/apidocs/org/gluu/persist/exception/extension/package-tree.html...
Generating /home/jenkins/.jenkins/jobs/oxOrm/workspace/core/target/site/apidocs/org/gluu/persist/exception/operation/package-summary.html...
Generating /home/jenkins/.jenkins/jobs/oxOrm/workspace/core/target/site/apidocs/org/gluu/persist/exception/operation/package-tree.html...
Generating /home/jenkins/.jenkins/jobs/oxOrm/workspace/core/target/site/apidocs/org/gluu/persist/impl/package-summary.html...
Generating /home/jenkins/.jenkins/jobs/oxOrm/workspace/core/target/site/apidocs/org/gluu/persist/impl/package-tree.html...
Generating /home/jenkins/.jenkins/jobs/oxOrm/workspace/core/target/site/apidocs/org/gluu/persist/impl/model/package-summary.html...
Generating /home/jenkins/.jenkins/jobs/oxOrm/workspace/core/target/site/apidocs/org/gluu/persist/impl/model/package-tree.html...
Generating /home/jenkins/.jenkins/jobs/oxOrm/workspace/core/target/site/apidocs/org/gluu/persist/model/package-summary.html...
Generating /home/jenkins/.jenkins/jobs/oxOrm/workspace/core/target/site/apidocs/org/gluu/persist/model/package-tree.html...
Generating /home/jenkins/.jenkins/jobs/oxOrm/workspace/core/target/site/apidocs/org/gluu/persist/operation/package-summary.html...
Generating /home/jenkins/.jenkins/jobs/oxOrm/workspace/core/target/site/apidocs/org/gluu/persist/operation/package-tree.html...
Generating /home/jenkins/.jenkins/jobs/oxOrm/workspace/core/target/site/apidocs/org/gluu/persist/operation/auth/package-summary.html...
Generating /home/jenkins/.jenkins/jobs/oxOrm/workspace/core/target/site/apidocs/org/gluu/persist/operation/auth/package-tree.html...
Generating /home/jenkins/.jenkins/jobs/oxOrm/workspace/core/target/site/apidocs/org/gluu/persist/reflect/property/package-summary.html...
Generating /home/jenkins/.jenkins/jobs/oxOrm/workspace/core/target/site/apidocs/org/gluu/persist/reflect/property/package-tree.html...
Generating /home/jenkins/.jenkins/jobs/oxOrm/workspace/core/target/site/apidocs/org/gluu/persist/reflect/util/package-summary.html...
Generating /home/jenkins/.jenkins/jobs/oxOrm/workspace/core/target/site/apidocs/org/gluu/persist/reflect/util/package-tree.html...
Generating /home/jenkins/.jenkins/jobs/oxOrm/workspace/core/target/site/apidocs/org/gluu/persist/service/package-summary.html...
Generating /home/jenkins/.jenkins/jobs/oxOrm/workspace/core/target/site/apidocs/org/gluu/persist/service/package-tree.html...
Generating /home/jenkins/.jenkins/jobs/oxOrm/workspace/core/target/site/apidocs/org/gluu/persist/watch/package-summary.html...
Generating /home/jenkins/.jenkins/jobs/oxOrm/workspace/core/target/site/apidocs/org/gluu/persist/watch/package-tree.html...
Generating /home/jenkins/.jenkins/jobs/oxOrm/workspace/core/target/site/apidocs/constant-values.html...
Generating /home/jenkins/.jenkins/jobs/oxOrm/workspace/core/target/site/apidocs/serialized-form.html...
Generating /home/jenkins/.jenkins/jobs/oxOrm/workspace/core/target/site/apidocs/org/gluu/persist/class-use/PersistenceEntryManager.html...
Generating /home/jenkins/.jenkins/jobs/oxOrm/workspace/core/target/site/apidocs/org/gluu/persist/class-use/PersistenceEntryManager.PERSITENCE_TYPES.html...
Generating /home/jenkins/.jenkins/jobs/oxOrm/workspace/core/target/site/apidocs/org/gluu/persist/class-use/PersistenceEntryManagerFactory.html...
Generating /home/jenkins/.jenkins/jobs/oxOrm/workspace/core/target/site/apidocs/org/gluu/persist/event/class-use/DeleteNotifier.html...
Generating /home/jenkins/.jenkins/jobs/oxOrm/workspace/core/target/site/apidocs/org/gluu/persist/exception/class-use/AuthenticationException.html...
Generating /home/jenkins/.jenkins/jobs/oxOrm/workspace/core/target/site/apidocs/org/gluu/persist/exception/class-use/BasePersistenceException.html...
Generating /home/jenkins/.jenkins/jobs/oxOrm/workspace/core/target/site/apidocs/org/gluu/persist/exception/class-use/EntryDeleteException.html...
Generating /home/jenkins/.jenkins/jobs/oxOrm/workspace/core/target/site/apidocs/org/gluu/persist/exception/class-use/EntryPersistenceException.html...
Generating /home/jenkins/.jenkins/jobs/oxOrm/workspace/core/target/site/apidocs/org/gluu/persist/exception/class-use/InvalidArgumentException.html...
Generating /home/jenkins/.jenkins/jobs/oxOrm/workspace/core/target/site/apidocs/org/gluu/persist/exception/class-use/KeyConversionException.html...
Generating /home/jenkins/.jenkins/jobs/oxOrm/workspace/core/target/site/apidocs/org/gluu/persist/exception/class-use/MappingException.html...
Generating /home/jenkins/.jenkins/jobs/oxOrm/workspace/core/target/site/apidocs/org/gluu/persist/exception/class-use/PropertyAccessException.html...
Generating /home/jenkins/.jenkins/jobs/oxOrm/workspace/core/target/site/apidocs/org/gluu/persist/exception/class-use/PropertyNotFoundException.html...
Generating /home/jenkins/.jenkins/jobs/oxOrm/workspace/core/target/site/apidocs/org/gluu/persist/exception/class-use/UnsupportedOperationException.html...
Generating /home/jenkins/.jenkins/jobs/oxOrm/workspace/core/target/site/apidocs/org/gluu/persist/exception/extension/class-use/PersistenceExtension.html...
Generating /home/jenkins/.jenkins/jobs/oxOrm/workspace/core/target/site/apidocs/org/gluu/persist/exception/operation/class-use/ConfigurationException.html...
Generating /home/jenkins/.jenkins/jobs/oxOrm/workspace/core/target/site/apidocs/org/gluu/persist/exception/operation/class-use/ConnectionException.html...
Generating /home/jenkins/.jenkins/jobs/oxOrm/workspace/core/target/site/apidocs/org/gluu/persist/exception/operation/class-use/DeleteException.html...
Generating /home/jenkins/.jenkins/jobs/oxOrm/workspace/core/target/site/apidocs/org/gluu/persist/exception/operation/class-use/DuplicateEntryException.html...
Generating /home/jenkins/.jenkins/jobs/oxOrm/workspace/core/target/site/apidocs/org/gluu/persist/exception/operation/class-use/EntryConvertationException.html...
Generating /home/jenkins/.jenkins/jobs/oxOrm/workspace/core/target/site/apidocs/org/gluu/persist/exception/operation/class-use/EntryNotFoundException.html...
Generating /home/jenkins/.jenkins/jobs/oxOrm/workspace/core/target/site/apidocs/org/gluu/persist/exception/operation/class-use/IncompatibleTypeException.html...
Generating /home/jenkins/.jenkins/jobs/oxOrm/workspace/core/target/site/apidocs/org/gluu/persist/exception/operation/class-use/PersistenceException.html...
Generating /home/jenkins/.jenkins/jobs/oxOrm/workspace/core/target/site/apidocs/org/gluu/persist/exception/operation/class-use/SearchException.html...
Generating /home/jenkins/.jenkins/jobs/oxOrm/workspace/core/target/site/apidocs/org/gluu/persist/exception/operation/class-use/SearchScopeException.html...
Generating /home/jenkins/.jenkins/jobs/oxOrm/workspace/core/target/site/apidocs/org/gluu/persist/impl/class-use/BaseEntryManager.html...
Generating /home/jenkins/.jenkins/jobs/oxOrm/workspace/core/target/site/apidocs/org/gluu/persist/impl/class-use/BaseEntryManager.LineLenghtComparator.html...
Generating /home/jenkins/.jenkins/jobs/oxOrm/workspace/core/target/site/apidocs/org/gluu/persist/impl/class-use/BaseEntryManager.PropertyComparator.html...
Generating /home/jenkins/.jenkins/jobs/oxOrm/workspace/core/target/site/apidocs/org/gluu/persist/impl/class-use/GenericKeyConverter.html...
Generating /home/jenkins/.jenkins/jobs/oxOrm/workspace/core/target/site/apidocs/org/gluu/persist/impl/model/class-use/ParsedKey.html...
Generating /home/jenkins/.jenkins/jobs/oxOrm/workspace/core/target/site/apidocs/org/gluu/persist/model/class-use/AttributeData.html...
Generating /home/jenkins/.jenkins/jobs/oxOrm/workspace/core/target/site/apidocs/org/gluu/persist/model/class-use/AttributeDataModification.html...
Generating /home/jenkins/.jenkins/jobs/oxOrm/workspace/core/target/site/apidocs/org/gluu/persist/model/class-use/AttributeDataModification.AttributeModificationType.html...
Generating /home/jenkins/.jenkins/jobs/oxOrm/workspace/core/target/site/apidocs/org/gluu/persist/model/class-use/BatchOperation.html...
Generating /home/jenkins/.jenkins/jobs/oxOrm/workspace/core/target/site/apidocs/org/gluu/persist/model/class-use/DefaultBatchOperation.html...
Generating /home/jenkins/.jenkins/jobs/oxOrm/workspace/core/target/site/apidocs/org/gluu/persist/model/class-use/EntryData.html...
Generating /home/jenkins/.jenkins/jobs/oxOrm/workspace/core/target/site/apidocs/org/gluu/persist/model/class-use/PagedResult.html...
Generating /home/jenkins/.jenkins/jobs/oxOrm/workspace/core/target/site/apidocs/org/gluu/persist/model/class-use/PersistenceConfiguration.html...
Generating /home/jenkins/.jenkins/jobs/oxOrm/workspace/core/target/site/apidocs/org/gluu/persist/model/class-use/ProcessBatchOperation.html...
Generating /home/jenkins/.jenkins/jobs/oxOrm/workspace/core/target/site/apidocs/org/gluu/persist/model/class-use/SearchScope.html...
Generating /home/jenkins/.jenkins/jobs/oxOrm/workspace/core/target/site/apidocs/org/gluu/persist/model/class-use/Sort.html...
Generating /home/jenkins/.jenkins/jobs/oxOrm/workspace/core/target/site/apidocs/org/gluu/persist/model/class-use/SortOrder.html...
Generating /home/jenkins/.jenkins/jobs/oxOrm/workspace/core/target/site/apidocs/org/gluu/persist/operation/class-use/PersistenceOperationService.html...
Generating /home/jenkins/.jenkins/jobs/oxOrm/workspace/core/target/site/apidocs/org/gluu/persist/operation/auth/class-use/BCrypt.html...
Generating /home/jenkins/.jenkins/jobs/oxOrm/workspace/core/target/site/apidocs/org/gluu/persist/operation/auth/class-use/PasswordDetails.html...
Generating /home/jenkins/.jenkins/jobs/oxOrm/workspace/core/target/site/apidocs/org/gluu/persist/operation/auth/class-use/PasswordEncryptionHelper.html...
Generating /home/jenkins/.jenkins/jobs/oxOrm/workspace/core/target/site/apidocs/org/gluu/persist/operation/auth/class-use/PasswordEncryptionMethod.html...
Generating /home/jenkins/.jenkins/jobs/oxOrm/workspace/core/target/site/apidocs/org/gluu/persist/reflect/property/class-use/BasicPropertyAccessor.html...
Generating /home/jenkins/.jenkins/jobs/oxOrm/workspace/core/target/site/apidocs/org/gluu/persist/reflect/property/class-use/BasicPropertyAccessor.BasicGetter.html...
Generating /home/jenkins/.jenkins/jobs/oxOrm/workspace/core/target/site/apidocs/org/gluu/persist/reflect/property/class-use/BasicPropertyAccessor.BasicSetter.html...
Generating /home/jenkins/.jenkins/jobs/oxOrm/workspace/core/target/site/apidocs/org/gluu/persist/reflect/property/class-use/BasicPropertyAnnotationResolver.html...
Generating /home/jenkins/.jenkins/jobs/oxOrm/workspace/core/target/site/apidocs/org/gluu/persist/reflect/property/class-use/DirectPropertyAccessor.html...
Generating /home/jenkins/.jenkins/jobs/oxOrm/workspace/core/target/site/apidocs/org/gluu/persist/reflect/property/class-use/DirectPropertyAccessor.DirectSetter.html...
Generating /home/jenkins/.jenkins/jobs/oxOrm/workspace/core/target/site/apidocs/org/gluu/persist/reflect/property/class-use/DirectPropertyAccessor.DirectGetter.html...
Generating /home/jenkins/.jenkins/jobs/oxOrm/workspace/core/target/site/apidocs/org/gluu/persist/reflect/property/class-use/Getter.html...
Generating /home/jenkins/.jenkins/jobs/oxOrm/workspace/core/target/site/apidocs/org/gluu/persist/reflect/property/class-use/PropertyAccessor.html...
Generating /home/jenkins/.jenkins/jobs/oxOrm/workspace/core/target/site/apidocs/org/gluu/persist/reflect/property/class-use/PropertyAnnotation.html...
Generating /home/jenkins/.jenkins/jobs/oxOrm/workspace/core/target/site/apidocs/org/gluu/persist/reflect/property/class-use/PropertyAnnotationResolver.html...
Generating /home/jenkins/.jenkins/jobs/oxOrm/workspace/core/target/site/apidocs/org/gluu/persist/reflect/property/class-use/Setter.html...
Generating /home/jenkins/.jenkins/jobs/oxOrm/workspace/core/target/site/apidocs/org/gluu/persist/reflect/util/class-use/ReflectHelper.html...
Generating /home/jenkins/.jenkins/jobs/oxOrm/workspace/core/target/site/apidocs/org/gluu/persist/service/class-use/BaseFactoryService.html...
Generating /home/jenkins/.jenkins/jobs/oxOrm/workspace/core/target/site/apidocs/org/gluu/persist/watch/class-use/DurationUtil.html...
Generating /home/jenkins/.jenkins/jobs/oxOrm/workspace/core/target/site/apidocs/org/gluu/persist/package-use.html...
Generating /home/jenkins/.jenkins/jobs/oxOrm/workspace/core/target/site/apidocs/org/gluu/persist/event/package-use.html...
Generating /home/jenkins/.jenkins/jobs/oxOrm/workspace/core/target/site/apidocs/org/gluu/persist/exception/package-use.html...
Generating /home/jenkins/.jenkins/jobs/oxOrm/workspace/core/target/site/apidocs/org/gluu/persist/exception/extension/package-use.html...
Generating /home/jenkins/.jenkins/jobs/oxOrm/workspace/core/target/site/apidocs/org/gluu/persist/exception/operation/package-use.html...
Generating /home/jenkins/.jenkins/jobs/oxOrm/workspace/core/target/site/apidocs/org/gluu/persist/impl/package-use.html...
Generating /home/jenkins/.jenkins/jobs/oxOrm/workspace/core/target/site/apidocs/org/gluu/persist/impl/model/package-use.html...
Generating /home/jenkins/.jenkins/jobs/oxOrm/workspace/core/target/site/apidocs/org/gluu/persist/model/package-use.html...
Generating /home/jenkins/.jenkins/jobs/oxOrm/workspace/core/target/site/apidocs/org/gluu/persist/operation/package-use.html...
Generating /home/jenkins/.jenkins/jobs/oxOrm/workspace/core/target/site/apidocs/org/gluu/persist/operation/auth/package-use.html...
Generating /home/jenkins/.jenkins/jobs/oxOrm/workspace/core/target/site/apidocs/org/gluu/persist/reflect/property/package-use.html...
Generating /home/jenkins/.jenkins/jobs/oxOrm/workspace/core/target/site/apidocs/org/gluu/persist/reflect/util/package-use.html...
Generating /home/jenkins/.jenkins/jobs/oxOrm/workspace/core/target/site/apidocs/org/gluu/persist/service/package-use.html...
Generating /home/jenkins/.jenkins/jobs/oxOrm/workspace/core/target/site/apidocs/org/gluu/persist/watch/package-use.html...
Building index for all the packages and classes...
Generating /home/jenkins/.jenkins/jobs/oxOrm/workspace/core/target/site/apidocs/overview-tree.html...
Generating /home/jenkins/.jenkins/jobs/oxOrm/workspace/core/target/site/apidocs/index-all.html...
Building index for all classes...
Generating /home/jenkins/.jenkins/jobs/oxOrm/workspace/core/target/site/apidocs/allclasses-index.html...
Generating /home/jenkins/.jenkins/jobs/oxOrm/workspace/core/target/site/apidocs/allpackages-index.html...
Generating /home/jenkins/.jenkins/jobs/oxOrm/workspace/core/target/site/apidocs/deprecated-list.html...
Building index for all classes...
Generating /home/jenkins/.jenkins/jobs/oxOrm/workspace/core/target/site/apidocs/allclasses.html...
Generating /home/jenkins/.jenkins/jobs/oxOrm/workspace/core/target/site/apidocs/allclasses.html...
Generating /home/jenkins/.jenkins/jobs/oxOrm/workspace/core/target/site/apidocs/index.html...
Generating /home/jenkins/.jenkins/jobs/oxOrm/workspace/core/target/site/apidocs/overview-summary.html...
Generating /home/jenkins/.jenkins/jobs/oxOrm/workspace/core/target/site/apidocs/help-doc.html...
11 errors
49 warnings
[ERROR] Error while creating javadoc report: 
Exit code: 1 - javadoc: error - The code being documented uses modules but the packages defined in https://docs.oracle.com/javase/8/docs/api/ are in the unnamed module.
/home/jenkins/.jenkins/jobs/oxOrm/workspace/core/src/main/java/org/gluu/persist/operation/auth/BCrypt.java:54: error: self-closing element not allowed
 * String pw_hash = BCrypt.hashpw(plain_password, BCrypt.gensalt()); <br />
                                                                     ^
/home/jenkins/.jenkins/jobs/oxOrm/workspace/core/src/main/java/org/gluu/persist/operation/auth/BCrypt.java:61: error: self-closing element not allowed
 * if (BCrypt.checkpw(candidate_password, stored_hash))<br />
                                                       ^
/home/jenkins/.jenkins/jobs/oxOrm/workspace/core/src/main/java/org/gluu/persist/operation/auth/BCrypt.java:62: error: self-closing element not allowed
 * &nbsp;&nbsp;&nbsp;&nbsp;System.out.println("It matches");<br />
                                                            ^
/home/jenkins/.jenkins/jobs/oxOrm/workspace/core/src/main/java/org/gluu/persist/operation/auth/BCrypt.java:63: error: self-closing element not allowed
 * else<br />
       ^
/home/jenkins/.jenkins/jobs/oxOrm/workspace/core/src/main/java/org/gluu/persist/operation/auth/BCrypt.java:64: error: self-closing element not allowed
 * &nbsp;&nbsp;&nbsp;&nbsp;System.out.println("It does not match");<br />
                                                                   ^
/home/jenkins/.jenkins/jobs/oxOrm/workspace/core/src/main/java/org/gluu/persist/operation/auth/BCrypt.java:71: error: self-closing element not allowed
 * String strong_salt = BCrypt.gensalt(10)<br />
                                          ^
/home/jenkins/.jenkins/jobs/oxOrm/workspace/core/src/main/java/org/gluu/persist/operation/auth/BCrypt.java:72: error: self-closing element not allowed
 * String stronger_salt = BCrypt.gensalt(12)<br />
                                            ^
/home/jenkins/.jenkins/jobs/oxOrm/workspace/core/src/main/java/org/gluu/persist/PersistenceEntryManager.java:69: warning: no @param for <T>
    <T> List<T> findEntries(Object entry);
                ^
/home/jenkins/.jenkins/jobs/oxOrm/workspace/core/src/main/java/org/gluu/persist/operation/auth/PasswordDetails.java:20: warning: no @param for algorithm
    public PasswordDetails(PasswordEncryptionMethod algorithm, byte[] salt, byte[] password) {
           ^
/home/jenkins/.jenkins/jobs/oxOrm/workspace/core/src/main/java/org/gluu/persist/operation/auth/PasswordDetails.java:20: warning: no @param for salt
    public PasswordDetails(PasswordEncryptionMethod algorithm, byte[] salt, byte[] password) {
           ^
/home/jenkins/.jenkins/jobs/oxOrm/workspace/core/src/main/java/org/gluu/persist/operation/auth/PasswordDetails.java:20: warning: no @param for password
    public PasswordDetails(PasswordEncryptionMethod algorithm, byte[] salt, byte[] password) {
           ^
/home/jenkins/.jenkins/jobs/oxOrm/workspace/core/src/main/java/org/gluu/persist/operation/auth/PasswordDetails.java:29: warning: no @return
    public PasswordEncryptionMethod getAlgorithm() {
                                    ^
/home/jenkins/.jenkins/jobs/oxOrm/workspace/core/src/main/java/org/gluu/persist/operation/auth/PasswordDetails.java:36: warning: no @return
    public byte[] getSalt() {
                  ^
/home/jenkins/.jenkins/jobs/oxOrm/workspace/core/src/main/java/org/gluu/persist/operation/auth/PasswordDetails.java:43: warning: no @return
    public byte[] getPassword() {
                  ^
/home/jenkins/.jenkins/jobs/oxOrm/workspace/core/src/main/java/org/gluu/persist/operation/auth/PasswordEncryptionHelper.java:40: warning: no @param for credentials
    public static PasswordEncryptionMethod findAlgorithm(String credentials) {
                                           ^
/home/jenkins/.jenkins/jobs/oxOrm/workspace/core/src/main/java/org/gluu/persist/operation/auth/PasswordEncryptionHelper.java:40: warning: no @return
    public static PasswordEncryptionMethod findAlgorithm(String credentials) {
                                           ^
/home/jenkins/.jenkins/jobs/oxOrm/workspace/core/src/main/java/org/gluu/persist/operation/auth/PasswordEncryptionHelper.java:47: warning: no @param for credentials
    public static PasswordEncryptionMethod findAlgorithm(byte[] credentials) {
                                           ^
/home/jenkins/.jenkins/jobs/oxOrm/workspace/core/src/main/java/org/gluu/persist/operation/auth/PasswordEncryptionHelper.java:47: warning: no @return
    public static PasswordEncryptionMethod findAlgorithm(byte[] credentials) {
                                           ^
/home/jenkins/.jenkins/jobs/oxOrm/workspace/core/src/main/java/org/gluu/persist/operation/auth/PasswordEncryptionHelper.java:96: warning: no @param for credentials
    public static String createStoragePassword(String credentials, PasswordEncryptionMethod algorithm) {
                         ^
/home/jenkins/.jenkins/jobs/oxOrm/workspace/core/src/main/java/org/gluu/persist/operation/auth/PasswordEncryptionHelper.java:96: warning: no @param for algorithm
    public static String createStoragePassword(String credentials, PasswordEncryptionMethod algorithm) {
                         ^
/home/jenkins/.jenkins/jobs/oxOrm/workspace/core/src/main/java/org/gluu/persist/operation/auth/PasswordEncryptionHelper.java:96: warning: no @return
    public static String createStoragePassword(String credentials, PasswordEncryptionMethod algorithm) {
                         ^
/home/jenkins/.jenkins/jobs/oxOrm/workspace/core/src/main/java/org/gluu/persist/operation/auth/PasswordEncryptionHelper.java:106: warning: no @param for credentials
    public static byte[] createStoragePassword(byte[] credentials, PasswordEncryptionMethod algorithm) {
                         ^
/home/jenkins/.jenkins/jobs/oxOrm/workspace/core/src/main/java/org/gluu/persist/operation/auth/PasswordEncryptionHelper.java:106: warning: no @param for algorithm
    public static byte[] createStoragePassword(byte[] credentials, PasswordEncryptionMethod algorithm) {
                         ^
/home/jenkins/.jenkins/jobs/oxOrm/workspace/core/src/main/java/org/gluu/persist/operation/auth/PasswordEncryptionHelper.java:106: warning: no @return
    public static byte[] createStoragePassword(byte[] credentials, PasswordEncryptionMethod algorithm) {
                         ^
/home/jenkins/.jenkins/jobs/oxOrm/workspace/core/src/main/java/org/gluu/persist/operation/auth/PasswordEncryptionHelper.java:184: warning: no @param for receivedCredentials
    public static boolean compareCredentials(String receivedCredentials, String storedCredentials) {
                          ^
/home/jenkins/.jenkins/jobs/oxOrm/workspace/core/src/main/java/org/gluu/persist/operation/auth/PasswordEncryptionHelper.java:184: warning: no @param for storedCredentials
    public static boolean compareCredentials(String receivedCredentials, String storedCredentials) {
                          ^
/home/jenkins/.jenkins/jobs/oxOrm/workspace/core/src/main/java/org/gluu/persist/operation/auth/PasswordEncryptionHelper.java:184: warning: no @return
    public static boolean compareCredentials(String receivedCredentials, String storedCredentials) {
                          ^
/home/jenkins/.jenkins/jobs/oxOrm/workspace/core/src/main/java/org/gluu/persist/operation/auth/PasswordEncryptionHelper.java:191: warning: no @param for receivedCredentials
    public static boolean compareCredentials(byte[] receivedCredentials, byte[] storedCredentials) {
                          ^
/home/jenkins/.jenkins/jobs/oxOrm/workspace/core/src/main/java/org/gluu/persist/operation/auth/PasswordEncryptionHelper.java:191: warning: no @param for storedCredentials
    public static boolean compareCredentials(byte[] receivedCredentials, byte[] storedCredentials) {
                          ^
/home/jenkins/.jenkins/jobs/oxOrm/workspace/core/src/main/java/org/gluu/persist/operation/auth/PasswordEncryptionHelper.java:191: warning: no @return
    public static boolean compareCredentials(byte[] receivedCredentials, byte[] storedCredentials) {
                          ^
/home/jenkins/.jenkins/jobs/oxOrm/workspace/core/src/main/java/org/gluu/persist/operation/auth/PasswordEncryptionMethod.java:114: warning: no @param for algorithm
    public static PasswordEncryptionMethod getMethod(String algorithm) {
                                           ^
/home/jenkins/.jenkins/jobs/oxOrm/workspace/core/src/main/java/org/gluu/persist/operation/auth/PasswordEncryptionMethod.java:114: warning: no @return
    public static PasswordEncryptionMethod getMethod(String algorithm) {
                                           ^
/home/jenkins/.jenkins/jobs/oxOrm/workspace/core/src/main/java/org/gluu/persist/reflect/property/PropertyAccessor.java:19: warning: no @param for theClass
    Getter getGetter(Class<?> theClass, String propertyName) throws PropertyNotFoundException;
           ^
/home/jenkins/.jenkins/jobs/oxOrm/workspace/core/src/main/java/org/gluu/persist/reflect/property/PropertyAccessor.java:19: warning: no @param for propertyName
    Getter getGetter(Class<?> theClass, String propertyName) throws PropertyNotFoundException;
           ^
/home/jenkins/.jenkins/jobs/oxOrm/workspace/core/src/main/java/org/gluu/persist/reflect/property/PropertyAccessor.java:19: warning: no @return
    Getter getGetter(Class<?> theClass, String propertyName) throws PropertyNotFoundException;
           ^
/home/jenkins/.jenkins/jobs/oxOrm/workspace/core/src/main/java/org/gluu/persist/reflect/property/PropertyAccessor.java:24: warning: no @param for theClass
    Setter getSetter(Class<?> theClass, String propertyName) throws PropertyNotFoundException;
           ^
/home/jenkins/.jenkins/jobs/oxOrm/workspace/core/src/main/java/org/gluu/persist/reflect/property/PropertyAccessor.java:24: warning: no @param for propertyName
    Setter getSetter(Class<?> theClass, String propertyName) throws PropertyNotFoundException;
           ^
/home/jenkins/.jenkins/jobs/oxOrm/workspace/core/src/main/java/org/gluu/persist/reflect/property/PropertyAccessor.java:24: warning: no @return
    Setter getSetter(Class<?> theClass, String propertyName) throws PropertyNotFoundException;
           ^
/home/jenkins/.jenkins/jobs/oxOrm/workspace/core/src/main/java/org/gluu/persist/reflect/property/Getter.java:24: warning: no description for @throws
     * @throws BasePersistenceException
       ^
/home/jenkins/.jenkins/jobs/oxOrm/workspace/core/src/main/java/org/gluu/persist/reflect/property/Getter.java:31: warning: no @return
    Class<?> getReturnType();
             ^
/home/jenkins/.jenkins/jobs/oxOrm/workspace/core/src/main/java/org/gluu/persist/reflect/property/Getter.java:36: warning: no @return
    String getMethodName();
           ^
/home/jenkins/.jenkins/jobs/oxOrm/workspace/core/src/main/java/org/gluu/persist/reflect/property/Getter.java:41: warning: no @return
    Method getMethod();
           ^
/home/jenkins/.jenkins/jobs/oxOrm/workspace/core/src/main/java/org/gluu/persist/reflect/property/Setter.java:25: warning: no description for @throws
     * @throws BasePersistenceException
       ^
/home/jenkins/.jenkins/jobs/oxOrm/workspace/core/src/main/java/org/gluu/persist/reflect/property/Setter.java:32: warning: no @return
    String getMethodName();
           ^
/home/jenkins/.jenkins/jobs/oxOrm/workspace/core/src/main/java/org/gluu/persist/reflect/property/Setter.java:37: warning: no @return
    Method getMethod();
           ^
/home/jenkins/.jenkins/jobs/oxOrm/workspace/core/src/main/java/org/gluu/persist/reflect/property/PropertyAnnotationResolver.java:25: warning: no @param for theClass
    List<Annotation> getClassAnnotations(Class<?> theClass, Class<?>... allowedAnnotations);
                     ^
/home/jenkins/.jenkins/jobs/oxOrm/workspace/core/src/main/java/org/gluu/persist/reflect/property/PropertyAnnotationResolver.java:25: warning: no @param for allowedAnnotations
    List<Annotation> getClassAnnotations(Class<?> theClass, Class<?>... allowedAnnotations);
                     ^
/home/jenkins/.jenkins/jobs/oxOrm/workspace/core/src/main/java/org/gluu/persist/reflect/property/PropertyAnnotationResolver.java:25: warning: no @return
    List<Annotation> getClassAnnotations(Class<?> theClass, Class<?>... allowedAnnotations);
                     ^
/home/jenkins/.jenkins/jobs/oxOrm/workspace/core/src/main/java/org/gluu/persist/reflect/property/PropertyAnnotationResolver.java:30: warning: no @param for theClass
    List<Annotation> getPropertyAnnotations(Class<?> theClass, String propertyName, Class<?>... allowedAnnotations)
                     ^
/home/jenkins/.jenkins/jobs/oxOrm/workspace/core/src/main/java/org/gluu/persist/reflect/property/PropertyAnnotationResolver.java:30: warning: no @param for propertyName
    List<Annotation> getPropertyAnnotations(Class<?> theClass, String propertyName, Class<?>... allowedAnnotations)
                     ^
/home/jenkins/.jenkins/jobs/oxOrm/workspace/core/src/main/java/org/gluu/persist/reflect/property/PropertyAnnotationResolver.java:30: warning: no @param for allowedAnnotations
    List<Annotation> getPropertyAnnotations(Class<?> theClass, String propertyName, Class<?>... allowedAnnotations)
                     ^
/home/jenkins/.jenkins/jobs/oxOrm/workspace/core/src/main/java/org/gluu/persist/reflect/property/PropertyAnnotationResolver.java:30: warning: no @return
    List<Annotation> getPropertyAnnotations(Class<?> theClass, String propertyName, Class<?>... allowedAnnotations)
                     ^
/home/jenkins/.jenkins/jobs/oxOrm/workspace/core/src/main/java/org/gluu/persist/reflect/property/PropertyAnnotationResolver.java:36: warning: no @param for theClass
    Map<String, List<Annotation>> getPropertiesAnnotations(Class<?> theClass, Class<?>... allowedAnnotations);
                                  ^
/home/jenkins/.jenkins/jobs/oxOrm/workspace/core/src/main/java/org/gluu/persist/reflect/property/PropertyAnnotationResolver.java:36: warning: no @param for allowedAnnotations
    Map<String, List<Annotation>> getPropertiesAnnotations(Class<?> theClass, Class<?>... allowedAnnotations);
                                  ^
/home/jenkins/.jenkins/jobs/oxOrm/workspace/core/src/main/java/org/gluu/persist/reflect/property/PropertyAnnotationResolver.java:36: warning: no @return
    Map<String, List<Annotation>> getPropertiesAnnotations(Class<?> theClass, Class<?>... allowedAnnotations);
                                  ^
/home/jenkins/.jenkins/jobs/oxOrm/workspace/core/src/main/java/org/gluu/persist/reflect/util/ReflectHelper.java:152: error: self-closing element not allowed
     * <p/>
       ^
/home/jenkins/.jenkins/jobs/oxOrm/workspace/core/src/main/java/org/gluu/persist/reflect/util/ReflectHelper.java:179: error: self-closing element not allowed
     * <p/>
       ^
/home/jenkins/.jenkins/jobs/oxOrm/workspace/core/src/main/java/org/gluu/persist/reflect/util/ReflectHelper.java:203: error: self-closing element not allowed
     * <p/>
       ^
/home/jenkins/.jenkins/jobs/oxOrm/workspace/core/src/main/java/org/gluu/persist/reflect/util/ReflectHelper.java:314: warning: no @param for <T>
    public static <T> Constructor<T> getDefaultConstructor(Class<T> clazz) throws PropertyNotFoundException {
                                     ^

Command line was: /opt/java/amazon-corretto-11.0.7.10.1-linux-x64/bin/javadoc @options @packages

Refer to the generated Javadoc files in '/home/jenkins/.jenkins/jobs/oxOrm/workspace/core/target/site/apidocs' dir.

org.apache.maven.reporting.MavenReportException: 
Exit code: 1 - javadoc: error - The code being documented uses modules but the packages defined in https://docs.oracle.com/javase/8/docs/api/ are in the unnamed module.
/home/jenkins/.jenkins/jobs/oxOrm/workspace/core/src/main/java/org/gluu/persist/operation/auth/BCrypt.java:54: error: self-closing element not allowed
 * String pw_hash = BCrypt.hashpw(plain_password, BCrypt.gensalt()); <br />
                                                                     ^
/home/jenkins/.jenkins/jobs/oxOrm/workspace/core/src/main/java/org/gluu/persist/operation/auth/BCrypt.java:61: error: self-closing element not allowed
 * if (BCrypt.checkpw(candidate_password, stored_hash))<br />
                                                       ^
/home/jenkins/.jenkins/jobs/oxOrm/workspace/core/src/main/java/org/gluu/persist/operation/auth/BCrypt.java:62: error: self-closing element not allowed
 * &nbsp;&nbsp;&nbsp;&nbsp;System.out.println("It matches");<br />
                                                            ^
/home/jenkins/.jenkins/jobs/oxOrm/workspace/core/src/main/java/org/gluu/persist/operation/auth/BCrypt.java:63: error: self-closing element not allowed
 * else<br />
       ^
/home/jenkins/.jenkins/jobs/oxOrm/workspace/core/src/main/java/org/gluu/persist/operation/auth/BCrypt.java:64: error: self-closing element not allowed
 * &nbsp;&nbsp;&nbsp;&nbsp;System.out.println("It does not match");<br />
                                                                   ^
/home/jenkins/.jenkins/jobs/oxOrm/workspace/core/src/main/java/org/gluu/persist/operation/auth/BCrypt.java:71: error: self-closing element not allowed
 * String strong_salt = BCrypt.gensalt(10)<br />
                                          ^
/home/jenkins/.jenkins/jobs/oxOrm/workspace/core/src/main/java/org/gluu/persist/operation/auth/BCrypt.java:72: error: self-closing element not allowed
 * String stronger_salt = BCrypt.gensalt(12)<br />
                                            ^
/home/jenkins/.jenkins/jobs/oxOrm/workspace/core/src/main/java/org/gluu/persist/PersistenceEntryManager.java:69: warning: no @param for <T>
    <T> List<T> findEntries(Object entry);
                ^
/home/jenkins/.jenkins/jobs/oxOrm/workspace/core/src/main/java/org/gluu/persist/operation/auth/PasswordDetails.java:20: warning: no @param for algorithm
    public PasswordDetails(PasswordEncryptionMethod algorithm, byte[] salt, byte[] password) {
           ^
/home/jenkins/.jenkins/jobs/oxOrm/workspace/core/src/main/java/org/gluu/persist/operation/auth/PasswordDetails.java:20: warning: no @param for salt
    public PasswordDetails(PasswordEncryptionMethod algorithm, byte[] salt, byte[] password) {
           ^
/home/jenkins/.jenkins/jobs/oxOrm/workspace/core/src/main/java/org/gluu/persist/operation/auth/PasswordDetails.java:20: warning: no @param for password
    public PasswordDetails(PasswordEncryptionMethod algorithm, byte[] salt, byte[] password) {
           ^
/home/jenkins/.jenkins/jobs/oxOrm/workspace/core/src/main/java/org/gluu/persist/operation/auth/PasswordDetails.java:29: warning: no @return
    public PasswordEncryptionMethod getAlgorithm() {
                                    ^
/home/jenkins/.jenkins/jobs/oxOrm/workspace/core/src/main/java/org/gluu/persist/operation/auth/PasswordDetails.java:36: warning: no @return
    public byte[] getSalt() {
                  ^
/home/jenkins/.jenkins/jobs/oxOrm/workspace/core/src/main/java/org/gluu/persist/operation/auth/PasswordDetails.java:43: warning: no @return
    public byte[] getPassword() {
                  ^
/home/jenkins/.jenkins/jobs/oxOrm/workspace/core/src/main/java/org/gluu/persist/operation/auth/PasswordEncryptionHelper.java:40: warning: no @param for credentials
    public static PasswordEncryptionMethod findAlgorithm(String credentials) {
                                           ^
/home/jenkins/.jenkins/jobs/oxOrm/workspace/core/src/main/java/org/gluu/persist/operation/auth/PasswordEncryptionHelper.java:40: warning: no @return
    public static PasswordEncryptionMethod findAlgorithm(String credentials) {
                                           ^
/home/jenkins/.jenkins/jobs/oxOrm/workspace/core/src/main/java/org/gluu/persist/operation/auth/PasswordEncryptionHelper.java:47: warning: no @param for credentials
    public static PasswordEncryptionMethod findAlgorithm(byte[] credentials) {
                                           ^
/home/jenkins/.jenkins/jobs/oxOrm/workspace/core/src/main/java/org/gluu/persist/operation/auth/PasswordEncryptionHelper.java:47: warning: no @return
    public static PasswordEncryptionMethod findAlgorithm(byte[] credentials) {
                                           ^
/home/jenkins/.jenkins/jobs/oxOrm/workspace/core/src/main/java/org/gluu/persist/operation/auth/PasswordEncryptionHelper.java:96: warning: no @param for credentials
    public static String createStoragePassword(String credentials, PasswordEncryptionMethod algorithm) {
                         ^
/home/jenkins/.jenkins/jobs/oxOrm/workspace/core/src/main/java/org/gluu/persist/operation/auth/PasswordEncryptionHelper.java:96: warning: no @param for algorithm
    public static String createStoragePassword(String credentials, PasswordEncryptionMethod algorithm) {
                         ^
/home/jenkins/.jenkins/jobs/oxOrm/workspace/core/src/main/java/org/gluu/persist/operation/auth/PasswordEncryptionHelper.java:96: warning: no @return
    public static String createStoragePassword(String credentials, PasswordEncryptionMethod algorithm) {
                         ^
/home/jenkins/.jenkins/jobs/oxOrm/workspace/core/src/main/java/org/gluu/persist/operation/auth/PasswordEncryptionHelper.java:106: warning: no @param for credentials
    public static byte[] createStoragePassword(byte[] credentials, PasswordEncryptionMethod algorithm) {
                         ^
/home/jenkins/.jenkins/jobs/oxOrm/workspace/core/src/main/java/org/gluu/persist/operation/auth/PasswordEncryptionHelper.java:106: warning: no @param for algorithm
    public static byte[] createStoragePassword(byte[] credentials, PasswordEncryptionMethod algorithm) {
                         ^
/home/jenkins/.jenkins/jobs/oxOrm/workspace/core/src/main/java/org/gluu/persist/operation/auth/PasswordEncryptionHelper.java:106: warning: no @return
    public static byte[] createStoragePassword(byte[] credentials, PasswordEncryptionMethod algorithm) {
                         ^
/home/jenkins/.jenkins/jobs/oxOrm/workspace/core/src/main/java/org/gluu/persist/operation/auth/PasswordEncryptionHelper.java:184: warning: no @param for receivedCredentials
    public static boolean compareCredentials(String receivedCredentials, String storedCredentials) {
                          ^
/home/jenkins/.jenkins/jobs/oxOrm/workspace/core/src/main/java/org/gluu/persist/operation/auth/PasswordEncryptionHelper.java:184: warning: no @param for storedCredentials
    public static boolean compareCredentials(String receivedCredentials, String storedCredentials) {
                          ^
/home/jenkins/.jenkins/jobs/oxOrm/workspace/core/src/main/java/org/gluu/persist/operation/auth/PasswordEncryptionHelper.java:184: warning: no @return
    public static boolean compareCredentials(String receivedCredentials, String storedCredentials) {
                          ^
/home/jenkins/.jenkins/jobs/oxOrm/workspace/core/src/main/java/org/gluu/persist/operation/auth/PasswordEncryptionHelper.java:191: warning: no @param for receivedCredentials
    public static boolean compareCredentials(byte[] receivedCredentials, byte[] storedCredentials) {
                          ^
/home/jenkins/.jenkins/jobs/oxOrm/workspace/core/src/main/java/org/gluu/persist/operation/auth/PasswordEncryptionHelper.java:191: warning: no @param for storedCredentials
    public static boolean compareCredentials(byte[] receivedCredentials, byte[] storedCredentials) {
                          ^
/home/jenkins/.jenkins/jobs/oxOrm/workspace/core/src/main/java/org/gluu/persist/operation/auth/PasswordEncryptionHelper.java:191: warning: no @return
    public static boolean compareCredentials(byte[] receivedCredentials, byte[] storedCredentials) {
                          ^
/home/jenkins/.jenkins/jobs/oxOrm/workspace/core/src/main/java/org/gluu/persist/operation/auth/PasswordEncryptionMethod.java:114: warning: no @param for algorithm
    public static PasswordEncryptionMethod getMethod(String algorithm) {
                                           ^
/home/jenkins/.jenkins/jobs/oxOrm/workspace/core/src/main/java/org/gluu/persist/operation/auth/PasswordEncryptionMethod.java:114: warning: no @return
    public static PasswordEncryptionMethod getMethod(String algorithm) {
                                           ^
/home/jenkins/.jenkins/jobs/oxOrm/workspace/core/src/main/java/org/gluu/persist/reflect/property/PropertyAccessor.java:19: warning: no @param for theClass
    Getter getGetter(Class<?> theClass, String propertyName) throws PropertyNotFoundException;
           ^
/home/jenkins/.jenkins/jobs/oxOrm/workspace/core/src/main/java/org/gluu/persist/reflect/property/PropertyAccessor.java:19: warning: no @param for propertyName
    Getter getGetter(Class<?> theClass, String propertyName) throws PropertyNotFoundException;
           ^
/home/jenkins/.jenkins/jobs/oxOrm/workspace/core/src/main/java/org/gluu/persist/reflect/property/PropertyAccessor.java:19: warning: no @return
    Getter getGetter(Class<?> theClass, String propertyName) throws PropertyNotFoundException;
           ^
/home/jenkins/.jenkins/jobs/oxOrm/workspace/core/src/main/java/org/gluu/persist/reflect/property/PropertyAccessor.java:24: warning: no @param for theClass
    Setter getSetter(Class<?> theClass, String propertyName) throws PropertyNotFoundException;
           ^
/home/jenkins/.jenkins/jobs/oxOrm/workspace/core/src/main/java/org/gluu/persist/reflect/property/PropertyAccessor.java:24: warning: no @param for propertyName
    Setter getSetter(Class<?> theClass, String propertyName) throws PropertyNotFoundException;
           ^
/home/jenkins/.jenkins/jobs/oxOrm/workspace/core/src/main/java/org/gluu/persist/reflect/property/PropertyAccessor.java:24: warning: no @return
    Setter getSetter(Class<?> theClass, String propertyName) throws PropertyNotFoundException;
           ^
/home/jenkins/.jenkins/jobs/oxOrm/workspace/core/src/main/java/org/gluu/persist/reflect/property/Getter.java:24: warning: no description for @throws
     * @throws BasePersistenceException
       ^
/home/jenkins/.jenkins/jobs/oxOrm/workspace/core/src/main/java/org/gluu/persist/reflect/property/Getter.java:31: warning: no @return
    Class<?> getReturnType();
             ^
/home/jenkins/.jenkins/jobs/oxOrm/workspace/core/src/main/java/org/gluu/persist/reflect/property/Getter.java:36: warning: no @return
    String getMethodName();
           ^
/home/jenkins/.jenkins/jobs/oxOrm/workspace/core/src/main/java/org/gluu/persist/reflect/property/Getter.java:41: warning: no @return
    Method getMethod();
           ^
/home/jenkins/.jenkins/jobs/oxOrm/workspace/core/src/main/java/org/gluu/persist/reflect/property/Setter.java:25: warning: no description for @throws
     * @throws BasePersistenceException
       ^
/home/jenkins/.jenkins/jobs/oxOrm/workspace/core/src/main/java/org/gluu/persist/reflect/property/Setter.java:32: warning: no @return
    String getMethodName();
           ^
/home/jenkins/.jenkins/jobs/oxOrm/workspace/core/src/main/java/org/gluu/persist/reflect/property/Setter.java:37: warning: no @return
    Method getMethod();
           ^
/home/jenkins/.jenkins/jobs/oxOrm/workspace/core/src/main/java/org/gluu/persist/reflect/property/PropertyAnnotationResolver.java:25: warning: no @param for theClass
    List<Annotation> getClassAnnotations(Class<?> theClass, Class<?>... allowedAnnotations);
                     ^
/home/jenkins/.jenkins/jobs/oxOrm/workspace/core/src/main/java/org/gluu/persist/reflect/property/PropertyAnnotationResolver.java:25: warning: no @param for allowedAnnotations
    List<Annotation> getClassAnnotations(Class<?> theClass, Class<?>... allowedAnnotations);
                     ^
/home/jenkins/.jenkins/jobs/oxOrm/workspace/core/src/main/java/org/gluu/persist/reflect/property/PropertyAnnotationResolver.java:25: warning: no @return
    List<Annotation> getClassAnnotations(Class<?> theClass, Class<?>... allowedAnnotations);
                     ^
/home/jenkins/.jenkins/jobs/oxOrm/workspace/core/src/main/java/org/gluu/persist/reflect/property/PropertyAnnotationResolver.java:30: warning: no @param for theClass
    List<Annotation> getPropertyAnnotations(Class<?> theClass, String propertyName, Class<?>... allowedAnnotations)
                     ^
/home/jenkins/.jenkins/jobs/oxOrm/workspace/core/src/main/java/org/gluu/persist/reflect/property/PropertyAnnotationResolver.java:30: warning: no @param for propertyName
    List<Annotation> getPropertyAnnotations(Class<?> theClass, String propertyName, Class<?>... allowedAnnotations)
                     ^
/home/jenkins/.jenkins/jobs/oxOrm/workspace/core/src/main/java/org/gluu/persist/reflect/property/PropertyAnnotationResolver.java:30: warning: no @param for allowedAnnotations
    List<Annotation> getPropertyAnnotations(Class<?> theClass, String propertyName, Class<?>... allowedAnnotations)
                     ^
/home/jenkins/.jenkins/jobs/oxOrm/workspace/core/src/main/java/org/gluu/persist/reflect/property/PropertyAnnotationResolver.java:30: warning: no @return
    List<Annotation> getPropertyAnnotations(Class<?> theClass, String propertyName, Class<?>... allowedAnnotations)
                     ^
/home/jenkins/.jenkins/jobs/oxOrm/workspace/core/src/main/java/org/gluu/persist/reflect/property/PropertyAnnotationResolver.java:36: warning: no @param for theClass
    Map<String, List<Annotation>> getPropertiesAnnotations(Class<?> theClass, Class<?>... allowedAnnotations);
                                  ^
/home/jenkins/.jenkins/jobs/oxOrm/workspace/core/src/main/java/org/gluu/persist/reflect/property/PropertyAnnotationResolver.java:36: warning: no @param for allowedAnnotations
    Map<String, List<Annotation>> getPropertiesAnnotations(Class<?> theClass, Class<?>... allowedAnnotations);
                                  ^
/home/jenkins/.jenkins/jobs/oxOrm/workspace/core/src/main/java/org/gluu/persist/reflect/property/PropertyAnnotationResolver.java:36: warning: no @return
    Map<String, List<Annotation>> getPropertiesAnnotations(Class<?> theClass, Class<?>... allowedAnnotations);
                                  ^
/home/jenkins/.jenkins/jobs/oxOrm/workspace/core/src/main/java/org/gluu/persist/reflect/util/ReflectHelper.java:152: error: self-closing element not allowed
     * <p/>
       ^
/home/jenkins/.jenkins/jobs/oxOrm/workspace/core/src/main/java/org/gluu/persist/reflect/util/ReflectHelper.java:179: error: self-closing element not allowed
     * <p/>
       ^
/home/jenkins/.jenkins/jobs/oxOrm/workspace/core/src/main/java/org/gluu/persist/reflect/util/ReflectHelper.java:203: error: self-closing element not allowed
     * <p/>
       ^
/home/jenkins/.jenkins/jobs/oxOrm/workspace/core/src/main/java/org/gluu/persist/reflect/util/ReflectHelper.java:314: warning: no @param for <T>
    public static <T> Constructor<T> getDefaultConstructor(Class<T> clazz) throws PropertyNotFoundException {
                                     ^

Command line was: /opt/java/amazon-corretto-11.0.7.10.1-linux-x64/bin/javadoc @options @packages

Refer to the generated Javadoc files in '/home/jenkins/.jenkins/jobs/oxOrm/workspace/core/target/site/apidocs' dir.

    at org.apache.maven.plugins.javadoc.AbstractJavadocMojo.executeJavadocCommandLine (AbstractJavadocMojo.java:5298)
    at org.apache.maven.plugins.javadoc.AbstractJavadocMojo.executeReport (AbstractJavadocMojo.java:2134)
    at org.apache.maven.plugins.javadoc.JavadocReport.generate (JavadocReport.java:134)
    at org.apache.maven.plugins.javadoc.JavadocReport.doExecute (JavadocReport.java:329)
    at org.apache.maven.plugins.javadoc.AbstractJavadocMojo.execute (AbstractJavadocMojo.java:1912)
    at org.apache.maven.plugin.DefaultBuildPluginManager.executeMojo (DefaultBuildPluginManager.java:137)
    at org.apache.maven.lifecycle.internal.MojoExecutor.execute (MojoExecutor.java:210)
    at org.apache.maven.lifecycle.internal.MojoExecutor.execute (MojoExecutor.java:156)
    at org.apache.maven.lifecycle.internal.MojoExecutor.execute (MojoExecutor.java:148)
    at org.apache.maven.lifecycle.internal.LifecycleModuleBuilder.buildProject (LifecycleModuleBuilder.java:117)
    at org.apache.maven.lifecycle.internal.LifecycleModuleBuilder.buildProject (LifecycleModuleBuilder.java:81)
    at org.apache.maven.lifecycle.internal.builder.singlethreaded.SingleThreadedBuilder.build (SingleThreadedBuilder.java:56)
    at org.apache.maven.lifecycle.internal.LifecycleStarter.execute (LifecycleStarter.java:128)
    at org.apache.maven.DefaultMaven.doExecute (DefaultMaven.java:305)
    at org.apache.maven.DefaultMaven.doExecute (DefaultMaven.java:192)
    at org.apache.maven.DefaultMaven.execute (DefaultMaven.java:105)
    at org.apache.maven.cli.MavenCli.execute (MavenCli.java:957)
    at org.apache.maven.cli.MavenCli.doMain (MavenCli.java:289)
    at org.apache.maven.cli.MavenCli.main (MavenCli.java:193)
    at jdk.internal.reflect.NativeMethodAccessorImpl.invoke0 (Native Method)
    at jdk.internal.reflect.NativeMethodAccessorImpl.invoke (NativeMethodAccessorImpl.java:62)
    at jdk.internal.reflect.DelegatingMethodAccessorImpl.invoke (DelegatingMethodAccessorImpl.java:43)
    at java.lang.reflect.Method.invoke (Method.java:566)
    at org.codehaus.plexus.classworlds.launcher.Launcher.launchEnhanced (Launcher.java:282)
    at org.codehaus.plexus.classworlds.launcher.Launcher.launch (Launcher.java:225)
    at org.codehaus.plexus.classworlds.launcher.Launcher.mainWithExitCode (Launcher.java:406)
    at org.codehaus.plexus.classworlds.launcher.Launcher.main (Launcher.java:347)
[INFO] 
[INFO] --- maven-site-plugin:2.1.1:site (default-site) @ gluu-orm-core ---
[WARNING] No URL defined for the project - decoration links will not be resolved
[INFO] 
[INFO] -----------------------< org.gluu:gluu-orm-ldap >-----------------------
[INFO] Building gluu-orm-ldap 4.3.0-SNAPSHOT                             [7/17]
[INFO] --------------------------------[ jar ]---------------------------------
[INFO] 
[INFO] --- maven-clean-plugin:2.5:clean (default-clean) @ gluu-orm-ldap ---
[INFO] Deleting /home/jenkins/.jenkins/jobs/oxOrm/workspace/ldap/target
[INFO] 
[INFO] --- maven-resources-plugin:2.6:resources (default-resources) @ gluu-orm-ldap ---
[INFO] Using 'UTF-8' encoding to copy filtered resources.
[INFO] Copying 1 resource
[INFO] 
[INFO] --- maven-compiler-plugin:2.3.2:compile (default-compile) @ gluu-orm-ldap ---
[INFO] Compiling 13 source files to /home/jenkins/.jenkins/jobs/oxOrm/workspace/ldap/target/classes
[INFO] 
[INFO] --- maven-resources-plugin:2.6:resources (default-resources) @ gluu-orm-ldap ---
[INFO] Using 'UTF-8' encoding to copy filtered resources.
[INFO] Copying 1 resource
[INFO] 
[INFO] --- maven-compiler-plugin:2.3.2:compile (default-compile) @ gluu-orm-ldap ---
[INFO] Nothing to compile - all classes are up to date
[INFO] 
[INFO] --- maven-resources-plugin:2.6:testResources (default-testResources) @ gluu-orm-ldap ---
[INFO] Using 'UTF-8' encoding to copy filtered resources.
[INFO] skip non existing resourceDirectory /home/jenkins/.jenkins/jobs/oxOrm/workspace/ldap/src/test/resources
[INFO] 
[INFO] --- maven-compiler-plugin:2.3.2:testCompile (default-testCompile) @ gluu-orm-ldap ---
[INFO] No sources to compile
[INFO] 
[INFO] --- maven-surefire-plugin:2.12.4:test (default-test) @ gluu-orm-ldap ---
[INFO] No tests to run.
[INFO] 
[INFO] --- maven-jar-plugin:2.4:jar (default-jar) @ gluu-orm-ldap ---
[INFO] Building jar: /home/jenkins/.jenkins/jobs/oxOrm/workspace/ldap/target/gluu-orm-ldap-4.3.0-SNAPSHOT.jar
[INFO] 
[INFO] --- maven-install-plugin:2.4:install (default-install) @ gluu-orm-ldap ---
[INFO] Installing /home/jenkins/.jenkins/jobs/oxOrm/workspace/ldap/target/gluu-orm-ldap-4.3.0-SNAPSHOT.jar to /var/www/html/maven/org/gluu/gluu-orm-ldap/4.3.0-SNAPSHOT/gluu-orm-ldap-4.3.0-SNAPSHOT.jar
[INFO] Installing /home/jenkins/.jenkins/jobs/oxOrm/workspace/ldap/pom.xml to /var/www/html/maven/org/gluu/gluu-orm-ldap/4.3.0-SNAPSHOT/gluu-orm-ldap-4.3.0-SNAPSHOT.pom
[INFO] 
[INFO] >>> maven-javadoc-plugin:3.0.1:javadoc (default-cli) > generate-sources @ gluu-orm-ldap >>>
[INFO] 
[INFO] <<< maven-javadoc-plugin:3.0.1:javadoc (default-cli) < generate-sources @ gluu-orm-ldap <<<
[INFO] 
[INFO] 
[INFO] --- maven-javadoc-plugin:3.0.1:javadoc (default-cli) @ gluu-orm-ldap ---
[INFO] 
Loading source files for package org.gluu.persist.ldap.exception...
Loading source files for package org.gluu.persist.ldap.impl...
Loading source files for package org.gluu.persist.ldap.model...
Loading source files for package org.gluu.persist.ldap.operation...
Loading source files for package org.gluu.persist.ldap.operation.impl...
Loading source files for package org.gluu.persist.ldap.operation.watch...
Constructing Javadoc information...
Standard Doclet version 11.0.7
Building tree for all the packages and classes...
Generating /home/jenkins/.jenkins/jobs/oxOrm/workspace/ldap/target/site/apidocs/org/gluu/persist/ldap/exception/InvalidSimplePageControlException.html...
Generating /home/jenkins/.jenkins/jobs/oxOrm/workspace/ldap/target/site/apidocs/org/gluu/persist/ldap/impl/LdapBatchOperationWraper.html...
Generating /home/jenkins/.jenkins/jobs/oxOrm/workspace/ldap/target/site/apidocs/org/gluu/persist/ldap/impl/LdapEntryManager.html...
Generating /home/jenkins/.jenkins/jobs/oxOrm/workspace/ldap/target/site/apidocs/org/gluu/persist/ldap/impl/LdapEntryManagerFactory.html...
Generating /home/jenkins/.jenkins/jobs/oxOrm/workspace/ldap/target/site/apidocs/org/gluu/persist/ldap/impl/LdapFilterConverter.html...
Generating /home/jenkins/.jenkins/jobs/oxOrm/workspace/ldap/target/site/apidocs/org/gluu/persist/ldap/impl/LdapSearchScopeConverter.html...
Generating /home/jenkins/.jenkins/jobs/oxOrm/workspace/ldap/target/site/apidocs/org/gluu/persist/ldap/impl/LdifDataUtility.html...
Generating /home/jenkins/.jenkins/jobs/oxOrm/workspace/ldap/target/site/apidocs/org/gluu/persist/ldap/model/MailUniquenessConfiguration.html...
Generating /home/jenkins/.jenkins/jobs/oxOrm/workspace/ldap/target/site/apidocs/org/gluu/persist/ldap/operation/LdapOperationService.html...
Generating /home/jenkins/.jenkins/jobs/oxOrm/workspace/ldap/target/site/apidocs/org/gluu/persist/ldap/operation/impl/LdapAuthConnectionProvider.html...
Generating /home/jenkins/.jenkins/jobs/oxOrm/workspace/ldap/target/site/apidocs/org/gluu/persist/ldap/operation/impl/LdapConnectionProvider.html...
Generating /home/jenkins/.jenkins/jobs/oxOrm/workspace/ldap/target/site/apidocs/org/gluu/persist/ldap/operation/impl/LdapOperationServiceImpl.html...
Generating /home/jenkins/.jenkins/jobs/oxOrm/workspace/ldap/target/site/apidocs/org/gluu/persist/ldap/operation/watch/OperationDurationUtil.html...
Generating /home/jenkins/.jenkins/jobs/oxOrm/workspace/ldap/target/site/apidocs/org/gluu/persist/ldap/exception/package-summary.html...
Generating /home/jenkins/.jenkins/jobs/oxOrm/workspace/ldap/target/site/apidocs/org/gluu/persist/ldap/exception/package-tree.html...
Generating /home/jenkins/.jenkins/jobs/oxOrm/workspace/ldap/target/site/apidocs/org/gluu/persist/ldap/impl/package-summary.html...
Generating /home/jenkins/.jenkins/jobs/oxOrm/workspace/ldap/target/site/apidocs/org/gluu/persist/ldap/impl/package-tree.html...
Generating /home/jenkins/.jenkins/jobs/oxOrm/workspace/ldap/target/site/apidocs/org/gluu/persist/ldap/model/package-summary.html...
Generating /home/jenkins/.jenkins/jobs/oxOrm/workspace/ldap/target/site/apidocs/org/gluu/persist/ldap/model/package-tree.html...
Generating /home/jenkins/.jenkins/jobs/oxOrm/workspace/ldap/target/site/apidocs/org/gluu/persist/ldap/operation/package-summary.html...
Generating /home/jenkins/.jenkins/jobs/oxOrm/workspace/ldap/target/site/apidocs/org/gluu/persist/ldap/operation/package-tree.html...
Generating /home/jenkins/.jenkins/jobs/oxOrm/workspace/ldap/target/site/apidocs/org/gluu/persist/ldap/operation/impl/package-summary.html...
Generating /home/jenkins/.jenkins/jobs/oxOrm/workspace/ldap/target/site/apidocs/org/gluu/persist/ldap/operation/impl/package-tree.html...
Generating /home/jenkins/.jenkins/jobs/oxOrm/workspace/ldap/target/site/apidocs/org/gluu/persist/ldap/operation/watch/package-summary.html...
Generating /home/jenkins/.jenkins/jobs/oxOrm/workspace/ldap/target/site/apidocs/org/gluu/persist/ldap/operation/watch/package-tree.html...
Generating /home/jenkins/.jenkins/jobs/oxOrm/workspace/ldap/target/site/apidocs/constant-values.html...
Generating /home/jenkins/.jenkins/jobs/oxOrm/workspace/ldap/target/site/apidocs/serialized-form.html...
Generating /home/jenkins/.jenkins/jobs/oxOrm/workspace/ldap/target/site/apidocs/org/gluu/persist/ldap/exception/class-use/InvalidSimplePageControlException.html...
Generating /home/jenkins/.jenkins/jobs/oxOrm/workspace/ldap/target/site/apidocs/org/gluu/persist/ldap/impl/class-use/LdapBatchOperationWraper.html...
Generating /home/jenkins/.jenkins/jobs/oxOrm/workspace/ldap/target/site/apidocs/org/gluu/persist/ldap/impl/class-use/LdapEntryManager.html...
Generating /home/jenkins/.jenkins/jobs/oxOrm/workspace/ldap/target/site/apidocs/org/gluu/persist/ldap/impl/class-use/LdapEntryManagerFactory.html...
Generating /home/jenkins/.jenkins/jobs/oxOrm/workspace/ldap/target/site/apidocs/org/gluu/persist/ldap/impl/class-use/LdapFilterConverter.html...
Generating /home/jenkins/.jenkins/jobs/oxOrm/workspace/ldap/target/site/apidocs/org/gluu/persist/ldap/impl/class-use/LdapSearchScopeConverter.html...
Generating /home/jenkins/.jenkins/jobs/oxOrm/workspace/ldap/target/site/apidocs/org/gluu/persist/ldap/impl/class-use/LdifDataUtility.html...
Generating /home/jenkins/.jenkins/jobs/oxOrm/workspace/ldap/target/site/apidocs/org/gluu/persist/ldap/model/class-use/MailUniquenessConfiguration.html...
Generating /home/jenkins/.jenkins/jobs/oxOrm/workspace/ldap/target/site/apidocs/org/gluu/persist/ldap/operation/class-use/LdapOperationService.html...
Generating /home/jenkins/.jenkins/jobs/oxOrm/workspace/ldap/target/site/apidocs/org/gluu/persist/ldap/operation/impl/class-use/LdapAuthConnectionProvider.html...
Generating /home/jenkins/.jenkins/jobs/oxOrm/workspace/ldap/target/site/apidocs/org/gluu/persist/ldap/operation/impl/class-use/LdapOperationServiceImpl.html...
Generating /home/jenkins/.jenkins/jobs/oxOrm/workspace/ldap/target/site/apidocs/org/gluu/persist/ldap/operation/impl/class-use/LdapConnectionProvider.html...
Generating /home/jenkins/.jenkins/jobs/oxOrm/workspace/ldap/target/site/apidocs/org/gluu/persist/ldap/operation/watch/class-use/OperationDurationUtil.html...
Generating /home/jenkins/.jenkins/jobs/oxOrm/workspace/ldap/target/site/apidocs/org/gluu/persist/ldap/exception/package-use.html...
Generating /home/jenkins/.jenkins/jobs/oxOrm/workspace/ldap/target/site/apidocs/org/gluu/persist/ldap/impl/package-use.html...
Generating /home/jenkins/.jenkins/jobs/oxOrm/workspace/ldap/target/site/apidocs/org/gluu/persist/ldap/model/package-use.html...
Generating /home/jenkins/.jenkins/jobs/oxOrm/workspace/ldap/target/site/apidocs/org/gluu/persist/ldap/operation/package-use.html...
Generating /home/jenkins/.jenkins/jobs/oxOrm/workspace/ldap/target/site/apidocs/org/gluu/persist/ldap/operation/impl/package-use.html...
Generating /home/jenkins/.jenkins/jobs/oxOrm/workspace/ldap/target/site/apidocs/org/gluu/persist/ldap/operation/watch/package-use.html...
Building index for all the packages and classes...
Generating /home/jenkins/.jenkins/jobs/oxOrm/workspace/ldap/target/site/apidocs/overview-tree.html...
Generating /home/jenkins/.jenkins/jobs/oxOrm/workspace/ldap/target/site/apidocs/index-all.html...
Building index for all classes...
Generating /home/jenkins/.jenkins/jobs/oxOrm/workspace/ldap/target/site/apidocs/allclasses-index.html...
Generating /home/jenkins/.jenkins/jobs/oxOrm/workspace/ldap/target/site/apidocs/allpackages-index.html...
Generating /home/jenkins/.jenkins/jobs/oxOrm/workspace/ldap/target/site/apidocs/deprecated-list.html...
Building index for all classes...
Generating /home/jenkins/.jenkins/jobs/oxOrm/workspace/ldap/target/site/apidocs/allclasses.html...
Generating /home/jenkins/.jenkins/jobs/oxOrm/workspace/ldap/target/site/apidocs/allclasses.html...
Generating /home/jenkins/.jenkins/jobs/oxOrm/workspace/ldap/target/site/apidocs/index.html...
Generating /home/jenkins/.jenkins/jobs/oxOrm/workspace/ldap/target/site/apidocs/overview-summary.html...
Generating /home/jenkins/.jenkins/jobs/oxOrm/workspace/ldap/target/site/apidocs/help-doc.html...
4 errors
33 warnings
[ERROR] Error while creating javadoc report: 
Exit code: 1 - javadoc: error - The code being documented uses modules but the packages defined in https://docs.oracle.com/javase/8/docs/api/ are in the unnamed module.
/home/jenkins/.jenkins/jobs/oxOrm/workspace/ldap/src/main/java/org/gluu/persist/ldap/operation/LdapOperationService.java:71: warning: no description for @param
     * @param dn
       ^
/home/jenkins/.jenkins/jobs/oxOrm/workspace/ldap/src/main/java/org/gluu/persist/ldap/operation/LdapOperationService.java:72: warning: no description for @param
     * @param attributes
       ^
/home/jenkins/.jenkins/jobs/oxOrm/workspace/ldap/src/main/java/org/gluu/persist/ldap/operation/LdapOperationService.java:74: warning: no description for @throws
     * @throws ConnectionException
       ^
/home/jenkins/.jenkins/jobs/oxOrm/workspace/ldap/src/main/java/org/gluu/persist/ldap/operation/LdapOperationService.java:76: warning: no @throws for org.gluu.persist.exception.operation.SearchException
    SearchResultEntry lookup(String dn, String... attributes) throws ConnectionException, SearchException;
                      ^
/home/jenkins/.jenkins/jobs/oxOrm/workspace/ldap/src/main/java/org/gluu/persist/ldap/operation/LdapOperationService.java:86: warning: no description for @throws
     * @throws DuplicateEntryException
       ^
/home/jenkins/.jenkins/jobs/oxOrm/workspace/ldap/src/main/java/org/gluu/persist/ldap/operation/LdapOperationService.java:87: warning: no description for @throws
     * @throws ConnectionException
       ^
/home/jenkins/.jenkins/jobs/oxOrm/workspace/ldap/src/main/java/org/gluu/persist/ldap/operation/LdapOperationService.java:88: warning: no description for @throws
     * @throws DuplicateEntryException
       ^
/home/jenkins/.jenkins/jobs/oxOrm/workspace/ldap/src/main/java/org/gluu/persist/ldap/operation/LdapOperationService.java:89: warning: no description for @throws
     * @throws ConnectionException
       ^
/home/jenkins/.jenkins/jobs/oxOrm/workspace/ldap/src/main/java/org/gluu/persist/ldap/operation/LdapOperationService.java:90: error: exception not thrown: com.unboundid.ldap.sdk.LDAPException
     * @throws LDAPException
               ^
/home/jenkins/.jenkins/jobs/oxOrm/workspace/ldap/src/main/java/org/gluu/persist/ldap/operation/LdapOperationService.java:90: warning: no description for @throws
     * @throws LDAPException
       ^
/home/jenkins/.jenkins/jobs/oxOrm/workspace/ldap/src/main/java/org/gluu/persist/ldap/operation/LdapOperationService.java:97: warning: no description for @param
     * @param dn
       ^
/home/jenkins/.jenkins/jobs/oxOrm/workspace/ldap/src/main/java/org/gluu/persist/ldap/operation/LdapOperationService.java:98: warning: no description for @param
     * @param modifications
       ^
/home/jenkins/.jenkins/jobs/oxOrm/workspace/ldap/src/main/java/org/gluu/persist/ldap/operation/LdapOperationService.java:99: warning: no description for @return
     * @return
       ^
/home/jenkins/.jenkins/jobs/oxOrm/workspace/ldap/src/main/java/org/gluu/persist/ldap/operation/LdapOperationService.java:100: warning: no description for @throws
     * @throws ConnectionException
       ^
/home/jenkins/.jenkins/jobs/oxOrm/workspace/ldap/src/main/java/org/gluu/persist/ldap/operation/LdapOperationService.java:101: warning: no description for @throws
     * @throws DuplicateEntryException
       ^
/home/jenkins/.jenkins/jobs/oxOrm/workspace/ldap/src/main/java/org/gluu/persist/ldap/operation/LdapOperationService.java:108: warning: no description for @param
     * @param dn
       ^
/home/jenkins/.jenkins/jobs/oxOrm/workspace/ldap/src/main/java/org/gluu/persist/ldap/operation/LdapOperationService.java:109: warning: no description for @throws
     * @throws ConnectionException
       ^
/home/jenkins/.jenkins/jobs/oxOrm/workspace/ldap/src/main/java/org/gluu/persist/ldap/operation/LdapOperationService.java:111: warning: no @return
    boolean delete(String dn) throws ConnectionException;
            ^
/home/jenkins/.jenkins/jobs/oxOrm/workspace/ldap/src/main/java/org/gluu/persist/ldap/operation/LdapOperationService.java:116: warning: no description for @param
     * @param dn
       ^
/home/jenkins/.jenkins/jobs/oxOrm/workspace/ldap/src/main/java/org/gluu/persist/ldap/operation/LdapOperationService.java:117: warning: no description for @return
     * @return 
       ^
/home/jenkins/.jenkins/jobs/oxOrm/workspace/ldap/src/main/java/org/gluu/persist/ldap/operation/LdapOperationService.java:118: warning: no description for @throws
     * @throws ConnectionException
       ^
/home/jenkins/.jenkins/jobs/oxOrm/workspace/ldap/src/main/java/org/gluu/persist/ldap/operation/impl/LdapConnectionProvider.java:102: warning: no description for @throws
     * @throws NumberFormatException
       ^
/home/jenkins/.jenkins/jobs/oxOrm/workspace/ldap/src/main/java/org/gluu/persist/ldap/operation/impl/LdapConnectionProvider.java:103: warning: no description for @throws
     * @throws LDAPException
       ^
/home/jenkins/.jenkins/jobs/oxOrm/workspace/ldap/src/main/java/org/gluu/persist/ldap/operation/impl/LdapConnectionProvider.java:104: warning: no description for @throws
     * @throws GeneralSecurityException
       ^
/home/jenkins/.jenkins/jobs/oxOrm/workspace/ldap/src/main/java/org/gluu/persist/ldap/operation/impl/LdapConnectionProvider.java:105: error: reference not found
     * @throws EncryptionException
       ^
/home/jenkins/.jenkins/jobs/oxOrm/workspace/ldap/src/main/java/org/gluu/persist/ldap/operation/impl/LdapConnectionProvider.java:105: warning: no description for @throws
     * @throws EncryptionException
       ^
/home/jenkins/.jenkins/jobs/oxOrm/workspace/ldap/src/main/java/org/gluu/persist/ldap/operation/impl/LdapConnectionProvider.java:106: error: reference not found
     * @throws EncryptionException
       ^
/home/jenkins/.jenkins/jobs/oxOrm/workspace/ldap/src/main/java/org/gluu/persist/ldap/operation/impl/LdapConnectionProvider.java:106: warning: no description for @throws
     * @throws EncryptionException
       ^
/home/jenkins/.jenkins/jobs/oxOrm/workspace/ldap/src/main/java/org/gluu/persist/ldap/operation/impl/LdapConnectionProvider.java:108: warning: no @param for props
    protected void init(Properties props) throws NumberFormatException, LDAPException, GeneralSecurityException {
                   ^
/home/jenkins/.jenkins/jobs/oxOrm/workspace/ldap/src/main/java/org/gluu/persist/ldap/operation/impl/LdapConnectionProvider.java:416: warning: no description for @throws
     * @throws LDAPException
       ^
/home/jenkins/.jenkins/jobs/oxOrm/workspace/ldap/src/main/java/org/gluu/persist/ldap/operation/impl/LdapConnectionProvider.java:433: warning: no description for @param
     * @param connection
       ^
/home/jenkins/.jenkins/jobs/oxOrm/workspace/ldap/src/main/java/org/gluu/persist/ldap/operation/impl/LdapConnectionProvider.java:442: warning: no description for @param
     * @param connection
       ^
/home/jenkins/.jenkins/jobs/oxOrm/workspace/ldap/src/main/java/org/gluu/persist/ldap/operation/impl/LdapConnectionProvider.java:454: warning: no description for @param
     * @param connection
       ^
/home/jenkins/.jenkins/jobs/oxOrm/workspace/ldap/src/main/java/org/gluu/persist/ldap/operation/impl/LdapOperationServiceImpl.java:720: warning: no description for @param
     * @param modifyRequest
       ^
/home/jenkins/.jenkins/jobs/oxOrm/workspace/ldap/src/main/java/org/gluu/persist/ldap/operation/impl/LdapOperationServiceImpl.java:722: warning: no description for @throws
     * @throws DuplicateEntryException
       ^
/home/jenkins/.jenkins/jobs/oxOrm/workspace/ldap/src/main/java/org/gluu/persist/ldap/operation/impl/LdapOperationServiceImpl.java:723: warning: no description for @throws
     * @throws ConnectionException
       ^

Command line was: /opt/java/amazon-corretto-11.0.7.10.1-linux-x64/bin/javadoc @options @packages

Refer to the generated Javadoc files in '/home/jenkins/.jenkins/jobs/oxOrm/workspace/ldap/target/site/apidocs' dir.

org.apache.maven.reporting.MavenReportException: 
Exit code: 1 - javadoc: error - The code being documented uses modules but the packages defined in https://docs.oracle.com/javase/8/docs/api/ are in the unnamed module.
/home/jenkins/.jenkins/jobs/oxOrm/workspace/ldap/src/main/java/org/gluu/persist/ldap/operation/LdapOperationService.java:71: warning: no description for @param
     * @param dn
       ^
/home/jenkins/.jenkins/jobs/oxOrm/workspace/ldap/src/main/java/org/gluu/persist/ldap/operation/LdapOperationService.java:72: warning: no description for @param
     * @param attributes
       ^
/home/jenkins/.jenkins/jobs/oxOrm/workspace/ldap/src/main/java/org/gluu/persist/ldap/operation/LdapOperationService.java:74: warning: no description for @throws
     * @throws ConnectionException
       ^
/home/jenkins/.jenkins/jobs/oxOrm/workspace/ldap/src/main/java/org/gluu/persist/ldap/operation/LdapOperationService.java:76: warning: no @throws for org.gluu.persist.exception.operation.SearchException
    SearchResultEntry lookup(String dn, String... attributes) throws ConnectionException, SearchException;
                      ^
/home/jenkins/.jenkins/jobs/oxOrm/workspace/ldap/src/main/java/org/gluu/persist/ldap/operation/LdapOperationService.java:86: warning: no description for @throws
     * @throws DuplicateEntryException
       ^
/home/jenkins/.jenkins/jobs/oxOrm/workspace/ldap/src/main/java/org/gluu/persist/ldap/operation/LdapOperationService.java:87: warning: no description for @throws
     * @throws ConnectionException
       ^
/home/jenkins/.jenkins/jobs/oxOrm/workspace/ldap/src/main/java/org/gluu/persist/ldap/operation/LdapOperationService.java:88: warning: no description for @throws
     * @throws DuplicateEntryException
       ^
/home/jenkins/.jenkins/jobs/oxOrm/workspace/ldap/src/main/java/org/gluu/persist/ldap/operation/LdapOperationService.java:89: warning: no description for @throws
     * @throws ConnectionException
       ^
/home/jenkins/.jenkins/jobs/oxOrm/workspace/ldap/src/main/java/org/gluu/persist/ldap/operation/LdapOperationService.java:90: error: exception not thrown: com.unboundid.ldap.sdk.LDAPException
     * @throws LDAPException
               ^
/home/jenkins/.jenkins/jobs/oxOrm/workspace/ldap/src/main/java/org/gluu/persist/ldap/operation/LdapOperationService.java:90: warning: no description for @throws
     * @throws LDAPException
       ^
/home/jenkins/.jenkins/jobs/oxOrm/workspace/ldap/src/main/java/org/gluu/persist/ldap/operation/LdapOperationService.java:97: warning: no description for @param
     * @param dn
       ^
/home/jenkins/.jenkins/jobs/oxOrm/workspace/ldap/src/main/java/org/gluu/persist/ldap/operation/LdapOperationService.java:98: warning: no description for @param
     * @param modifications
       ^
/home/jenkins/.jenkins/jobs/oxOrm/workspace/ldap/src/main/java/org/gluu/persist/ldap/operation/LdapOperationService.java:99: warning: no description for @return
     * @return
       ^
/home/jenkins/.jenkins/jobs/oxOrm/workspace/ldap/src/main/java/org/gluu/persist/ldap/operation/LdapOperationService.java:100: warning: no description for @throws
     * @throws ConnectionException
       ^
/home/jenkins/.jenkins/jobs/oxOrm/workspace/ldap/src/main/java/org/gluu/persist/ldap/operation/LdapOperationService.java:101: warning: no description for @throws
     * @throws DuplicateEntryException
       ^
/home/jenkins/.jenkins/jobs/oxOrm/workspace/ldap/src/main/java/org/gluu/persist/ldap/operation/LdapOperationService.java:108: warning: no description for @param
     * @param dn
       ^
/home/jenkins/.jenkins/jobs/oxOrm/workspace/ldap/src/main/java/org/gluu/persist/ldap/operation/LdapOperationService.java:109: warning: no description for @throws
     * @throws ConnectionException
       ^
/home/jenkins/.jenkins/jobs/oxOrm/workspace/ldap/src/main/java/org/gluu/persist/ldap/operation/LdapOperationService.java:111: warning: no @return
    boolean delete(String dn) throws ConnectionException;
            ^
/home/jenkins/.jenkins/jobs/oxOrm/workspace/ldap/src/main/java/org/gluu/persist/ldap/operation/LdapOperationService.java:116: warning: no description for @param
     * @param dn
       ^
/home/jenkins/.jenkins/jobs/oxOrm/workspace/ldap/src/main/java/org/gluu/persist/ldap/operation/LdapOperationService.java:117: warning: no description for @return
     * @return 
       ^
/home/jenkins/.jenkins/jobs/oxOrm/workspace/ldap/src/main/java/org/gluu/persist/ldap/operation/LdapOperationService.java:118: warning: no description for @throws
     * @throws ConnectionException
       ^
/home/jenkins/.jenkins/jobs/oxOrm/workspace/ldap/src/main/java/org/gluu/persist/ldap/operation/impl/LdapConnectionProvider.java:102: warning: no description for @throws
     * @throws NumberFormatException
       ^
/home/jenkins/.jenkins/jobs/oxOrm/workspace/ldap/src/main/java/org/gluu/persist/ldap/operation/impl/LdapConnectionProvider.java:103: warning: no description for @throws
     * @throws LDAPException
       ^
/home/jenkins/.jenkins/jobs/oxOrm/workspace/ldap/src/main/java/org/gluu/persist/ldap/operation/impl/LdapConnectionProvider.java:104: warning: no description for @throws
     * @throws GeneralSecurityException
       ^
/home/jenkins/.jenkins/jobs/oxOrm/workspace/ldap/src/main/java/org/gluu/persist/ldap/operation/impl/LdapConnectionProvider.java:105: error: reference not found
     * @throws EncryptionException
       ^
/home/jenkins/.jenkins/jobs/oxOrm/workspace/ldap/src/main/java/org/gluu/persist/ldap/operation/impl/LdapConnectionProvider.java:105: warning: no description for @throws
     * @throws EncryptionException
       ^
/home/jenkins/.jenkins/jobs/oxOrm/workspace/ldap/src/main/java/org/gluu/persist/ldap/operation/impl/LdapConnectionProvider.java:106: error: reference not found
     * @throws EncryptionException
       ^
/home/jenkins/.jenkins/jobs/oxOrm/workspace/ldap/src/main/java/org/gluu/persist/ldap/operation/impl/LdapConnectionProvider.java:106: warning: no description for @throws
     * @throws EncryptionException
       ^
/home/jenkins/.jenkins/jobs/oxOrm/workspace/ldap/src/main/java/org/gluu/persist/ldap/operation/impl/LdapConnectionProvider.java:108: warning: no @param for props
    protected void init(Properties props) throws NumberFormatException, LDAPException, GeneralSecurityException {
                   ^
/home/jenkins/.jenkins/jobs/oxOrm/workspace/ldap/src/main/java/org/gluu/persist/ldap/operation/impl/LdapConnectionProvider.java:416: warning: no description for @throws
     * @throws LDAPException
       ^
/home/jenkins/.jenkins/jobs/oxOrm/workspace/ldap/src/main/java/org/gluu/persist/ldap/operation/impl/LdapConnectionProvider.java:433: warning: no description for @param
     * @param connection
       ^
/home/jenkins/.jenkins/jobs/oxOrm/workspace/ldap/src/main/java/org/gluu/persist/ldap/operation/impl/LdapConnectionProvider.java:442: warning: no description for @param
     * @param connection
       ^
/home/jenkins/.jenkins/jobs/oxOrm/workspace/ldap/src/main/java/org/gluu/persist/ldap/operation/impl/LdapConnectionProvider.java:454: warning: no description for @param
     * @param connection
       ^
/home/jenkins/.jenkins/jobs/oxOrm/workspace/ldap/src/main/java/org/gluu/persist/ldap/operation/impl/LdapOperationServiceImpl.java:720: warning: no description for @param
     * @param modifyRequest
       ^
/home/jenkins/.jenkins/jobs/oxOrm/workspace/ldap/src/main/java/org/gluu/persist/ldap/operation/impl/LdapOperationServiceImpl.java:722: warning: no description for @throws
     * @throws DuplicateEntryException
       ^
/home/jenkins/.jenkins/jobs/oxOrm/workspace/ldap/src/main/java/org/gluu/persist/ldap/operation/impl/LdapOperationServiceImpl.java:723: warning: no description for @throws
     * @throws ConnectionException
       ^

Command line was: /opt/java/amazon-corretto-11.0.7.10.1-linux-x64/bin/javadoc @options @packages

Refer to the generated Javadoc files in '/home/jenkins/.jenkins/jobs/oxOrm/workspace/ldap/target/site/apidocs' dir.

    at org.apache.maven.plugins.javadoc.AbstractJavadocMojo.executeJavadocCommandLine (AbstractJavadocMojo.java:5298)
    at org.apache.maven.plugins.javadoc.AbstractJavadocMojo.executeReport (AbstractJavadocMojo.java:2134)
    at org.apache.maven.plugins.javadoc.JavadocReport.generate (JavadocReport.java:134)
    at org.apache.maven.plugins.javadoc.JavadocReport.doExecute (JavadocReport.java:329)
    at org.apache.maven.plugins.javadoc.AbstractJavadocMojo.execute (AbstractJavadocMojo.java:1912)
    at org.apache.maven.plugin.DefaultBuildPluginManager.executeMojo (DefaultBuildPluginManager.java:137)
    at org.apache.maven.lifecycle.internal.MojoExecutor.execute (MojoExecutor.java:210)
    at org.apache.maven.lifecycle.internal.MojoExecutor.execute (MojoExecutor.java:156)
    at org.apache.maven.lifecycle.internal.MojoExecutor.execute (MojoExecutor.java:148)
    at org.apache.maven.lifecycle.internal.LifecycleModuleBuilder.buildProject (LifecycleModuleBuilder.java:117)
    at org.apache.maven.lifecycle.internal.LifecycleModuleBuilder.buildProject (LifecycleModuleBuilder.java:81)
    at org.apache.maven.lifecycle.internal.builder.singlethreaded.SingleThreadedBuilder.build (SingleThreadedBuilder.java:56)
    at org.apache.maven.lifecycle.internal.LifecycleStarter.execute (LifecycleStarter.java:128)
    at org.apache.maven.DefaultMaven.doExecute (DefaultMaven.java:305)
    at org.apache.maven.DefaultMaven.doExecute (DefaultMaven.java:192)
    at org.apache.maven.DefaultMaven.execute (DefaultMaven.java:105)
    at org.apache.maven.cli.MavenCli.execute (MavenCli.java:957)
    at org.apache.maven.cli.MavenCli.doMain (MavenCli.java:289)
    at org.apache.maven.cli.MavenCli.main (MavenCli.java:193)
    at jdk.internal.reflect.NativeMethodAccessorImpl.invoke0 (Native Method)
    at jdk.internal.reflect.NativeMethodAccessorImpl.invoke (NativeMethodAccessorImpl.java:62)
    at jdk.internal.reflect.DelegatingMethodAccessorImpl.invoke (DelegatingMethodAccessorImpl.java:43)
    at java.lang.reflect.Method.invoke (Method.java:566)
    at org.codehaus.plexus.classworlds.launcher.Launcher.launchEnhanced (Launcher.java:282)
    at org.codehaus.plexus.classworlds.launcher.Launcher.launch (Launcher.java:225)
    at org.codehaus.plexus.classworlds.launcher.Launcher.mainWithExitCode (Launcher.java:406)
    at org.codehaus.plexus.classworlds.launcher.Launcher.main (Launcher.java:347)
[INFO] 
[INFO] --- maven-site-plugin:2.1.1:site (default-site) @ gluu-orm-ldap ---
[WARNING] No URL defined for the project - decoration links will not be resolved
[INFO] 
[INFO] --------------------< org.gluu:gluu-orm-couchbase >---------------------
[INFO] Building gluu-orm-couchbase 4.3.0-SNAPSHOT                        [8/17]
[INFO] --------------------------------[ jar ]---------------------------------
[INFO] 
[INFO] --- maven-clean-plugin:2.5:clean (default-clean) @ gluu-orm-couchbase ---
[INFO] Deleting /home/jenkins/.jenkins/jobs/oxOrm/workspace/couchbase/target
[INFO] 
[INFO] --- maven-resources-plugin:2.6:resources (default-resources) @ gluu-orm-couchbase ---
[INFO] Using 'UTF-8' encoding to copy filtered resources.
[INFO] Copying 1 resource
[INFO] 
[INFO] --- maven-compiler-plugin:2.3.2:compile (default-compile) @ gluu-orm-couchbase ---
[INFO] Compiling 13 source files to /home/jenkins/.jenkins/jobs/oxOrm/workspace/couchbase/target/classes
[INFO] 
[INFO] --- maven-resources-plugin:2.6:resources (default-resources) @ gluu-orm-couchbase ---
[INFO] Using 'UTF-8' encoding to copy filtered resources.
[INFO] Copying 1 resource
[INFO] 
[INFO] --- maven-compiler-plugin:2.3.2:compile (default-compile) @ gluu-orm-couchbase ---
[INFO] Nothing to compile - all classes are up to date
[INFO] 
[INFO] --- maven-resources-plugin:2.6:testResources (default-testResources) @ gluu-orm-couchbase ---
[INFO] Using 'UTF-8' encoding to copy filtered resources.
[INFO] skip non existing resourceDirectory /home/jenkins/.jenkins/jobs/oxOrm/workspace/couchbase/src/test/resources
[INFO] 
[INFO] --- maven-compiler-plugin:2.3.2:testCompile (default-testCompile) @ gluu-orm-couchbase ---
[INFO] Compiling 2 source files to /home/jenkins/.jenkins/jobs/oxOrm/workspace/couchbase/target/test-classes
[INFO] 
[INFO] --- maven-surefire-plugin:2.12.4:test (default-test) @ gluu-orm-couchbase ---
[INFO] Surefire report directory: /home/jenkins/.jenkins/jobs/oxOrm/workspace/couchbase/target/surefire-reports

-------------------------------------------------------
 T E S T S
-------------------------------------------------------
Running TestSuite
Configuring TestNG with: org.apache.maven.surefire.testng.conf.TestNG652Configurator@3b084709
SLF4J: Failed to load class "org.slf4j.impl.StaticLoggerBinder".
SLF4J: Defaulting to no-operation (NOP) logger implementation
SLF4J: See http://www.slf4j.org/codes.html#StaticLoggerBinder for further details.
Tests run: 21, Failures: 0, Errors: 0, Skipped: 0, Time elapsed: 0.961 sec

Results :

Tests run: 21, Failures: 0, Errors: 0, Skipped: 0

[INFO] 
[INFO] --- maven-jar-plugin:2.4:jar (default-jar) @ gluu-orm-couchbase ---
[INFO] Building jar: /home/jenkins/.jenkins/jobs/oxOrm/workspace/couchbase/target/gluu-orm-couchbase-4.3.0-SNAPSHOT.jar
[INFO] 
[INFO] --- maven-install-plugin:2.4:install (default-install) @ gluu-orm-couchbase ---
[INFO] Installing /home/jenkins/.jenkins/jobs/oxOrm/workspace/couchbase/target/gluu-orm-couchbase-4.3.0-SNAPSHOT.jar to /var/www/html/maven/org/gluu/gluu-orm-couchbase/4.3.0-SNAPSHOT/gluu-orm-couchbase-4.3.0-SNAPSHOT.jar
[INFO] Installing /home/jenkins/.jenkins/jobs/oxOrm/workspace/couchbase/pom.xml to /var/www/html/maven/org/gluu/gluu-orm-couchbase/4.3.0-SNAPSHOT/gluu-orm-couchbase-4.3.0-SNAPSHOT.pom
[INFO] 
[INFO] >>> maven-javadoc-plugin:3.0.1:javadoc (default-cli) > generate-sources @ gluu-orm-couchbase >>>
[INFO] 
[INFO] <<< maven-javadoc-plugin:3.0.1:javadoc (default-cli) < generate-sources @ gluu-orm-couchbase <<<
[INFO] 
[INFO] 
[INFO] --- maven-javadoc-plugin:3.0.1:javadoc (default-cli) @ gluu-orm-couchbase ---
[INFO] 
Loading source files for package org.gluu.orm.couchbase.impl...
Loading source files for package org.gluu.orm.couchbase.model...
Loading source files for package org.gluu.orm.couchbase.operation...
Loading source files for package org.gluu.orm.couchbase.operation.impl...
Loading source files for package org.gluu.orm.couchbase.operation.watch...
Constructing Javadoc information...
Standard Doclet version 11.0.7
Building tree for all the packages and classes...
Generating /home/jenkins/.jenkins/jobs/oxOrm/workspace/couchbase/target/site/apidocs/org/gluu/orm/couchbase/impl/CouchbaseBatchOperationWraper.html...
Generating /home/jenkins/.jenkins/jobs/oxOrm/workspace/couchbase/target/site/apidocs/org/gluu/orm/couchbase/impl/CouchbaseEntryManager.html...
Generating /home/jenkins/.jenkins/jobs/oxOrm/workspace/couchbase/target/site/apidocs/org/gluu/orm/couchbase/impl/CouchbaseEntryManagerFactory.html...
Generating /home/jenkins/.jenkins/jobs/oxOrm/workspace/couchbase/target/site/apidocs/org/gluu/orm/couchbase/impl/CouchbaseFilterConverter.html...
Generating /home/jenkins/.jenkins/jobs/oxOrm/workspace/couchbase/target/site/apidocs/org/gluu/orm/couchbase/model/BucketMapping.html...
Generating /home/jenkins/.jenkins/jobs/oxOrm/workspace/couchbase/target/site/apidocs/org/gluu/orm/couchbase/model/ConvertedExpression.html...
Generating /home/jenkins/.jenkins/jobs/oxOrm/workspace/couchbase/target/site/apidocs/org/gluu/orm/couchbase/model/CouchbaseConnectionConfiguration.html...
Generating /home/jenkins/.jenkins/jobs/oxOrm/workspace/couchbase/target/site/apidocs/org/gluu/orm/couchbase/model/ResultCode.html...
Generating /home/jenkins/.jenkins/jobs/oxOrm/workspace/couchbase/target/site/apidocs/org/gluu/orm/couchbase/model/SearchReturnDataType.html...
Generating /home/jenkins/.jenkins/jobs/oxOrm/workspace/couchbase/target/site/apidocs/org/gluu/orm/couchbase/operation/CouchbaseOperationService.html...
Generating /home/jenkins/.jenkins/jobs/oxOrm/workspace/couchbase/target/site/apidocs/org/gluu/orm/couchbase/operation/impl/CouchbaseConnectionProvider.html...
Generating /home/jenkins/.jenkins/jobs/oxOrm/workspace/couchbase/target/site/apidocs/org/gluu/orm/couchbase/operation/impl/CouchbaseOperationServiceImpl.html...
Generating /home/jenkins/.jenkins/jobs/oxOrm/workspace/couchbase/target/site/apidocs/org/gluu/orm/couchbase/operation/watch/OperationDurationUtil.html...
Generating /home/jenkins/.jenkins/jobs/oxOrm/workspace/couchbase/target/site/apidocs/org/gluu/orm/couchbase/impl/package-summary.html...
Generating /home/jenkins/.jenkins/jobs/oxOrm/workspace/couchbase/target/site/apidocs/org/gluu/orm/couchbase/impl/package-tree.html...
Generating /home/jenkins/.jenkins/jobs/oxOrm/workspace/couchbase/target/site/apidocs/org/gluu/orm/couchbase/model/package-summary.html...
Generating /home/jenkins/.jenkins/jobs/oxOrm/workspace/couchbase/target/site/apidocs/org/gluu/orm/couchbase/model/package-tree.html...
Generating /home/jenkins/.jenkins/jobs/oxOrm/workspace/couchbase/target/site/apidocs/org/gluu/orm/couchbase/operation/package-summary.html...
Generating /home/jenkins/.jenkins/jobs/oxOrm/workspace/couchbase/target/site/apidocs/org/gluu/orm/couchbase/operation/package-tree.html...
Generating /home/jenkins/.jenkins/jobs/oxOrm/workspace/couchbase/target/site/apidocs/org/gluu/orm/couchbase/operation/impl/package-summary.html...
Generating /home/jenkins/.jenkins/jobs/oxOrm/workspace/couchbase/target/site/apidocs/org/gluu/orm/couchbase/operation/impl/package-tree.html...
Generating /home/jenkins/.jenkins/jobs/oxOrm/workspace/couchbase/target/site/apidocs/org/gluu/orm/couchbase/operation/watch/package-summary.html...
Generating /home/jenkins/.jenkins/jobs/oxOrm/workspace/couchbase/target/site/apidocs/org/gluu/orm/couchbase/operation/watch/package-tree.html...
Generating /home/jenkins/.jenkins/jobs/oxOrm/workspace/couchbase/target/site/apidocs/constant-values.html...
Generating /home/jenkins/.jenkins/jobs/oxOrm/workspace/couchbase/target/site/apidocs/serialized-form.html...
Generating /home/jenkins/.jenkins/jobs/oxOrm/workspace/couchbase/target/site/apidocs/org/gluu/orm/couchbase/impl/class-use/CouchbaseBatchOperationWraper.html...
Generating /home/jenkins/.jenkins/jobs/oxOrm/workspace/couchbase/target/site/apidocs/org/gluu/orm/couchbase/impl/class-use/CouchbaseEntryManager.html...
Generating /home/jenkins/.jenkins/jobs/oxOrm/workspace/couchbase/target/site/apidocs/org/gluu/orm/couchbase/impl/class-use/CouchbaseEntryManagerFactory.html...
Generating /home/jenkins/.jenkins/jobs/oxOrm/workspace/couchbase/target/site/apidocs/org/gluu/orm/couchbase/impl/class-use/CouchbaseFilterConverter.html...
Generating /home/jenkins/.jenkins/jobs/oxOrm/workspace/couchbase/target/site/apidocs/org/gluu/orm/couchbase/model/class-use/BucketMapping.html...
Generating /home/jenkins/.jenkins/jobs/oxOrm/workspace/couchbase/target/site/apidocs/org/gluu/orm/couchbase/model/class-use/ConvertedExpression.html...
Generating /home/jenkins/.jenkins/jobs/oxOrm/workspace/couchbase/target/site/apidocs/org/gluu/orm/couchbase/model/class-use/CouchbaseConnectionConfiguration.html...
Generating /home/jenkins/.jenkins/jobs/oxOrm/workspace/couchbase/target/site/apidocs/org/gluu/orm/couchbase/model/class-use/ResultCode.html...
Generating /home/jenkins/.jenkins/jobs/oxOrm/workspace/couchbase/target/site/apidocs/org/gluu/orm/couchbase/model/class-use/SearchReturnDataType.html...
Generating /home/jenkins/.jenkins/jobs/oxOrm/workspace/couchbase/target/site/apidocs/org/gluu/orm/couchbase/operation/class-use/CouchbaseOperationService.html...
Generating /home/jenkins/.jenkins/jobs/oxOrm/workspace/couchbase/target/site/apidocs/org/gluu/orm/couchbase/operation/impl/class-use/CouchbaseConnectionProvider.html...
Generating /home/jenkins/.jenkins/jobs/oxOrm/workspace/couchbase/target/site/apidocs/org/gluu/orm/couchbase/operation/impl/class-use/CouchbaseOperationServiceImpl.html...
Generating /home/jenkins/.jenkins/jobs/oxOrm/workspace/couchbase/target/site/apidocs/org/gluu/orm/couchbase/operation/watch/class-use/OperationDurationUtil.html...
Generating /home/jenkins/.jenkins/jobs/oxOrm/workspace/couchbase/target/site/apidocs/org/gluu/orm/couchbase/impl/package-use.html...
Generating /home/jenkins/.jenkins/jobs/oxOrm/workspace/couchbase/target/site/apidocs/org/gluu/orm/couchbase/model/package-use.html...
Generating /home/jenkins/.jenkins/jobs/oxOrm/workspace/couchbase/target/site/apidocs/org/gluu/orm/couchbase/operation/package-use.html...
Generating /home/jenkins/.jenkins/jobs/oxOrm/workspace/couchbase/target/site/apidocs/org/gluu/orm/couchbase/operation/impl/package-use.html...
Generating /home/jenkins/.jenkins/jobs/oxOrm/workspace/couchbase/target/site/apidocs/org/gluu/orm/couchbase/operation/watch/package-use.html...
Building index for all the packages and classes...
Generating /home/jenkins/.jenkins/jobs/oxOrm/workspace/couchbase/target/site/apidocs/overview-tree.html...
Generating /home/jenkins/.jenkins/jobs/oxOrm/workspace/couchbase/target/site/apidocs/index-all.html...
Building index for all classes...
Generating /home/jenkins/.jenkins/jobs/oxOrm/workspace/couchbase/target/site/apidocs/allclasses-index.html...
Generating /home/jenkins/.jenkins/jobs/oxOrm/workspace/couchbase/target/site/apidocs/allpackages-index.html...
Generating /home/jenkins/.jenkins/jobs/oxOrm/workspace/couchbase/target/site/apidocs/deprecated-list.html...
Building index for all classes...
Generating /home/jenkins/.jenkins/jobs/oxOrm/workspace/couchbase/target/site/apidocs/allclasses.html...
Generating /home/jenkins/.jenkins/jobs/oxOrm/workspace/couchbase/target/site/apidocs/allclasses.html...
Generating /home/jenkins/.jenkins/jobs/oxOrm/workspace/couchbase/target/site/apidocs/index.html...
Generating /home/jenkins/.jenkins/jobs/oxOrm/workspace/couchbase/target/site/apidocs/overview-summary.html...
Generating /home/jenkins/.jenkins/jobs/oxOrm/workspace/couchbase/target/site/apidocs/help-doc.html...
1 error
[ERROR] Error while creating javadoc report: 
Exit code: 1 - javadoc: error - The code being documented uses modules but the packages defined in https://docs.oracle.com/javase/8/docs/api/ are in the unnamed module.

Command line was: /opt/java/amazon-corretto-11.0.7.10.1-linux-x64/bin/javadoc @options @packages

Refer to the generated Javadoc files in '/home/jenkins/.jenkins/jobs/oxOrm/workspace/couchbase/target/site/apidocs' dir.

org.apache.maven.reporting.MavenReportException: 
Exit code: 1 - javadoc: error - The code being documented uses modules but the packages defined in https://docs.oracle.com/javase/8/docs/api/ are in the unnamed module.

Command line was: /opt/java/amazon-corretto-11.0.7.10.1-linux-x64/bin/javadoc @options @packages

Refer to the generated Javadoc files in '/home/jenkins/.jenkins/jobs/oxOrm/workspace/couchbase/target/site/apidocs' dir.

    at org.apache.maven.plugins.javadoc.AbstractJavadocMojo.executeJavadocCommandLine (AbstractJavadocMojo.java:5298)
    at org.apache.maven.plugins.javadoc.AbstractJavadocMojo.executeReport (AbstractJavadocMojo.java:2134)
    at org.apache.maven.plugins.javadoc.JavadocReport.generate (JavadocReport.java:134)
    at org.apache.maven.plugins.javadoc.JavadocReport.doExecute (JavadocReport.java:329)
    at org.apache.maven.plugins.javadoc.AbstractJavadocMojo.execute (AbstractJavadocMojo.java:1912)
    at org.apache.maven.plugin.DefaultBuildPluginManager.executeMojo (DefaultBuildPluginManager.java:137)
    at org.apache.maven.lifecycle.internal.MojoExecutor.execute (MojoExecutor.java:210)
    at org.apache.maven.lifecycle.internal.MojoExecutor.execute (MojoExecutor.java:156)
    at org.apache.maven.lifecycle.internal.MojoExecutor.execute (MojoExecutor.java:148)
    at org.apache.maven.lifecycle.internal.LifecycleModuleBuilder.buildProject (LifecycleModuleBuilder.java:117)
    at org.apache.maven.lifecycle.internal.LifecycleModuleBuilder.buildProject (LifecycleModuleBuilder.java:81)
    at org.apache.maven.lifecycle.internal.builder.singlethreaded.SingleThreadedBuilder.build (SingleThreadedBuilder.java:56)
    at org.apache.maven.lifecycle.internal.LifecycleStarter.execute (LifecycleStarter.java:128)
    at org.apache.maven.DefaultMaven.doExecute (DefaultMaven.java:305)
    at org.apache.maven.DefaultMaven.doExecute (DefaultMaven.java:192)
    at org.apache.maven.DefaultMaven.execute (DefaultMaven.java:105)
    at org.apache.maven.cli.MavenCli.execute (MavenCli.java:957)
    at org.apache.maven.cli.MavenCli.doMain (MavenCli.java:289)
    at org.apache.maven.cli.MavenCli.main (MavenCli.java:193)
    at jdk.internal.reflect.NativeMethodAccessorImpl.invoke0 (Native Method)
    at jdk.internal.reflect.NativeMethodAccessorImpl.invoke (NativeMethodAccessorImpl.java:62)
    at jdk.internal.reflect.DelegatingMethodAccessorImpl.invoke (DelegatingMethodAccessorImpl.java:43)
    at java.lang.reflect.Method.invoke (Method.java:566)
    at org.codehaus.plexus.classworlds.launcher.Launcher.launchEnhanced (Launcher.java:282)
    at org.codehaus.plexus.classworlds.launcher.Launcher.launch (Launcher.java:225)
    at org.codehaus.plexus.classworlds.launcher.Launcher.mainWithExitCode (Launcher.java:406)
    at org.codehaus.plexus.classworlds.launcher.Launcher.main (Launcher.java:347)
[INFO] 
[INFO] --- maven-site-plugin:2.1.1:site (default-site) @ gluu-orm-couchbase ---
[WARNING] No URL defined for the project - decoration links will not be resolved
[INFO] 
[INFO] -----------------------< org.gluu:gluu-orm-sql >------------------------
[INFO] Building gluu-orm-sql 4.3.0-SNAPSHOT                              [9/17]
[INFO] --------------------------------[ jar ]---------------------------------
[INFO] 
[INFO] --- maven-clean-plugin:2.5:clean (default-clean) @ gluu-orm-sql ---
[INFO] Deleting /home/jenkins/.jenkins/jobs/oxOrm/workspace/sql/target
[INFO] 
[INFO] --- maven-resources-plugin:2.6:resources (default-resources) @ gluu-orm-sql ---
[INFO] Using 'UTF-8' encoding to copy filtered resources.
[INFO] Copying 1 resource
[INFO] 
[INFO] --- maven-compiler-plugin:2.3.2:compile (default-compile) @ gluu-orm-sql ---
[INFO] Compiling 15 source files to /home/jenkins/.jenkins/jobs/oxOrm/workspace/sql/target/classes
[INFO] 
[INFO] --- maven-resources-plugin:2.6:resources (default-resources) @ gluu-orm-sql ---
[INFO] Using 'UTF-8' encoding to copy filtered resources.
[INFO] Copying 1 resource
[INFO] 
[INFO] --- maven-compiler-plugin:2.3.2:compile (default-compile) @ gluu-orm-sql ---
[INFO] Nothing to compile - all classes are up to date
[INFO] 
[INFO] --- maven-resources-plugin:2.6:testResources (default-testResources) @ gluu-orm-sql ---
[INFO] Using 'UTF-8' encoding to copy filtered resources.
[INFO] skip non existing resourceDirectory /home/jenkins/.jenkins/jobs/oxOrm/workspace/sql/src/test/resources
[INFO] 
[INFO] --- maven-compiler-plugin:2.3.2:testCompile (default-testCompile) @ gluu-orm-sql ---
[INFO] Compiling 2 source files to /home/jenkins/.jenkins/jobs/oxOrm/workspace/sql/target/test-classes
[INFO] 
[INFO] --- maven-surefire-plugin:2.12.4:test (default-test) @ gluu-orm-sql ---
[INFO] Surefire report directory: /home/jenkins/.jenkins/jobs/oxOrm/workspace/sql/target/surefire-reports

-------------------------------------------------------
 T E S T S
-------------------------------------------------------
Running TestSuite
Configuring TestNG with: org.apache.maven.surefire.testng.conf.TestNG652Configurator@51cdd8a
SLF4J: Failed to load class "org.slf4j.impl.StaticLoggerBinder".
SLF4J: Defaulting to no-operation (NOP) logger implementation
SLF4J: See http://www.slf4j.org/codes.html#StaticLoggerBinder for further details.
Tests run: 19, Failures: 3, Errors: 0, Skipped: 0, Time elapsed: 1.436 sec <<< FAILURE!
checkMultivaluedEqFilters(org.gluu.persist.sql.impl.test.SqlFilterConverterTest)  Time elapsed: 0.003 sec  <<< FAILURE!
java.lang.AssertionError: expected [select doc.`*` from `table` as doc where JSON_CONTAINS(doc.uid->'$.v', CAST('["["test"]"]' AS JSON))] but found [select doc.`*` from `table` as doc where JSON_CONTAINS(doc.uid->'$.v', CAST('["test"]' AS JSON))]
	at org.testng.Assert.fail(Assert.java:96)
	at org.testng.Assert.failNotEquals(Assert.java:776)
	at org.testng.Assert.assertEqualsImpl(Assert.java:137)
	at org.testng.Assert.assertEquals(Assert.java:118)
	at org.testng.Assert.assertEquals(Assert.java:453)
	at org.testng.Assert.assertEquals(Assert.java:463)
	at org.gluu.persist.sql.impl.test.SqlFilterConverterTest.checkMultivaluedEqFilters(SqlFilterConverterTest.java:89)

checkMultivaluedLowerFilters(org.gluu.persist.sql.impl.test.SqlFilterConverterTest)  Time elapsed: 0 sec  <<< FAILURE!
java.lang.AssertionError: expected [select doc.`*` from `table` as doc where JSON_CONTAINS(lower(doc.uid)->'$.v', CAST('["["test"]"]' AS JSON))] but found [select doc.`*` from `table` as doc where JSON_CONTAINS(lower(doc.uid)->'$.v', CAST('["test"]' AS JSON))]
	at org.testng.Assert.fail(Assert.java:96)
	at org.testng.Assert.failNotEquals(Assert.java:776)
	at org.testng.Assert.assertEqualsImpl(Assert.java:137)
	at org.testng.Assert.assertEquals(Assert.java:118)
	at org.testng.Assert.assertEquals(Assert.java:453)
	at org.testng.Assert.assertEquals(Assert.java:463)
	at org.gluu.persist.sql.impl.test.SqlFilterConverterTest.checkMultivaluedLowerFilters(SqlFilterConverterTest.java:372)

checkObjectClassExcludeFilter(org.gluu.persist.sql.impl.test.SqlFilterConverterCheckExcludeFilterTest)  Time elapsed: 0 sec  <<< FAILURE!
java.lang.AssertionError: expected [select doc.`*` from `table` as doc where doc.objectClass = 'gluuPerson' and (doc.uid = 'test' and lower(doc.uid) = 'test' and doc.objectClass = 'gluuPerson' and (doc.uid = 'test' and lower(doc.uid) = 'test' and doc.objectClass = 'gluuPerson' and JSON_CONTAINS(doc.added->'$.v', CAST('["["2020-12-16T14:58:18.398"]"]' AS JSON))) and JSON_CONTAINS(doc.added->'$.v', CAST('["["2020-12-16T14:58:18.398"]"]' AS JSON)))] but found [select doc.`*` from `table` as doc where doc.objectClass = 'gluuPerson' and (doc.uid = 'test' and lower(doc.uid) = 'test' and doc.objectClass = 'gluuPerson' and (doc.uid = 'test' and lower(doc.uid) = 'test' and doc.objectClass = 'gluuPerson' and JSON_CONTAINS(doc.added->'$.v', CAST('["2020-12-16T14:58:18.398"]' AS JSON))) and JSON_CONTAINS(doc.added->'$.v', CAST('["2020-12-16T14:58:18.398"]' AS JSON)))]
	at org.testng.Assert.fail(Assert.java:96)
	at org.testng.Assert.failNotEquals(Assert.java:776)
	at org.testng.Assert.assertEqualsImpl(Assert.java:137)
	at org.testng.Assert.assertEquals(Assert.java:118)
	at org.testng.Assert.assertEquals(Assert.java:453)
	at org.testng.Assert.assertEquals(Assert.java:463)
	at org.gluu.persist.sql.impl.test.SqlFilterConverterCheckExcludeFilterTest.checkObjectClassExcludeFilter(SqlFilterConverterCheckExcludeFilterTest.java:68)


Results :

Failed tests:   checkMultivaluedEqFilters(org.gluu.persist.sql.impl.test.SqlFilterConverterTest): expected [select doc.`*` from `table` as doc where JSON_CONTAINS(doc.uid->'$.v', CAST('["["test"]"]' AS JSON))] but found [select doc.`*` from `table` as doc where JSON_CONTAINS(doc.uid->'$.v', CAST('["test"]' AS JSON))]
  checkMultivaluedLowerFilters(org.gluu.persist.sql.impl.test.SqlFilterConverterTest): expected [select doc.`*` from `table` as doc where JSON_CONTAINS(lower(doc.uid)->'$.v', CAST('["["test"]"]' AS JSON))] but found [select doc.`*` from `table` as doc where JSON_CONTAINS(lower(doc.uid)->'$.v', CAST('["test"]' AS JSON))]
  checkObjectClassExcludeFilter(org.gluu.persist.sql.impl.test.SqlFilterConverterCheckExcludeFilterTest): expected [select doc.`*` from `table` as doc where doc.objectClass = 'gluuPerson' and (doc.uid = 'test' and lower(doc.uid) = 'test' and doc.objectClass = 'gluuPerson' and (doc.uid = 'test' and lower(doc.uid) = 'test' and doc.objectClass = 'gluuPerson' and JSON_CONTAINS(doc.added->'$.v', CAST('["["2020-12-16T14:58:18.398"]"]' AS JSON))) and JSON_CONTAINS(doc.added->'$.v', CAST('["["2020-12-16T14:58:18.398"]"]' AS JSON)))] but found [select doc.`*` from `table` as doc where doc.objectClass = 'gluuPerson' and (doc.uid = 'test' and lower(doc.uid) = 'test' and doc.objectClass = 'gluuPerson' and (doc.uid = 'test' and lower(doc.uid) = 'test' and doc.objectClass = 'gluuPerson' and JSON_CONTAINS(doc.added->'$.v', CAST('["2020-12-16T14:58:18.398"]' AS JSON))) and JSON_CONTAINS(doc.added->'$.v', CAST('["2020-12-16T14:58:18.398"]' AS JSON)))]

Tests run: 19, Failures: 3, Errors: 0, Skipped: 0

[INFO] ------------------------------------------------------------------------
[INFO] Reactor Summary for orm 4.3.0-SNAPSHOT:
[INFO] 
[INFO] orm ................................................ SUCCESS [  2.222 s]
[INFO] gluu-orm-util ...................................... SUCCESS [  6.320 s]
[INFO] gluu-orm-annotation ................................ SUCCESS [  2.754 s]
[INFO] gluu-orm-filter .................................... SUCCESS [  2.972 s]
[INFO] gluu-orm-model ..................................... SUCCESS [  3.281 s]
[INFO] gluu-orm-core ...................................... SUCCESS [  7.038 s]
[INFO] gluu-orm-ldap ...................................... SUCCESS [  4.844 s]
[INFO] gluu-orm-couchbase ................................. SUCCESS [  7.526 s]
[INFO] gluu-orm-sql ....................................... FAILURE [  3.608 s]
[INFO] gluu-orm-spanner ................................... SKIPPED
[INFO] Persistence CDI services ........................... SKIPPED
[INFO] gluu-orm-hybrid .................................... SKIPPED
[INFO] Persistence standalone services .................... SKIPPED
[INFO] gluu-orm-ldapSample ................................ SKIPPED
[INFO] Persistence Couchbase sample ....................... SKIPPED
[INFO] Persistence sql sample ............................. SKIPPED
[INFO] Persistence Cloud spanner sample ................... SKIPPED
[INFO] ------------------------------------------------------------------------
[INFO] BUILD FAILURE
[INFO] ------------------------------------------------------------------------
[INFO] Total time:  41.756 s
[INFO] Finished at: 2021-09-16T16:44:01Z
[INFO] ------------------------------------------------------------------------
[ERROR] Failed to execute goal org.apache.maven.plugins:maven-surefire-plugin:2.12.4:test (default-test) on project gluu-orm-sql: There are test failures.
[ERROR] 
[ERROR] Please refer to /home/jenkins/.jenkins/jobs/oxOrm/workspace/sql/target/surefire-reports for the individual test results.
[ERROR] -> [Help 1]
[ERROR] 
[ERROR] To see the full stack trace of the errors, re-run Maven with the -e switch.
[ERROR] Re-run Maven using the -X switch to enable full debug logging.
[ERROR] 
[ERROR] For more information about the errors and possible solutions, please read the following articles:
[ERROR] [Help 1] http://cwiki.apache.org/confluence/display/MAVEN/MojoFailureException
[ERROR] 
[ERROR] After correcting the problems, you can resume the build with the command
[ERROR]   mvn <args> -rf :gluu-orm-sql
Build step 'Invoke top-level Maven targets' marked build as failure
[FINDBUGS] Skipping publisher since build result is FAILURE
TestNG Reports Processing: START
Looking for TestNG results report in workspace using pattern: **/testng-results.xml
testng-results.xml was last modified before this build started. Ignoring it.
testng-results.xml was last modified before this build started. Ignoring it.
testng-results.xml was last modified before this build started. Ignoring it.
testng-results.xml was last modified before this build started. Ignoring it.
testng-results.xml was last modified before this build started. Ignoring it.
Saving reports...
Processing '/home/jenkins/.jenkins/jobs/oxOrm/builds/74/testng/testng-results-1.xml'
Processing '/home/jenkins/.jenkins/jobs/oxOrm/builds/74/testng/testng-results.xml'
7.500000% of tests failed, which exceeded threshold of 0%. Marking build as UNSTABLE
TestNG Reports Processing: FINISH
Not sending mail to unregistered user Yuriy.Movchan@gmail.com
Sending e-mails to: support@gluu.org
ERROR: Couldn't connect to host, port: webmail.gluu.org, 465; timeout 60000
com.sun.mail.util.MailConnectException: Couldn't connect to host, port: webmail.gluu.org, 465; timeout 60000;
  nested exception is:
	java.net.SocketTimeoutException: connect timed out
	at com.sun.mail.smtp.SMTPTransport.openServer(SMTPTransport.java:2210)
	at com.sun.mail.smtp.SMTPTransport.protocolConnect(SMTPTransport.java:722)
	at javax.mail.Service.connect(Service.java:310)
	at javax.mail.Service.connect(Service.java:169)
	at javax.mail.Service.connect(Service.java:118)
	at javax.mail.Transport.send0(Transport.java:188)
	at javax.mail.Transport.send(Transport.java:118)
	at hudson.tasks.MailSender.run(MailSender.java:130)
	at hudson.tasks.Mailer.perform(Mailer.java:176)
	at hudson.tasks.Mailer.perform(Mailer.java:139)
	at hudson.tasks.BuildStepMonitor$1.perform(BuildStepMonitor.java:20)
	at hudson.model.AbstractBuild$AbstractBuildExecution.perform(AbstractBuild.java:741)
	at hudson.model.AbstractBuild$AbstractBuildExecution.performAllBuildSteps(AbstractBuild.java:690)
	at hudson.model.Build$BuildExecution.post2(Build.java:186)
	at hudson.model.AbstractBuild$AbstractBuildExecution.post(AbstractBuild.java:635)
	at hudson.model.Run.execute(Run.java:1905)
	at hudson.model.FreeStyleBuild.run(FreeStyleBuild.java:43)
	at hudson.model.ResourceController.execute(ResourceController.java:97)
	at hudson.model.Executor.run(Executor.java:428)
Caused by: java.net.SocketTimeoutException: connect timed out
	at java.net.PlainSocketImpl.socketConnect(Native Method)
	at java.net.AbstractPlainSocketImpl.doConnect(AbstractPlainSocketImpl.java:350)
	at java.net.AbstractPlainSocketImpl.connectToAddress(AbstractPlainSocketImpl.java:206)
	at java.net.AbstractPlainSocketImpl.connect(AbstractPlainSocketImpl.java:188)
	at java.net.SocksSocketImpl.connect(SocksSocketImpl.java:392)
	at java.net.Socket.connect(Socket.java:589)
	at com.sun.mail.util.SocketFetcher.createSocket(SocketFetcher.java:333)
	at com.sun.mail.util.SocketFetcher.getSocket(SocketFetcher.java:193)
	at com.sun.mail.smtp.SMTPTransport.openServer(SMTPTransport.java:2160)
	... 18 more
Finished: FAILURE