FailedConsole Output

Started by an SCM change
Started by an SCM change
Running as SYSTEM
Building on master in workspace /home/jenkins/.jenkins/jobs/oxLicense_4.3.0/workspace
The recommended git tool is: NONE
using credential 472d8b37-71f3-4d83-9356-a84ddc60b9db
 > git rev-parse --is-inside-work-tree # timeout=10
Fetching changes from the remote Git repository
 > git config remote.origin.url ssh://github.com/GluuFederation/oxLicense # timeout=10
Fetching upstream changes from ssh://github.com/GluuFederation/oxLicense
 > git --version # timeout=10
 > git --version # 'git version 1.8.3.1'
using GIT_SSH to set credentials 
 > git fetch --tags --progress ssh://github.com/GluuFederation/oxLicense +refs/heads/*:refs/remotes/origin/* # timeout=10
 > git rev-parse refs/remotes/origin/version_4.3.0^{commit} # timeout=10
 > git rev-parse refs/remotes/origin/origin/version_4.3.0^{commit} # timeout=10
Checking out Revision e0cf115f6056c287358155c0a03c0d891aeff1c0 (refs/remotes/origin/version_4.3.0)
 > git config core.sparsecheckout # timeout=10
 > git checkout -f e0cf115f6056c287358155c0a03c0d891aeff1c0 # timeout=10
Commit message: "Version 4.3.0.Final"
 > git rev-list --no-walk df3ab734ae31cdf5d84a28a3dff849988fdf9573 # timeout=10
[workspace] $ /home/jenkins/.jenkins/tools/hudson.tasks.Maven_MavenInstallation/maven_3.3.9/bin/mvn -DVERSION_NAME=version_4.3.0 -DMAVEN_SKIP_TESTS=false -Dmaven.test.skip=false clean compile install
[INFO] Scanning for projects...
[WARNING] 
[WARNING] Some problems were encountered while building the effective model for org.gluu:oxlicense-server:war:4.3.0.Final
[WARNING] 'repositories.repository.id' must not be 'local', this identifier is reserved for the local repository, using it for other repositories will corrupt your repository metadata. @ org.gluu:oxlicense:4.3.0.Final, /home/jenkins/.jenkins/jobs/oxLicense_4.3.0/workspace/pom.xml, line 65, column 11
[WARNING] 
[WARNING] Some problems were encountered while building the effective model for org.gluu:oxlicense-client:jar:4.3.0.Final
[WARNING] 'build.plugins.plugin.(groupId:artifactId)' must be unique but found duplicate declaration of plugin org.apache.maven.plugins:maven-source-plugin @ line 112, column 21
[WARNING] 'repositories.repository.id' must not be 'local', this identifier is reserved for the local repository, using it for other repositories will corrupt your repository metadata. @ org.gluu:oxlicense:4.3.0.Final, /home/jenkins/.jenkins/jobs/oxLicense_4.3.0/workspace/pom.xml, line 65, column 11
[WARNING] 
[WARNING] Some problems were encountered while building the effective model for org.gluu:oxlicense-admin:war:4.3.0.Final
[WARNING] 'repositories.repository.id' must not be 'local', this identifier is reserved for the local repository, using it for other repositories will corrupt your repository metadata. @ org.gluu:oxlicense:4.3.0.Final, /home/jenkins/.jenkins/jobs/oxLicense_4.3.0/workspace/pom.xml, line 65, column 11
[WARNING] 
[WARNING] Some problems were encountered while building the effective model for org.gluu:oxlicense-validator:jar:4.3.0.Final
[WARNING] 'repositories.repository.id' must not be 'local', this identifier is reserved for the local repository, using it for other repositories will corrupt your repository metadata. @ org.gluu:oxlicense:4.3.0.Final, /home/jenkins/.jenkins/jobs/oxLicense_4.3.0/workspace/pom.xml, line 65, column 11
[WARNING] 
[WARNING] Some problems were encountered while building the effective model for org.gluu:oxlicense:pom:4.3.0.Final
[WARNING] 'repositories.repository.id' must not be 'local', this identifier is reserved for the local repository, using it for other repositories will corrupt your repository metadata. @ line 65, column 11
[WARNING] 
[WARNING] It is highly recommended to fix these problems because they threaten the stability of your build.
[WARNING] 
[WARNING] For this reason, future Maven versions might no longer support building such malformed projects.
[WARNING] 
[INFO] ------------------------------------------------------------------------
[INFO] Reactor Build Order:
[INFO] 
[INFO] oxLicense
[INFO] ox License Client
[INFO] ox License Server
[INFO] ox License Admin
[INFO] ox License Validator
[INFO]                                                                         
[INFO] ------------------------------------------------------------------------
[INFO] Building oxLicense 4.3.0.Final
[INFO] ------------------------------------------------------------------------
[INFO] 
[INFO] --- maven-clean-plugin:2.5:clean (default-clean) @ oxlicense ---
[INFO] 
[INFO] --- maven-install-plugin:2.3.1:install (default-install) @ oxlicense ---
[INFO] Installing /home/jenkins/.jenkins/jobs/oxLicense_4.3.0/workspace/pom.xml to /var/www/html/maven/org/gluu/oxlicense/4.3.0.Final/oxlicense-4.3.0.Final.pom
[INFO]                                                                         
[INFO] ------------------------------------------------------------------------
[INFO] Building ox License Client 4.3.0.Final
[INFO] ------------------------------------------------------------------------
Downloading: http://ox.gluu.org/maven/org/gluu/gluu-orm-annotation/4.3.0.Final/gluu-orm-annotation-4.3.0.Final.pom

Downloading: http://repo1.maven.org/maven2/org/gluu/gluu-orm-annotation/4.3.0.Final/gluu-orm-annotation-4.3.0.Final.pom

Downloading: http://repository.jboss.org/nexus/content/groups/public-jboss/org/gluu/gluu-orm-annotation/4.3.0.Final/gluu-orm-annotation-4.3.0.Final.pom

Downloading: http://repo2.maven.org/maven2/org/bouncycastle/org/gluu/gluu-orm-annotation/4.3.0.Final/gluu-orm-annotation-4.3.0.Final.pom

Downloading: file:///home/jenkins/.jenkins/jobs/oxLicense_4.3.0/workspace/oxlicense-client/../oxd-repo/org/gluu/gluu-orm-annotation/4.3.0.Final/gluu-orm-annotation-4.3.0.Final.pom

Downloading: http://ox.gluu.org/maven/org/gluu/oxauth-client/4.3.0.Final/oxauth-client-4.3.0.Final.pom

Downloading: http://repo1.maven.org/maven2/org/gluu/oxauth-client/4.3.0.Final/oxauth-client-4.3.0.Final.pom

Downloading: http://repository.jboss.org/nexus/content/groups/public-jboss/org/gluu/oxauth-client/4.3.0.Final/oxauth-client-4.3.0.Final.pom

Downloading: http://repo2.maven.org/maven2/org/bouncycastle/org/gluu/oxauth-client/4.3.0.Final/oxauth-client-4.3.0.Final.pom

Downloading: file:///home/jenkins/.jenkins/jobs/oxLicense_4.3.0/workspace/oxlicense-client/../oxd-repo/org/gluu/oxauth-client/4.3.0.Final/oxauth-client-4.3.0.Final.pom

[INFO] ------------------------------------------------------------------------
[INFO] Reactor Summary:
[INFO] 
[INFO] oxLicense .......................................... SUCCESS [  0.359 s]
[INFO] ox License Client .................................. FAILURE [  2.196 s]
[INFO] ox License Server .................................. SKIPPED
[INFO] ox License Admin ................................... SKIPPED
[INFO] ox License Validator ............................... SKIPPED
[INFO] ------------------------------------------------------------------------
[INFO] BUILD FAILURE
[INFO] ------------------------------------------------------------------------
[INFO] Total time: 2.781 s
[INFO] Finished at: 2021-09-20T11:58:29+00:00
[INFO] Final Memory: 13M/205M
[INFO] ------------------------------------------------------------------------
[ERROR] Failed to execute goal on project oxlicense-client: Could not resolve dependencies for project org.gluu:oxlicense-client:jar:4.3.0.Final: Failed to collect dependencies at org.gluu:gluu-orm-annotation:jar:4.3.0.Final: Failed to read artifact descriptor for org.gluu:gluu-orm-annotation:jar:4.3.0.Final: Could not transfer artifact org.gluu:gluu-orm-annotation:pom:4.3.0.Final from/to central (http://repo1.maven.org/maven2): Failed to transfer file: http://repo1.maven.org/maven2/org/gluu/gluu-orm-annotation/4.3.0.Final/gluu-orm-annotation-4.3.0.Final.pom. Return code is: 501 , ReasonPhrase:HTTPS Required. -> [Help 1]
[ERROR] 
[ERROR] To see the full stack trace of the errors, re-run Maven with the -e switch.
[ERROR] Re-run Maven using the -X switch to enable full debug logging.
[ERROR] 
[ERROR] For more information about the errors and possible solutions, please read the following articles:
[ERROR] [Help 1] http://cwiki.apache.org/confluence/display/MAVEN/DependencyResolutionException
[ERROR] 
[ERROR] After correcting the problems, you can resume the build with the command
[ERROR]   mvn <goals> -rf :oxlicense-client
Build step 'Invoke top-level Maven targets' marked build as failure
[FINDBUGS] Skipping publisher since build result is FAILURE
TestNG Reports Processing: START
Looking for TestNG results report in workspace using pattern: **/testng-results.xml
Did not find any matching files.
Not sending mail to unregistered user Yuriy.Movchan@gmail.com
Sending e-mails to: support@gluu.org
ERROR: Couldn't connect to host, port: webmail.gluu.org, 465; timeout 60000
com.sun.mail.util.MailConnectException: Couldn't connect to host, port: webmail.gluu.org, 465; timeout 60000;
  nested exception is:
	java.net.SocketTimeoutException: connect timed out
	at com.sun.mail.smtp.SMTPTransport.openServer(SMTPTransport.java:2210)
	at com.sun.mail.smtp.SMTPTransport.protocolConnect(SMTPTransport.java:722)
	at javax.mail.Service.connect(Service.java:310)
	at javax.mail.Service.connect(Service.java:169)
	at javax.mail.Service.connect(Service.java:118)
	at javax.mail.Transport.send0(Transport.java:188)
	at javax.mail.Transport.send(Transport.java:118)
	at hudson.tasks.MailSender.run(MailSender.java:130)
	at hudson.tasks.Mailer.perform(Mailer.java:176)
	at hudson.tasks.Mailer.perform(Mailer.java:139)
	at hudson.tasks.BuildStepMonitor$1.perform(BuildStepMonitor.java:20)
	at hudson.model.AbstractBuild$AbstractBuildExecution.perform(AbstractBuild.java:741)
	at hudson.model.AbstractBuild$AbstractBuildExecution.performAllBuildSteps(AbstractBuild.java:690)
	at hudson.model.Build$BuildExecution.post2(Build.java:186)
	at hudson.model.AbstractBuild$AbstractBuildExecution.post(AbstractBuild.java:635)
	at hudson.model.Run.execute(Run.java:1905)
	at hudson.model.FreeStyleBuild.run(FreeStyleBuild.java:43)
	at hudson.model.ResourceController.execute(ResourceController.java:97)
	at hudson.model.Executor.run(Executor.java:428)
Caused by: java.net.SocketTimeoutException: connect timed out
	at java.net.PlainSocketImpl.socketConnect(Native Method)
	at java.net.AbstractPlainSocketImpl.doConnect(AbstractPlainSocketImpl.java:350)
	at java.net.AbstractPlainSocketImpl.connectToAddress(AbstractPlainSocketImpl.java:206)
	at java.net.AbstractPlainSocketImpl.connect(AbstractPlainSocketImpl.java:188)
	at java.net.SocksSocketImpl.connect(SocksSocketImpl.java:392)
	at java.net.Socket.connect(Socket.java:589)
	at com.sun.mail.util.SocketFetcher.createSocket(SocketFetcher.java:333)
	at com.sun.mail.util.SocketFetcher.getSocket(SocketFetcher.java:193)
	at com.sun.mail.smtp.SMTPTransport.openServer(SMTPTransport.java:2160)
	... 18 more
Finished: FAILURE