FailedConsole Output

Started by an SCM change
Running as SYSTEM
Building on master in workspace /home/jenkins/.jenkins/jobs/oxLicense/workspace
The recommended git tool is: NONE
using credential 472d8b37-71f3-4d83-9356-a84ddc60b9db
 > git rev-parse --is-inside-work-tree # timeout=10
Fetching changes from the remote Git repository
 > git config remote.origin.url ssh://github.com/GluuFederation/oxLicense # timeout=10
Fetching upstream changes from ssh://github.com/GluuFederation/oxLicense
 > git --version # timeout=10
 > git --version # 'git version 1.8.3.1'
using GIT_SSH to set credentials 
 > git fetch --tags --progress ssh://github.com/GluuFederation/oxLicense +refs/heads/*:refs/remotes/origin/* # timeout=10
 > git rev-parse refs/remotes/origin/master^{commit} # timeout=10
 > git rev-parse refs/remotes/origin/origin/master^{commit} # timeout=10
Checking out Revision 9bd7ea84ec6fef8099aaa58cb1893c197b33c412 (refs/remotes/origin/master)
 > git config core.sparsecheckout # timeout=10
 > git checkout -f 9bd7ea84ec6fef8099aaa58cb1893c197b33c412 # timeout=10
Commit message: "Update Gluu maven repository"
 > git rev-list --no-walk 9bd7ea84ec6fef8099aaa58cb1893c197b33c412 # timeout=10
[workspace] $ /home/jenkins/.jenkins/tools/hudson.tasks.Maven_MavenInstallation/maven_3.3.9/bin/mvn -DVERSION_NAME=master -DMAVEN_SKIP_TESTS=false clean compile install
[INFO] Scanning for projects...
[WARNING] 
[WARNING] Some problems were encountered while building the effective model for org.gluu:oxlicense-server:war:4.4.0-SNAPSHOT
[WARNING] 'repositories.repository.id' must not be 'local', this identifier is reserved for the local repository, using it for other repositories will corrupt your repository metadata. @ org.gluu:oxlicense:4.4.0-SNAPSHOT, /home/jenkins/.jenkins/jobs/oxLicense/workspace/pom.xml, line 65, column 11
[WARNING] 
[WARNING] Some problems were encountered while building the effective model for org.gluu:oxlicense-client:jar:4.4.0-SNAPSHOT
[WARNING] 'build.plugins.plugin.(groupId:artifactId)' must be unique but found duplicate declaration of plugin org.apache.maven.plugins:maven-source-plugin @ line 112, column 21
[WARNING] 'repositories.repository.id' must not be 'local', this identifier is reserved for the local repository, using it for other repositories will corrupt your repository metadata. @ org.gluu:oxlicense:4.4.0-SNAPSHOT, /home/jenkins/.jenkins/jobs/oxLicense/workspace/pom.xml, line 65, column 11
[WARNING] 
[WARNING] Some problems were encountered while building the effective model for org.gluu:oxlicense-admin:war:4.4.0-SNAPSHOT
[WARNING] 'repositories.repository.id' must not be 'local', this identifier is reserved for the local repository, using it for other repositories will corrupt your repository metadata. @ org.gluu:oxlicense:4.4.0-SNAPSHOT, /home/jenkins/.jenkins/jobs/oxLicense/workspace/pom.xml, line 65, column 11
[WARNING] 
[WARNING] Some problems were encountered while building the effective model for org.gluu:oxlicense-validator:jar:4.4.0-SNAPSHOT
[WARNING] 'repositories.repository.id' must not be 'local', this identifier is reserved for the local repository, using it for other repositories will corrupt your repository metadata. @ org.gluu:oxlicense:4.4.0-SNAPSHOT, /home/jenkins/.jenkins/jobs/oxLicense/workspace/pom.xml, line 65, column 11
[WARNING] 
[WARNING] Some problems were encountered while building the effective model for org.gluu:oxlicense:pom:4.4.0-SNAPSHOT
[WARNING] 'repositories.repository.id' must not be 'local', this identifier is reserved for the local repository, using it for other repositories will corrupt your repository metadata. @ line 65, column 11
[WARNING] 
[WARNING] It is highly recommended to fix these problems because they threaten the stability of your build.
[WARNING] 
[WARNING] For this reason, future Maven versions might no longer support building such malformed projects.
[WARNING] 
[INFO] ------------------------------------------------------------------------
[INFO] Reactor Build Order:
[INFO] 
[INFO] oxLicense
[INFO] ox License Client
[INFO] ox License Server
[INFO] ox License Admin
[INFO] ox License Validator
[INFO]                                                                         
[INFO] ------------------------------------------------------------------------
[INFO] Building oxLicense 4.4.0-SNAPSHOT
[INFO] ------------------------------------------------------------------------
[INFO] 
[INFO] --- maven-clean-plugin:2.5:clean (default-clean) @ oxlicense ---
[INFO] 
[INFO] --- maven-install-plugin:2.3.1:install (default-install) @ oxlicense ---
[INFO] Installing /home/jenkins/.jenkins/jobs/oxLicense/workspace/pom.xml to /var/www/html/maven/org/gluu/oxlicense/4.4.0-SNAPSHOT/oxlicense-4.4.0-SNAPSHOT.pom
[INFO]                                                                         
[INFO] ------------------------------------------------------------------------
[INFO] Building ox License Client 4.4.0-SNAPSHOT
[INFO] ------------------------------------------------------------------------
Downloading: http://repo1.maven.org/maven2/org/gluu/oxauth-client/4.4.0-SNAPSHOT/maven-metadata.xml
Downloading: http://repo2.maven.org/maven2/org/bouncycastle/org/gluu/oxauth-client/4.4.0-SNAPSHOT/maven-metadata.xml


[WARNING] Could not transfer metadata org.gluu:oxauth-client:4.4.0-SNAPSHOT/maven-metadata.xml from/to central (http://repo1.maven.org/maven2): Failed to transfer file: http://repo1.maven.org/maven2/org/gluu/oxauth-client/4.4.0-SNAPSHOT/maven-metadata.xml. Return code is: 501 , ReasonPhrase:HTTPS Required.
[WARNING] Could not transfer metadata org.gluu:oxauth-client:4.4.0-SNAPSHOT/maven-metadata.xml from/to bouncycastle (http://repo2.maven.org/maven2/org/bouncycastle): repo2.maven.org: Name or service not known
[WARNING] Failure to transfer org.gluu:oxauth-client:4.4.0-SNAPSHOT/maven-metadata.xml from http://repo1.maven.org/maven2 was cached in the local repository, resolution will not be reattempted until the update interval of central has elapsed or updates are forced. Original error: Could not transfer metadata org.gluu:oxauth-client:4.4.0-SNAPSHOT/maven-metadata.xml from/to central (http://repo1.maven.org/maven2): Failed to transfer file: http://repo1.maven.org/maven2/org/gluu/oxauth-client/4.4.0-SNAPSHOT/maven-metadata.xml. Return code is: 501 , ReasonPhrase:HTTPS Required.
[WARNING] Failure to transfer org.gluu:oxauth-client:4.4.0-SNAPSHOT/maven-metadata.xml from http://repo2.maven.org/maven2/org/bouncycastle was cached in the local repository, resolution will not be reattempted until the update interval of bouncycastle has elapsed or updates are forced. Original error: Could not transfer metadata org.gluu:oxauth-client:4.4.0-SNAPSHOT/maven-metadata.xml from/to bouncycastle (http://repo2.maven.org/maven2/org/bouncycastle): repo2.maven.org: Name or service not known
Downloading: http://repo1.maven.org/maven2/org/gluu/oxauth-client/4.4.0-SNAPSHOT/oxauth-client-4.4.0-SNAPSHOT.pom

Downloading: http://repo2.maven.org/maven2/org/bouncycastle/org/gluu/oxauth-client/4.4.0-SNAPSHOT/oxauth-client-4.4.0-SNAPSHOT.pom

[INFO] ------------------------------------------------------------------------
[INFO] Reactor Summary:
[INFO] 
[INFO] oxLicense .......................................... SUCCESS [  0.362 s]
[INFO] ox License Client .................................. FAILURE [  0.867 s]
[INFO] ox License Server .................................. SKIPPED
[INFO] ox License Admin ................................... SKIPPED
[INFO] ox License Validator ............................... SKIPPED
[INFO] ------------------------------------------------------------------------
[INFO] BUILD FAILURE
[INFO] ------------------------------------------------------------------------
[INFO] Total time: 1.428 s
[INFO] Finished at: 2021-11-09T17:38:21+00:00
[INFO] Final Memory: 14M/303M
[INFO] ------------------------------------------------------------------------
[ERROR] Failed to execute goal on project oxlicense-client: Could not resolve dependencies for project org.gluu:oxlicense-client:jar:4.4.0-SNAPSHOT: Failed to collect dependencies at org.gluu:oxauth-client:jar:4.4.0-SNAPSHOT: Failed to read artifact descriptor for org.gluu:oxauth-client:jar:4.4.0-SNAPSHOT: Could not transfer artifact org.gluu:oxauth-client:pom:4.4.0-SNAPSHOT from/to central (http://repo1.maven.org/maven2): Failed to transfer file: http://repo1.maven.org/maven2/org/gluu/oxauth-client/4.4.0-SNAPSHOT/oxauth-client-4.4.0-SNAPSHOT.pom. Return code is: 501 , ReasonPhrase:HTTPS Required. -> [Help 1]
[ERROR] 
[ERROR] To see the full stack trace of the errors, re-run Maven with the -e switch.
[ERROR] Re-run Maven using the -X switch to enable full debug logging.
[ERROR] 
[ERROR] For more information about the errors and possible solutions, please read the following articles:
[ERROR] [Help 1] http://cwiki.apache.org/confluence/display/MAVEN/DependencyResolutionException
[ERROR] 
[ERROR] After correcting the problems, you can resume the build with the command
[ERROR]   mvn <goals> -rf :oxlicense-client
Build step 'Invoke top-level Maven targets' marked build as failure
[FINDBUGS] Skipping publisher since build result is FAILURE
TestNG Reports Processing: START
Looking for TestNG results report in workspace using pattern: **/testng-results.xml
testng-results.xml was last modified before this build started. Ignoring it.
testng-results.xml was last modified before this build started. Ignoring it.
Saving reports...
Found matching files but did not find any TestNG results.
Not sending mail to unregistered user Yuriy.Movchan@gmail.com
Sending e-mails to: support@gluu.org
ERROR: Couldn't connect to host, port: webmail.gluu.org, 465; timeout 60000
com.sun.mail.util.MailConnectException: Couldn't connect to host, port: webmail.gluu.org, 465; timeout 60000;
  nested exception is:
	java.net.SocketTimeoutException: connect timed out
	at com.sun.mail.smtp.SMTPTransport.openServer(SMTPTransport.java:2210)
	at com.sun.mail.smtp.SMTPTransport.protocolConnect(SMTPTransport.java:722)
	at javax.mail.Service.connect(Service.java:310)
	at javax.mail.Service.connect(Service.java:169)
	at javax.mail.Service.connect(Service.java:118)
	at javax.mail.Transport.send0(Transport.java:188)
	at javax.mail.Transport.send(Transport.java:118)
	at hudson.tasks.MailSender.run(MailSender.java:130)
	at hudson.tasks.Mailer.perform(Mailer.java:176)
	at hudson.tasks.Mailer.perform(Mailer.java:139)
	at hudson.tasks.BuildStepMonitor$1.perform(BuildStepMonitor.java:20)
	at hudson.model.AbstractBuild$AbstractBuildExecution.perform(AbstractBuild.java:741)
	at hudson.model.AbstractBuild$AbstractBuildExecution.performAllBuildSteps(AbstractBuild.java:690)
	at hudson.model.Build$BuildExecution.post2(Build.java:186)
	at hudson.model.AbstractBuild$AbstractBuildExecution.post(AbstractBuild.java:635)
	at hudson.model.Run.execute(Run.java:1905)
	at hudson.model.FreeStyleBuild.run(FreeStyleBuild.java:43)
	at hudson.model.ResourceController.execute(ResourceController.java:97)
	at hudson.model.Executor.run(Executor.java:428)
Caused by: java.net.SocketTimeoutException: connect timed out
	at java.net.PlainSocketImpl.socketConnect(Native Method)
	at java.net.AbstractPlainSocketImpl.doConnect(AbstractPlainSocketImpl.java:350)
	at java.net.AbstractPlainSocketImpl.connectToAddress(AbstractPlainSocketImpl.java:206)
	at java.net.AbstractPlainSocketImpl.connect(AbstractPlainSocketImpl.java:188)
	at java.net.SocksSocketImpl.connect(SocksSocketImpl.java:392)
	at java.net.Socket.connect(Socket.java:589)
	at com.sun.mail.util.SocketFetcher.createSocket(SocketFetcher.java:333)
	at com.sun.mail.util.SocketFetcher.getSocket(SocketFetcher.java:193)
	at com.sun.mail.smtp.SMTPTransport.openServer(SMTPTransport.java:2160)
	... 18 more
Finished: FAILURE