FailedConsole Output

Skipping 118 KB.. Full Log
aster/workspace/oxd-gen-client/target/lib/json-patch-1.9.jar
[INFO] Copying jna-platform-4.1.0.jar to /home/jenkins/.jenkins/jobs/oxD_master/workspace/oxd-gen-client/target/lib/jna-platform-4.1.0.jar
[INFO] Copying oxcore-persistence-model-5.0.0-SNAPSHOT.jar to /home/jenkins/.jenkins/jobs/oxD_master/workspace/oxd-gen-client/target/lib/oxcore-persistence-model-5.0.0-SNAPSHOT.jar
[INFO] Copying jackson-module-jaxb-annotations-2.11.2.jar to /home/jenkins/.jenkins/jobs/oxD_master/workspace/oxd-gen-client/target/lib/jackson-module-jaxb-annotations-2.11.2.jar
[INFO] Copying json-smart-2.3.jar to /home/jenkins/.jenkins/jobs/oxD_master/workspace/oxd-gen-client/target/lib/json-smart-2.3.jar
[INFO] Copying oxd-common.jar to /home/jenkins/.jenkins/jobs/oxD_master/workspace/oxd-gen-client/target/lib/oxd-common-5.0.0-SNAPSHOT.jar
[INFO] Copying oxauth-model-5.0.0-SNAPSHOT.jar to /home/jenkins/.jenkins/jobs/oxD_master/workspace/oxd-gen-client/target/lib/oxauth-model-5.0.0-SNAPSHOT.jar
[INFO] Copying listenablefuture-9999.0-empty-to-avoid-conflict-with-guava.jar to /home/jenkins/.jenkins/jobs/oxD_master/workspace/oxd-gen-client/target/lib/listenablefuture-9999.0-empty-to-avoid-conflict-with-guava.jar
[INFO] Copying log4j-api-2.13.3.jar to /home/jenkins/.jenkins/jobs/oxD_master/workspace/oxd-gen-client/target/lib/log4j-api-2.13.3.jar
[INFO] Copying json-20200518.jar to /home/jenkins/.jenkins/jobs/oxD_master/workspace/oxd-gen-client/target/lib/json-20200518.jar
[INFO] Copying okio-1.6.0.jar to /home/jenkins/.jenkins/jobs/oxD_master/workspace/oxd-gen-client/target/lib/okio-1.6.0.jar
[INFO] Copying commons-lang3-3.11.jar to /home/jenkins/.jenkins/jobs/oxD_master/workspace/oxd-gen-client/target/lib/commons-lang3-3.11.jar
[INFO] Copying reactive-streams-1.0.3.jar to /home/jenkins/.jenkins/jobs/oxD_master/workspace/oxd-gen-client/target/lib/reactive-streams-1.0.3.jar
[INFO] Copying oxcore-util-5.0.0-SNAPSHOT.jar to /home/jenkins/.jenkins/jobs/oxD_master/workspace/oxd-gen-client/target/lib/oxcore-util-5.0.0-SNAPSHOT.jar
[INFO] Copying accessors-smart-1.2.jar to /home/jenkins/.jenkins/jobs/oxD_master/workspace/oxd-gen-client/target/lib/accessors-smart-1.2.jar
[INFO] Copying validation-api-2.0.1.Final.jar to /home/jenkins/.jenkins/jobs/oxD_master/workspace/oxd-gen-client/target/lib/validation-api-2.0.1.Final.jar
[INFO] Copying uma-rs-resteasy-5.0.0-SNAPSHOT.jar to /home/jenkins/.jenkins/jobs/oxD_master/workspace/oxd-gen-client/target/lib/uma-rs-resteasy-5.0.0-SNAPSHOT.jar
[INFO] Copying jackson-datatype-json-org-2.11.2.jar to /home/jenkins/.jenkins/jobs/oxD_master/workspace/oxd-gen-client/target/lib/jackson-datatype-json-org-2.11.2.jar
[INFO] Copying javax.ws.rs-api-2.1.1.jar to /home/jenkins/.jenkins/jobs/oxD_master/workspace/oxd-gen-client/target/lib/javax.ws.rs-api-2.1.1.jar
[INFO] Copying j2objc-annotations-1.3.jar to /home/jenkins/.jenkins/jobs/oxD_master/workspace/oxd-gen-client/target/lib/j2objc-annotations-1.3.jar
[INFO] Copying oxeleven-client-5.0.0-SNAPSHOT.jar to /home/jenkins/.jenkins/jobs/oxD_master/workspace/oxd-gen-client/target/lib/oxeleven-client-5.0.0-SNAPSHOT.jar
[INFO] Copying resteasy-jackson2-provider-3.13.0.Final.jar to /home/jenkins/.jenkins/jobs/oxD_master/workspace/oxd-gen-client/target/lib/resteasy-jackson2-provider-3.13.0.Final.jar
[INFO] Copying cglib-nodep-2.1_3.jar to /home/jenkins/.jenkins/jobs/oxD_master/workspace/oxd-gen-client/target/lib/cglib-nodep-2.1_3.jar
[INFO] Copying jakarta.activation-1.2.1.jar to /home/jenkins/.jenkins/jobs/oxD_master/workspace/oxd-gen-client/target/lib/jakarta.activation-1.2.1.jar
[INFO] Copying asm-5.0.4.jar to /home/jenkins/.jenkins/jobs/oxD_master/workspace/oxd-gen-client/target/lib/asm-5.0.4.jar
[INFO] Copying annotations-18.0.0.jar to /home/jenkins/.jenkins/jobs/oxD_master/workspace/oxd-gen-client/target/lib/annotations-18.0.0.jar
[INFO] Copying oxcore-persistence-annotation-5.0.0-SNAPSHOT.jar to /home/jenkins/.jenkins/jobs/oxD_master/workspace/oxd-gen-client/target/lib/oxcore-persistence-annotation-5.0.0-SNAPSHOT.jar
[INFO] Copying javax.annotation-api-1.3.2.jar to /home/jenkins/.jenkins/jobs/oxD_master/workspace/oxd-gen-client/target/lib/javax.annotation-api-1.3.2.jar
[INFO] Copying uma-rs-core-5.0.0-SNAPSHOT.jar to /home/jenkins/.jenkins/jobs/oxD_master/workspace/oxd-gen-client/target/lib/uma-rs-core-5.0.0-SNAPSHOT.jar
[INFO] Copying guava-29.0-jre.jar to /home/jenkins/.jenkins/jobs/oxD_master/workspace/oxd-gen-client/target/lib/guava-29.0-jre.jar
[INFO] Copying failureaccess-1.0.1.jar to /home/jenkins/.jenkins/jobs/oxD_master/workspace/oxd-gen-client/target/lib/failureaccess-1.0.1.jar
[INFO] Copying hamcrest-core-1.3.jar to /home/jenkins/.jenkins/jobs/oxD_master/workspace/oxd-gen-client/target/lib/hamcrest-core-1.3.jar
[INFO] Copying commons-text-1.9.jar to /home/jenkins/.jenkins/jobs/oxD_master/workspace/oxd-gen-client/target/lib/commons-text-1.9.jar
[INFO] Copying bcpkix-jdk15on-1.66.jar to /home/jenkins/.jenkins/jobs/oxD_master/workspace/oxd-gen-client/target/lib/bcpkix-jdk15on-1.66.jar
[INFO] Copying swagger-annotations-2.0.0.jar to /home/jenkins/.jenkins/jobs/oxD_master/workspace/oxd-gen-client/target/lib/swagger-annotations-2.0.0.jar
[INFO] Copying jackson-core-2.11.2.jar to /home/jenkins/.jenkins/jobs/oxD_master/workspace/oxd-gen-client/target/lib/jackson-core-2.11.2.jar
[INFO] Copying jakarta.activation-api-1.2.1.jar to /home/jenkins/.jenkins/jobs/oxD_master/workspace/oxd-gen-client/target/lib/jakarta.activation-api-1.2.1.jar
[INFO] Copying commons-logging-1.2.jar to /home/jenkins/.jenkins/jobs/oxD_master/workspace/oxd-gen-client/target/lib/commons-logging-1.2.jar
[INFO] Copying resteasy-jaxrs-3.13.0.Final.jar to /home/jenkins/.jenkins/jobs/oxD_master/workspace/oxd-gen-client/target/lib/resteasy-jaxrs-3.13.0.Final.jar
[INFO] Copying selenium-api-2.53.1.jar to /home/jenkins/.jenkins/jobs/oxD_master/workspace/oxd-gen-client/target/lib/selenium-api-2.53.1.jar
[INFO] Copying slf4j-api-1.7.30.jar to /home/jenkins/.jenkins/jobs/oxD_master/workspace/oxd-gen-client/target/lib/slf4j-api-1.7.30.jar
[INFO] Copying commons-cli-1.3.1.jar to /home/jenkins/.jenkins/jobs/oxD_master/workspace/oxd-gen-client/target/lib/commons-cli-1.3.1.jar
[INFO] Copying commons-io-2.7.jar to /home/jenkins/.jenkins/jobs/oxD_master/workspace/oxd-gen-client/target/lib/commons-io-2.7.jar
[INFO] Copying jaxb-runtime-2.3.3-b02.jar to /home/jenkins/.jenkins/jobs/oxD_master/workspace/oxd-gen-client/target/lib/jaxb-runtime-2.3.3-b02.jar
[INFO] Copying btf-1.2.jar to /home/jenkins/.jenkins/jobs/oxD_master/workspace/oxd-gen-client/target/lib/btf-1.2.jar
[INFO] Copying gson-2.8.1.jar to /home/jenkins/.jenkins/jobs/oxD_master/workspace/oxd-gen-client/target/lib/gson-2.8.1.jar
[INFO] Copying bsh-2.0b6.jar to /home/jenkins/.jenkins/jobs/oxD_master/workspace/oxd-gen-client/target/lib/bsh-2.0b6.jar
[INFO] Copying jakarta.xml.bind-api-2.3.3.jar to /home/jenkins/.jenkins/jobs/oxD_master/workspace/oxd-gen-client/target/lib/jakarta.xml.bind-api-2.3.3.jar
[INFO] Copying httpcore-4.4.13.jar to /home/jenkins/.jenkins/jobs/oxD_master/workspace/oxd-gen-client/target/lib/httpcore-4.4.13.jar
[INFO] Copying jcip-annotations-1.0-1.jar to /home/jenkins/.jenkins/jobs/oxD_master/workspace/oxd-gen-client/target/lib/jcip-annotations-1.0-1.jar
[INFO] Copying msg-simple-1.1.jar to /home/jenkins/.jenkins/jobs/oxD_master/workspace/oxd-gen-client/target/lib/msg-simple-1.1.jar
[INFO] Copying jsr305-3.0.2.jar to /home/jenkins/.jenkins/jobs/oxD_master/workspace/oxd-gen-client/target/lib/jsr305-3.0.2.jar
[INFO] Copying jackson-annotations-2.11.2.jar to /home/jenkins/.jenkins/jobs/oxD_master/workspace/oxd-gen-client/target/lib/jackson-annotations-2.11.2.jar
[INFO] Copying httpclient-4.5.3.jar to /home/jenkins/.jenkins/jobs/oxD_master/workspace/oxd-gen-client/target/lib/httpclient-4.5.3.jar
[INFO] Copying oxeleven-model-5.0.0-SNAPSHOT.jar to /home/jenkins/.jenkins/jobs/oxD_master/workspace/oxd-gen-client/target/lib/oxeleven-model-5.0.0-SNAPSHOT.jar
[INFO] Copying jackson-databind-2.11.2.jar to /home/jenkins/.jenkins/jobs/oxD_master/workspace/oxd-gen-client/target/lib/jackson-databind-2.11.2.jar
[INFO] Copying commons-codec-1.14.jar to /home/jenkins/.jenkins/jobs/oxD_master/workspace/oxd-gen-client/target/lib/commons-codec-1.14.jar
[INFO] Copying commons-configuration-1.10.jar to /home/jenkins/.jenkins/jobs/oxD_master/workspace/oxd-gen-client/target/lib/commons-configuration-1.10.jar
[INFO] Copying testng-6.14.3.jar to /home/jenkins/.jenkins/jobs/oxD_master/workspace/oxd-gen-client/target/lib/testng-6.14.3.jar
[INFO] Copying jackson-jaxrs-base-2.10.1.jar to /home/jenkins/.jenkins/jobs/oxD_master/workspace/oxd-gen-client/target/lib/jackson-jaxrs-base-2.10.1.jar
[INFO] Copying threetenbp-1.3.5.jar to /home/jenkins/.jenkins/jobs/oxD_master/workspace/oxd-gen-client/target/lib/threetenbp-1.3.5.jar
[INFO] Copying jboss-jaxb-api_2.3_spec-2.0.0.Final.jar to /home/jenkins/.jenkins/jobs/oxD_master/workspace/oxd-gen-client/target/lib/jboss-jaxb-api_2.3_spec-2.0.0.Final.jar
[INFO] Copying selenium-remote-driver-2.53.1.jar to /home/jenkins/.jenkins/jobs/oxD_master/workspace/oxd-gen-client/target/lib/selenium-remote-driver-2.53.1.jar
[INFO] Copying log4j-slf4j-impl-2.13.3.jar to /home/jenkins/.jenkins/jobs/oxD_master/workspace/oxd-gen-client/target/lib/log4j-slf4j-impl-2.13.3.jar
[INFO] Copying error_prone_annotations-2.3.4.jar to /home/jenkins/.jenkins/jobs/oxD_master/workspace/oxd-gen-client/target/lib/error_prone_annotations-2.3.4.jar
[INFO] Copying commons-lang-2.6.jar to /home/jenkins/.jenkins/jobs/oxD_master/workspace/oxd-gen-client/target/lib/commons-lang-2.6.jar
[INFO] Copying checker-qual-2.11.1.jar to /home/jenkins/.jenkins/jobs/oxD_master/workspace/oxd-gen-client/target/lib/checker-qual-2.11.1.jar
[INFO] Copying commons-exec-1.3.jar to /home/jenkins/.jenkins/jobs/oxD_master/workspace/oxd-gen-client/target/lib/commons-exec-1.3.jar
[INFO] Copying jboss-logging-3.2.1.Final.jar to /home/jenkins/.jenkins/jobs/oxD_master/workspace/oxd-gen-client/target/lib/jboss-logging-3.2.1.Final.jar
[INFO] Copying log4j-1.2-api-2.13.3.jar to /home/jenkins/.jenkins/jobs/oxD_master/workspace/oxd-gen-client/target/lib/log4j-1.2-api-2.13.3.jar
[INFO] Copying jboss-jaxrs-api_2.1_spec-2.0.1.Final.jar to /home/jenkins/.jenkins/jobs/oxD_master/workspace/oxd-gen-client/target/lib/jboss-jaxrs-api_2.1_spec-2.0.1.Final.jar
[INFO] Copying resteasy-jaxb-provider-3.13.0.Final.jar to /home/jenkins/.jenkins/jobs/oxD_master/workspace/oxd-gen-client/target/lib/resteasy-jaxb-provider-3.13.0.Final.jar
[INFO] Copying nimbus-jose-jwt-8.20.jar to /home/jenkins/.jenkins/jobs/oxD_master/workspace/oxd-gen-client/target/lib/nimbus-jose-jwt-8.20.jar
[INFO] Copying commons-beanutils-1.9.4.jar to /home/jenkins/.jenkins/jobs/oxD_master/workspace/oxd-gen-client/target/lib/commons-beanutils-1.9.4.jar
[INFO] Copying persistence-api-1.0.2.jar to /home/jenkins/.jenkins/jobs/oxD_master/workspace/oxd-gen-client/target/lib/persistence-api-1.0.2.jar
[INFO] Copying oxauth-client-5.0.0-SNAPSHOT.jar to /home/jenkins/.jenkins/jobs/oxD_master/workspace/oxd-gen-client/target/lib/oxauth-client-5.0.0-SNAPSHOT.jar
[INFO] Copying oxd-common-tests.jar to /home/jenkins/.jenkins/jobs/oxD_master/workspace/oxd-gen-client/target/lib/oxd-common-5.0.0-SNAPSHOT-tests.jar
[INFO] Copying logging-interceptor-2.7.5.jar to /home/jenkins/.jenkins/jobs/oxD_master/workspace/oxd-gen-client/target/lib/logging-interceptor-2.7.5.jar
[INFO] Copying commons-collections-3.2.2.jar to /home/jenkins/.jenkins/jobs/oxD_master/workspace/oxd-gen-client/target/lib/commons-collections-3.2.2.jar
[INFO] Copying istack-commons-runtime-3.0.10.jar to /home/jenkins/.jenkins/jobs/oxD_master/workspace/oxd-gen-client/target/lib/istack-commons-runtime-3.0.10.jar
[INFO] Copying junit-4.12.jar to /home/jenkins/.jenkins/jobs/oxD_master/workspace/oxd-gen-client/target/lib/junit-4.12.jar
[INFO] Copying bcprov-jdk15on-1.66.jar to /home/jenkins/.jenkins/jobs/oxD_master/workspace/oxd-gen-client/target/lib/bcprov-jdk15on-1.66.jar
[INFO] Copying jakarta.validation-api-2.0.2.jar to /home/jenkins/.jenkins/jobs/oxD_master/workspace/oxd-gen-client/target/lib/jakarta.validation-api-2.0.2.jar
[INFO] Copying jboss-annotations-api_1.3_spec-2.0.1.Final.jar to /home/jenkins/.jenkins/jobs/oxD_master/workspace/oxd-gen-client/target/lib/jboss-annotations-api_1.3_spec-2.0.1.Final.jar
[INFO] Copying okhttp-2.7.5.jar to /home/jenkins/.jenkins/jobs/oxD_master/workspace/oxd-gen-client/target/lib/okhttp-2.7.5.jar
[INFO] Copying oxcore-model-5.0.0-SNAPSHOT.jar to /home/jenkins/.jenkins/jobs/oxD_master/workspace/oxd-gen-client/target/lib/oxcore-model-5.0.0-SNAPSHOT.jar
[INFO] Copying jcommander-1.78.jar to /home/jenkins/.jenkins/jobs/oxD_master/workspace/oxd-gen-client/target/lib/jcommander-1.78.jar
[INFO] Copying jackson-coreutils-1.6.jar to /home/jenkins/.jenkins/jobs/oxD_master/workspace/oxd-gen-client/target/lib/jackson-coreutils-1.6.jar
[INFO] Copying resteasy-client-3.13.0.Final.jar to /home/jenkins/.jenkins/jobs/oxD_master/workspace/oxd-gen-client/target/lib/resteasy-client-3.13.0.Final.jar
[INFO] Copying log4j-core-2.13.3.jar to /home/jenkins/.jenkins/jobs/oxD_master/workspace/oxd-gen-client/target/lib/log4j-core-2.13.3.jar
[INFO] Copying jna-4.1.0.jar to /home/jenkins/.jenkins/jobs/oxD_master/workspace/oxd-gen-client/target/lib/jna-4.1.0.jar
[INFO] Copying commons-httpclient-3.1.jar to /home/jenkins/.jenkins/jobs/oxD_master/workspace/oxd-gen-client/target/lib/commons-httpclient-3.1.jar
[INFO] Copying txw2-2.3.3-b02.jar to /home/jenkins/.jenkins/jobs/oxD_master/workspace/oxd-gen-client/target/lib/txw2-2.3.3-b02.jar
[INFO] 
[INFO] --- maven-jar-plugin:2.2:jar (default) @ oxd-gen-client ---
[INFO] 
[INFO] --- maven-jar-plugin:2.2:test-jar (default) @ oxd-gen-client ---
[INFO] Building jar: /home/jenkins/.jenkins/jobs/oxD_master/workspace/oxd-gen-client/target/oxd-gen-client-5.0.0-SNAPSHOT-tests.jar
[INFO] 
[INFO] --- maven-javadoc-plugin:2.10.4:jar (attach-javadocs) @ oxd-gen-client ---
[INFO] The goal 'org.apache.maven.plugins:maven-javadoc-plugin:2.10.4:javadoc' has not been previously called for the module: 'org.gluu:oxd-common:jar:5.0.0-SNAPSHOT'. Trying to invoke it...
[WARNING] Creating fake javadoc directory to prevent repeated invocations: /home/jenkins/.jenkins/jobs/oxD_master/workspace/oxd-common/target/apidocs
[ERROR] Error fetching link: /home/jenkins/.jenkins/jobs/oxD_master/workspace/oxd-common/target/apidocs/package-list. Ignored it.
[INFO] 
Loading source files for package io.swagger.client.api...
Loading source files for package io.swagger.client.auth...
Loading source files for package io.swagger.client.model...
Loading source files for package io.swagger.client...
Constructing Javadoc information...
Standard Doclet version 1.8.0_222
Building tree for all the packages and classes...
Generating /home/jenkins/.jenkins/jobs/oxD_master/workspace/oxd-gen-client/target/apidocs/io/swagger/client/api/DevelopersApi.html...
Generating /home/jenkins/.jenkins/jobs/oxD_master/workspace/oxd-gen-client/target/apidocs/io/swagger/client/auth/ApiKeyAuth.html...
Generating /home/jenkins/.jenkins/jobs/oxD_master/workspace/oxd-gen-client/target/apidocs/io/swagger/client/auth/Authentication.html...
Generating /home/jenkins/.jenkins/jobs/oxD_master/workspace/oxd-gen-client/target/apidocs/io/swagger/client/auth/HttpBasicAuth.html...
Generating /home/jenkins/.jenkins/jobs/oxD_master/workspace/oxd-gen-client/target/apidocs/io/swagger/client/auth/OAuth.html...
Generating /home/jenkins/.jenkins/jobs/oxD_master/workspace/oxd-gen-client/target/apidocs/io/swagger/client/auth/OAuthFlow.html...
Generating /home/jenkins/.jenkins/jobs/oxD_master/workspace/oxd-gen-client/target/apidocs/io/swagger/client/model/Condition.html...
Generating /home/jenkins/.jenkins/jobs/oxD_master/workspace/oxd-gen-client/target/apidocs/io/swagger/client/model/ErrorResponse.html...
Generating /home/jenkins/.jenkins/jobs/oxD_master/workspace/oxd-gen-client/target/apidocs/io/swagger/client/model/GetAccessTokenByRefreshTokenParams.html...
Generating /home/jenkins/.jenkins/jobs/oxD_master/workspace/oxd-gen-client/target/apidocs/io/swagger/client/model/GetAccessTokenByRefreshTokenResponse.html...
Generating /home/jenkins/.jenkins/jobs/oxD_master/workspace/oxd-gen-client/target/apidocs/io/swagger/client/model/GetAuthorizationUrlParams.html...
Generating /home/jenkins/.jenkins/jobs/oxD_master/workspace/oxd-gen-client/target/apidocs/io/swagger/client/model/GetAuthorizationUrlResponse.html...
Generating /home/jenkins/.jenkins/jobs/oxD_master/workspace/oxd-gen-client/target/apidocs/io/swagger/client/model/GetClientTokenParams.html...
Generating /home/jenkins/.jenkins/jobs/oxD_master/workspace/oxd-gen-client/target/apidocs/io/swagger/client/model/GetClientTokenResponse.html...
Generating /home/jenkins/.jenkins/jobs/oxD_master/workspace/oxd-gen-client/target/apidocs/io/swagger/client/model/GetDiscoveryParams.html...
Generating /home/jenkins/.jenkins/jobs/oxD_master/workspace/oxd-gen-client/target/apidocs/io/swagger/client/model/GetDiscoveryResponse.html...
Generating /home/jenkins/.jenkins/jobs/oxD_master/workspace/oxd-gen-client/target/apidocs/io/swagger/client/model/GetIssuerParams.html...
Generating /home/jenkins/.jenkins/jobs/oxD_master/workspace/oxd-gen-client/target/apidocs/io/swagger/client/model/GetIssuerResponse.html...
Generating /home/jenkins/.jenkins/jobs/oxD_master/workspace/oxd-gen-client/target/apidocs/io/swagger/client/model/GetJwksParams.html...
Generating /home/jenkins/.jenkins/jobs/oxD_master/workspace/oxd-gen-client/target/apidocs/io/swagger/client/model/GetJwksResponse.html...
Generating /home/jenkins/.jenkins/jobs/oxD_master/workspace/oxd-gen-client/target/apidocs/io/swagger/client/model/GetLogoutUriParams.html...
Generating /home/jenkins/.jenkins/jobs/oxD_master/workspace/oxd-gen-client/target/apidocs/io/swagger/client/model/GetLogoutUriResponse.html...
Generating /home/jenkins/.jenkins/jobs/oxD_master/workspace/oxd-gen-client/target/apidocs/io/swagger/client/model/GetRequestObjectUriParams.html...
Generating /home/jenkins/.jenkins/jobs/oxD_master/workspace/oxd-gen-client/target/apidocs/io/swagger/client/model/GetRequestObjectUriResponse.html...
Generating /home/jenkins/.jenkins/jobs/oxD_master/workspace/oxd-gen-client/target/apidocs/io/swagger/client/model/GetRpJwksResponse.html...
Generating /home/jenkins/.jenkins/jobs/oxD_master/workspace/oxd-gen-client/target/apidocs/io/swagger/client/model/GetTokensByCodeParams.html...
Generating /home/jenkins/.jenkins/jobs/oxD_master/workspace/oxd-gen-client/target/apidocs/io/swagger/client/model/GetTokensByCodeResponse.html...
Generating /home/jenkins/.jenkins/jobs/oxD_master/workspace/oxd-gen-client/target/apidocs/io/swagger/client/model/GetUserInfoParams.html...
Generating /home/jenkins/.jenkins/jobs/oxD_master/workspace/oxd-gen-client/target/apidocs/io/swagger/client/model/IntrospectAccessTokenParams.html...
Generating /home/jenkins/.jenkins/jobs/oxD_master/workspace/oxd-gen-client/target/apidocs/io/swagger/client/model/IntrospectAccessTokenResponse.html...
Generating /home/jenkins/.jenkins/jobs/oxD_master/workspace/oxd-gen-client/target/apidocs/io/swagger/client/model/IntrospectRptParams.html...
Generating /home/jenkins/.jenkins/jobs/oxD_master/workspace/oxd-gen-client/target/apidocs/io/swagger/client/model/IntrospectRptResponse.html...
Generating /home/jenkins/.jenkins/jobs/oxD_master/workspace/oxd-gen-client/target/apidocs/io/swagger/client/model/JsonWebKey.html...
Generating /home/jenkins/.jenkins/jobs/oxD_master/workspace/oxd-gen-client/target/apidocs/io/swagger/client/model/RegisterSiteParams.html...
Generating /home/jenkins/.jenkins/jobs/oxD_master/workspace/oxd-gen-client/target/apidocs/io/swagger/client/model/RegisterSiteResponse.html...
Generating /home/jenkins/.jenkins/jobs/oxD_master/workspace/oxd-gen-client/target/apidocs/io/swagger/client/model/RemoveSiteParams.html...
Generating /home/jenkins/.jenkins/jobs/oxD_master/workspace/oxd-gen-client/target/apidocs/io/swagger/client/model/RemoveSiteResponse.html...
Generating /home/jenkins/.jenkins/jobs/oxD_master/workspace/oxd-gen-client/target/apidocs/io/swagger/client/model/RsResource.html...
Generating /home/jenkins/.jenkins/jobs/oxD_master/workspace/oxd-gen-client/target/apidocs/io/swagger/client/model/UmaRpGetClaimsGatheringUrlParams.html...
Generating /home/jenkins/.jenkins/jobs/oxD_master/workspace/oxd-gen-client/target/apidocs/io/swagger/client/model/UmaRpGetClaimsGatheringUrlResponse.html...
Generating /home/jenkins/.jenkins/jobs/oxD_master/workspace/oxd-gen-client/target/apidocs/io/swagger/client/model/UmaRpGetRptParams.html...
Generating /home/jenkins/.jenkins/jobs/oxD_master/workspace/oxd-gen-client/target/apidocs/io/swagger/client/model/UmaRpGetRptResponse.html...
Generating /home/jenkins/.jenkins/jobs/oxD_master/workspace/oxd-gen-client/target/apidocs/io/swagger/client/model/UmaRsCheckAccessParams.html...
Generating /home/jenkins/.jenkins/jobs/oxD_master/workspace/oxd-gen-client/target/apidocs/io/swagger/client/model/UmaRsCheckAccessResponse.html...
Generating /home/jenkins/.jenkins/jobs/oxD_master/workspace/oxd-gen-client/target/apidocs/io/swagger/client/model/UmaRsModifyParams.html...
Generating /home/jenkins/.jenkins/jobs/oxD_master/workspace/oxd-gen-client/target/apidocs/io/swagger/client/model/UmaRsModifyResponse.html...
Generating /home/jenkins/.jenkins/jobs/oxD_master/workspace/oxd-gen-client/target/apidocs/io/swagger/client/model/UmaRsProtectParams.html...
Generating /home/jenkins/.jenkins/jobs/oxD_master/workspace/oxd-gen-client/target/apidocs/io/swagger/client/model/UmaRsProtectResponse.html...
Generating /home/jenkins/.jenkins/jobs/oxD_master/workspace/oxd-gen-client/target/apidocs/io/swagger/client/model/UpdateSiteParams.html...
Generating /home/jenkins/.jenkins/jobs/oxD_master/workspace/oxd-gen-client/target/apidocs/io/swagger/client/model/UpdateSiteResponse.html...
Generating /home/jenkins/.jenkins/jobs/oxD_master/workspace/oxd-gen-client/target/apidocs/io/swagger/client/model/WebFingerLink.html...
Generating /home/jenkins/.jenkins/jobs/oxD_master/workspace/oxd-gen-client/target/apidocs/io/swagger/client/ApiCallback.html...
Generating /home/jenkins/.jenkins/jobs/oxD_master/workspace/oxd-gen-client/target/apidocs/io/swagger/client/ApiClient.html...
Generating /home/jenkins/.jenkins/jobs/oxD_master/workspace/oxd-gen-client/target/apidocs/io/swagger/client/ApiException.html...
Generating /home/jenkins/.jenkins/jobs/oxD_master/workspace/oxd-gen-client/target/apidocs/io/swagger/client/ApiResponse.html...
Generating /home/jenkins/.jenkins/jobs/oxD_master/workspace/oxd-gen-client/target/apidocs/io/swagger/client/Configuration.html...
Generating /home/jenkins/.jenkins/jobs/oxD_master/workspace/oxd-gen-client/target/apidocs/io/swagger/client/JSON.html...
Generating /home/jenkins/.jenkins/jobs/oxD_master/workspace/oxd-gen-client/target/apidocs/io/swagger/client/JSON.DateTypeAdapter.html...
Generating /home/jenkins/.jenkins/jobs/oxD_master/workspace/oxd-gen-client/target/apidocs/io/swagger/client/JSON.LocalDateTypeAdapter.html...
Generating /home/jenkins/.jenkins/jobs/oxD_master/workspace/oxd-gen-client/target/apidocs/io/swagger/client/JSON.OffsetDateTimeTypeAdapter.html...
Generating /home/jenkins/.jenkins/jobs/oxD_master/workspace/oxd-gen-client/target/apidocs/io/swagger/client/JSON.SqlDateTypeAdapter.html...
Generating /home/jenkins/.jenkins/jobs/oxD_master/workspace/oxd-gen-client/target/apidocs/io/swagger/client/Pair.html...
Generating /home/jenkins/.jenkins/jobs/oxD_master/workspace/oxd-gen-client/target/apidocs/io/swagger/client/ProgressRequestBody.html...
Generating /home/jenkins/.jenkins/jobs/oxD_master/workspace/oxd-gen-client/target/apidocs/io/swagger/client/ProgressRequestBody.ProgressRequestListener.html...
Generating /home/jenkins/.jenkins/jobs/oxD_master/workspace/oxd-gen-client/target/apidocs/io/swagger/client/ProgressResponseBody.html...
Generating /home/jenkins/.jenkins/jobs/oxD_master/workspace/oxd-gen-client/target/apidocs/io/swagger/client/ProgressResponseBody.ProgressListener.html...
Generating /home/jenkins/.jenkins/jobs/oxD_master/workspace/oxd-gen-client/target/apidocs/io/swagger/client/StringUtil.html...
Generating /home/jenkins/.jenkins/jobs/oxD_master/workspace/oxd-gen-client/target/apidocs/overview-frame.html...
Generating /home/jenkins/.jenkins/jobs/oxD_master/workspace/oxd-gen-client/target/apidocs/io/swagger/client/package-frame.html...
Generating /home/jenkins/.jenkins/jobs/oxD_master/workspace/oxd-gen-client/target/apidocs/io/swagger/client/package-summary.html...
Generating /home/jenkins/.jenkins/jobs/oxD_master/workspace/oxd-gen-client/target/apidocs/io/swagger/client/package-tree.html...
Generating /home/jenkins/.jenkins/jobs/oxD_master/workspace/oxd-gen-client/target/apidocs/io/swagger/client/api/package-frame.html...
Generating /home/jenkins/.jenkins/jobs/oxD_master/workspace/oxd-gen-client/target/apidocs/io/swagger/client/api/package-summary.html...
Generating /home/jenkins/.jenkins/jobs/oxD_master/workspace/oxd-gen-client/target/apidocs/io/swagger/client/api/package-tree.html...
Generating /home/jenkins/.jenkins/jobs/oxD_master/workspace/oxd-gen-client/target/apidocs/io/swagger/client/auth/package-frame.html...
Generating /home/jenkins/.jenkins/jobs/oxD_master/workspace/oxd-gen-client/target/apidocs/io/swagger/client/auth/package-summary.html...
Generating /home/jenkins/.jenkins/jobs/oxD_master/workspace/oxd-gen-client/target/apidocs/io/swagger/client/auth/package-tree.html...
Generating /home/jenkins/.jenkins/jobs/oxD_master/workspace/oxd-gen-client/target/apidocs/io/swagger/client/model/package-frame.html...
Generating /home/jenkins/.jenkins/jobs/oxD_master/workspace/oxd-gen-client/target/apidocs/io/swagger/client/model/package-summary.html...
Generating /home/jenkins/.jenkins/jobs/oxD_master/workspace/oxd-gen-client/target/apidocs/io/swagger/client/model/package-tree.html...
Generating /home/jenkins/.jenkins/jobs/oxD_master/workspace/oxd-gen-client/target/apidocs/constant-values.html...
Generating /home/jenkins/.jenkins/jobs/oxD_master/workspace/oxd-gen-client/target/apidocs/serialized-form.html...
Generating /home/jenkins/.jenkins/jobs/oxD_master/workspace/oxd-gen-client/target/apidocs/io/swagger/client/api/class-use/DevelopersApi.html...
Generating /home/jenkins/.jenkins/jobs/oxD_master/workspace/oxd-gen-client/target/apidocs/io/swagger/client/auth/class-use/OAuthFlow.html...
Generating /home/jenkins/.jenkins/jobs/oxD_master/workspace/oxd-gen-client/target/apidocs/io/swagger/client/auth/class-use/OAuth.html...
Generating /home/jenkins/.jenkins/jobs/oxD_master/workspace/oxd-gen-client/target/apidocs/io/swagger/client/auth/class-use/HttpBasicAuth.html...
Generating /home/jenkins/.jenkins/jobs/oxD_master/workspace/oxd-gen-client/target/apidocs/io/swagger/client/auth/class-use/Authentication.html...
Generating /home/jenkins/.jenkins/jobs/oxD_master/workspace/oxd-gen-client/target/apidocs/io/swagger/client/auth/class-use/ApiKeyAuth.html...
Generating /home/jenkins/.jenkins/jobs/oxD_master/workspace/oxd-gen-client/target/apidocs/io/swagger/client/model/class-use/RsResource.html...
Generating /home/jenkins/.jenkins/jobs/oxD_master/workspace/oxd-gen-client/target/apidocs/io/swagger/client/model/class-use/RegisterSiteResponse.html...
Generating /home/jenkins/.jenkins/jobs/oxD_master/workspace/oxd-gen-client/target/apidocs/io/swagger/client/model/class-use/IntrospectRptResponse.html...
Generating /home/jenkins/.jenkins/jobs/oxD_master/workspace/oxd-gen-client/target/apidocs/io/swagger/client/model/class-use/GetJwksParams.html...
Generating /home/jenkins/.jenkins/jobs/oxD_master/workspace/oxd-gen-client/target/apidocs/io/swagger/client/model/class-use/GetIssuerParams.html...
Generating /home/jenkins/.jenkins/jobs/oxD_master/workspace/oxd-gen-client/target/apidocs/io/swagger/client/model/class-use/GetDiscoveryParams.html...
Generating /home/jenkins/.jenkins/jobs/oxD_master/workspace/oxd-gen-client/target/apidocs/io/swagger/client/model/class-use/GetClientTokenParams.html...
Generating /home/jenkins/.jenkins/jobs/oxD_master/workspace/oxd-gen-client/target/apidocs/io/swagger/client/model/class-use/GetAuthorizationUrlParams.html...
Generating /home/jenkins/.jenkins/jobs/oxD_master/workspace/oxd-gen-client/target/apidocs/io/swagger/client/model/class-use/UmaRsModifyParams.html...
Generating /home/jenkins/.jenkins/jobs/oxD_master/workspace/oxd-gen-client/target/apidocs/io/swagger/client/model/class-use/UmaRsCheckAccessResponse.html...
Generating /home/jenkins/.jenkins/jobs/oxD_master/workspace/oxd-gen-client/target/apidocs/io/swagger/client/model/class-use/UmaRsCheckAccessParams.html...
Generating /home/jenkins/.jenkins/jobs/oxD_master/workspace/oxd-gen-client/target/apidocs/io/swagger/client/model/class-use/UmaRpGetRptResponse.html...
Generating /home/jenkins/.jenkins/jobs/oxD_master/workspace/oxd-gen-client/target/apidocs/io/swagger/client/model/class-use/UmaRpGetRptParams.html...
Generating /home/jenkins/.jenkins/jobs/oxD_master/workspace/oxd-gen-client/target/apidocs/io/swagger/client/model/class-use/UmaRpGetClaimsGatheringUrlResponse.html...
Generating /home/jenkins/.jenkins/jobs/oxD_master/workspace/oxd-gen-client/target/apidocs/io/swagger/client/model/class-use/UmaRpGetClaimsGatheringUrlParams.html...
Generating /home/jenkins/.jenkins/jobs/oxD_master/workspace/oxd-gen-client/target/apidocs/io/swagger/client/model/class-use/RemoveSiteResponse.html...
Generating /home/jenkins/.jenkins/jobs/oxD_master/workspace/oxd-gen-client/target/apidocs/io/swagger/client/model/class-use/RemoveSiteParams.html...
Generating /home/jenkins/.jenkins/jobs/oxD_master/workspace/oxd-gen-client/target/apidocs/io/swagger/client/model/class-use/RegisterSiteParams.html...
Generating /home/jenkins/.jenkins/jobs/oxD_master/workspace/oxd-gen-client/target/apidocs/io/swagger/client/model/class-use/JsonWebKey.html...
Generating /home/jenkins/.jenkins/jobs/oxD_master/workspace/oxd-gen-client/target/apidocs/io/swagger/client/model/class-use/IntrospectRptParams.html...
Generating /home/jenkins/.jenkins/jobs/oxD_master/workspace/oxd-gen-client/target/apidocs/io/swagger/client/model/class-use/IntrospectAccessTokenResponse.html...
Generating /home/jenkins/.jenkins/jobs/oxD_master/workspace/oxd-gen-client/target/apidocs/io/swagger/client/model/class-use/IntrospectAccessTokenParams.html...
Generating /home/jenkins/.jenkins/jobs/oxD_master/workspace/oxd-gen-client/target/apidocs/io/swagger/client/model/class-use/GetUserInfoParams.html...
Generating /home/jenkins/.jenkins/jobs/oxD_master/workspace/oxd-gen-client/target/apidocs/io/swagger/client/model/class-use/GetTokensByCodeResponse.html...
Generating /home/jenkins/.jenkins/jobs/oxD_master/workspace/oxd-gen-client/target/apidocs/io/swagger/client/model/class-use/GetTokensByCodeParams.html...
Generating /home/jenkins/.jenkins/jobs/oxD_master/workspace/oxd-gen-client/target/apidocs/io/swagger/client/model/class-use/GetRpJwksResponse.html...
Generating /home/jenkins/.jenkins/jobs/oxD_master/workspace/oxd-gen-client/target/apidocs/io/swagger/client/model/class-use/GetRequestObjectUriResponse.html...
Generating /home/jenkins/.jenkins/jobs/oxD_master/workspace/oxd-gen-client/target/apidocs/io/swagger/client/model/class-use/GetRequestObjectUriParams.html...
Generating /home/jenkins/.jenkins/jobs/oxD_master/workspace/oxd-gen-client/target/apidocs/io/swagger/client/model/class-use/GetLogoutUriResponse.html...
Generating /home/jenkins/.jenkins/jobs/oxD_master/workspace/oxd-gen-client/target/apidocs/io/swagger/client/model/class-use/GetLogoutUriParams.html...
Generating /home/jenkins/.jenkins/jobs/oxD_master/workspace/oxd-gen-client/target/apidocs/io/swagger/client/model/class-use/GetJwksResponse.html...
Generating /home/jenkins/.jenkins/jobs/oxD_master/workspace/oxd-gen-client/target/apidocs/io/swagger/client/model/class-use/GetIssuerResponse.html...
Generating /home/jenkins/.jenkins/jobs/oxD_master/workspace/oxd-gen-client/target/apidocs/io/swagger/client/model/class-use/GetDiscoveryResponse.html...
Generating /home/jenkins/.jenkins/jobs/oxD_master/workspace/oxd-gen-client/target/apidocs/io/swagger/client/model/class-use/GetClientTokenResponse.html...
Generating /home/jenkins/.jenkins/jobs/oxD_master/workspace/oxd-gen-client/target/apidocs/io/swagger/client/model/class-use/GetAuthorizationUrlResponse.html...
Generating /home/jenkins/.jenkins/jobs/oxD_master/workspace/oxd-gen-client/target/apidocs/io/swagger/client/model/class-use/GetAccessTokenByRefreshTokenResponse.html...
Generating /home/jenkins/.jenkins/jobs/oxD_master/workspace/oxd-gen-client/target/apidocs/io/swagger/client/model/class-use/GetAccessTokenByRefreshTokenParams.html...
Generating /home/jenkins/.jenkins/jobs/oxD_master/workspace/oxd-gen-client/target/apidocs/io/swagger/client/model/class-use/ErrorResponse.html...
Generating /home/jenkins/.jenkins/jobs/oxD_master/workspace/oxd-gen-client/target/apidocs/io/swagger/client/model/class-use/Condition.html...
Generating /home/jenkins/.jenkins/jobs/oxD_master/workspace/oxd-gen-client/target/apidocs/io/swagger/client/model/class-use/WebFingerLink.html...
Generating /home/jenkins/.jenkins/jobs/oxD_master/workspace/oxd-gen-client/target/apidocs/io/swagger/client/model/class-use/UpdateSiteResponse.html...
Generating /home/jenkins/.jenkins/jobs/oxD_master/workspace/oxd-gen-client/target/apidocs/io/swagger/client/model/class-use/UpdateSiteParams.html...
Generating /home/jenkins/.jenkins/jobs/oxD_master/workspace/oxd-gen-client/target/apidocs/io/swagger/client/model/class-use/UmaRsProtectResponse.html...
Generating /home/jenkins/.jenkins/jobs/oxD_master/workspace/oxd-gen-client/target/apidocs/io/swagger/client/model/class-use/UmaRsProtectParams.html...
Generating /home/jenkins/.jenkins/jobs/oxD_master/workspace/oxd-gen-client/target/apidocs/io/swagger/client/model/class-use/UmaRsModifyResponse.html...
Generating /home/jenkins/.jenkins/jobs/oxD_master/workspace/oxd-gen-client/target/apidocs/io/swagger/client/class-use/StringUtil.html...
Generating /home/jenkins/.jenkins/jobs/oxD_master/workspace/oxd-gen-client/target/apidocs/io/swagger/client/class-use/ProgressResponseBody.html...
Generating /home/jenkins/.jenkins/jobs/oxD_master/workspace/oxd-gen-client/target/apidocs/io/swagger/client/class-use/ProgressResponseBody.ProgressListener.html...
Generating /home/jenkins/.jenkins/jobs/oxD_master/workspace/oxd-gen-client/target/apidocs/io/swagger/client/class-use/ProgressRequestBody.html...
Generating /home/jenkins/.jenkins/jobs/oxD_master/workspace/oxd-gen-client/target/apidocs/io/swagger/client/class-use/ProgressRequestBody.ProgressRequestListener.html...
Generating /home/jenkins/.jenkins/jobs/oxD_master/workspace/oxd-gen-client/target/apidocs/io/swagger/client/class-use/Pair.html...
Generating /home/jenkins/.jenkins/jobs/oxD_master/workspace/oxd-gen-client/target/apidocs/io/swagger/client/class-use/JSON.html...
Generating /home/jenkins/.jenkins/jobs/oxD_master/workspace/oxd-gen-client/target/apidocs/io/swagger/client/class-use/JSON.OffsetDateTimeTypeAdapter.html...
Generating /home/jenkins/.jenkins/jobs/oxD_master/workspace/oxd-gen-client/target/apidocs/io/swagger/client/class-use/JSON.LocalDateTypeAdapter.html...
Generating /home/jenkins/.jenkins/jobs/oxD_master/workspace/oxd-gen-client/target/apidocs/io/swagger/client/class-use/JSON.SqlDateTypeAdapter.html...
Generating /home/jenkins/.jenkins/jobs/oxD_master/workspace/oxd-gen-client/target/apidocs/io/swagger/client/class-use/JSON.DateTypeAdapter.html...
Generating /home/jenkins/.jenkins/jobs/oxD_master/workspace/oxd-gen-client/target/apidocs/io/swagger/client/class-use/Configuration.html...
Generating /home/jenkins/.jenkins/jobs/oxD_master/workspace/oxd-gen-client/target/apidocs/io/swagger/client/class-use/ApiResponse.html...
Generating /home/jenkins/.jenkins/jobs/oxD_master/workspace/oxd-gen-client/target/apidocs/io/swagger/client/class-use/ApiException.html...
Generating /home/jenkins/.jenkins/jobs/oxD_master/workspace/oxd-gen-client/target/apidocs/io/swagger/client/class-use/ApiClient.html...
Generating /home/jenkins/.jenkins/jobs/oxD_master/workspace/oxd-gen-client/target/apidocs/io/swagger/client/class-use/ApiCallback.html...
Generating /home/jenkins/.jenkins/jobs/oxD_master/workspace/oxd-gen-client/target/apidocs/io/swagger/client/package-use.html...
Generating /home/jenkins/.jenkins/jobs/oxD_master/workspace/oxd-gen-client/target/apidocs/io/swagger/client/api/package-use.html...
Generating /home/jenkins/.jenkins/jobs/oxD_master/workspace/oxd-gen-client/target/apidocs/io/swagger/client/auth/package-use.html...
Generating /home/jenkins/.jenkins/jobs/oxD_master/workspace/oxd-gen-client/target/apidocs/io/swagger/client/model/package-use.html...
Building index for all the packages and classes...
Generating /home/jenkins/.jenkins/jobs/oxD_master/workspace/oxd-gen-client/target/apidocs/overview-tree.html...
Generating /home/jenkins/.jenkins/jobs/oxD_master/workspace/oxd-gen-client/target/apidocs/index-all.html...
Generating /home/jenkins/.jenkins/jobs/oxD_master/workspace/oxd-gen-client/target/apidocs/deprecated-list.html...
Building index for all classes...
Generating /home/jenkins/.jenkins/jobs/oxD_master/workspace/oxd-gen-client/target/apidocs/allclasses-frame.html...
Generating /home/jenkins/.jenkins/jobs/oxD_master/workspace/oxd-gen-client/target/apidocs/allclasses-noframe.html...
Generating /home/jenkins/.jenkins/jobs/oxD_master/workspace/oxd-gen-client/target/apidocs/index.html...
Generating /home/jenkins/.jenkins/jobs/oxD_master/workspace/oxd-gen-client/target/apidocs/overview-summary.html...
Generating /home/jenkins/.jenkins/jobs/oxD_master/workspace/oxd-gen-client/target/apidocs/help-doc.html...
[INFO] Building jar: /home/jenkins/.jenkins/jobs/oxD_master/workspace/oxd-gen-client/target/oxd-gen-client-5.0.0-SNAPSHOT-javadoc.jar
[INFO] 
[INFO] --- maven-source-plugin:2.2.1:jar-no-fork (attach-sources) @ oxd-gen-client ---
[INFO] Building jar: /home/jenkins/.jenkins/jobs/oxD_master/workspace/oxd-gen-client/target/oxd-gen-client-5.0.0-SNAPSHOT-sources.jar
[INFO] 
[INFO] >>> maven-source-plugin:2.2.1:jar (attach-sources) > generate-sources @ oxd-gen-client >>>
[INFO] 
[INFO] --- build-helper-maven-plugin:1.10:add-source (add_sources) @ oxd-gen-client ---
[INFO] Source directory: /home/jenkins/.jenkins/jobs/oxD_master/workspace/oxd-gen-client/src/main/java added.
[INFO] 
[INFO] <<< maven-source-plugin:2.2.1:jar (attach-sources) < generate-sources @ oxd-gen-client <<<
[INFO] 
[INFO] --- maven-source-plugin:2.2.1:jar (attach-sources) @ oxd-gen-client ---
[INFO] 
[INFO] --- maven-install-plugin:2.3.1:install (default-install) @ oxd-gen-client ---
[INFO] Installing /home/jenkins/.jenkins/jobs/oxD_master/workspace/oxd-gen-client/target/oxd-gen-client-5.0.0-SNAPSHOT.jar to /var/www/html/maven/org/gluu/oxd-gen-client/5.0.0-SNAPSHOT/oxd-gen-client-5.0.0-SNAPSHOT.jar
[INFO] Installing /home/jenkins/.jenkins/jobs/oxD_master/workspace/oxd-gen-client/pom.xml to /var/www/html/maven/org/gluu/oxd-gen-client/5.0.0-SNAPSHOT/oxd-gen-client-5.0.0-SNAPSHOT.pom
[INFO] Installing /home/jenkins/.jenkins/jobs/oxD_master/workspace/oxd-gen-client/target/oxd-gen-client-5.0.0-SNAPSHOT-tests.jar to /var/www/html/maven/org/gluu/oxd-gen-client/5.0.0-SNAPSHOT/oxd-gen-client-5.0.0-SNAPSHOT-tests.jar
[INFO] Installing /home/jenkins/.jenkins/jobs/oxD_master/workspace/oxd-gen-client/target/oxd-gen-client-5.0.0-SNAPSHOT-javadoc.jar to /var/www/html/maven/org/gluu/oxd-gen-client/5.0.0-SNAPSHOT/oxd-gen-client-5.0.0-SNAPSHOT-javadoc.jar
[INFO] Installing /home/jenkins/.jenkins/jobs/oxD_master/workspace/oxd-gen-client/target/oxd-gen-client-5.0.0-SNAPSHOT-sources.jar to /var/www/html/maven/org/gluu/oxd-gen-client/5.0.0-SNAPSHOT/oxd-gen-client-5.0.0-SNAPSHOT-sources.jar
[INFO] Installing /home/jenkins/.jenkins/jobs/oxD_master/workspace/oxd-gen-client/target/oxd-gen-client-5.0.0-SNAPSHOT-sources.jar to /var/www/html/maven/org/gluu/oxd-gen-client/5.0.0-SNAPSHOT/oxd-gen-client-5.0.0-SNAPSHOT-sources.jar
[INFO]                                                                         
[INFO] ------------------------------------------------------------------------
[INFO] Building oxD Server 5.0.0-SNAPSHOT
[INFO] ------------------------------------------------------------------------
[WARNING] Failure to transfer com.google.guava:guava/maven-metadata.xml from http://repo1.maven.org/maven2 was cached in the local repository, resolution will not be reattempted until the update interval of central has elapsed or updates are forced. Original error: Could not transfer metadata com.google.guava:guava/maven-metadata.xml from/to central (http://repo1.maven.org/maven2): Failed to transfer file: http://repo1.maven.org/maven2/com/google/guava/guava/maven-metadata.xml. Return code is: 501 , ReasonPhrase:HTTPS Required.
[WARNING] Failure to transfer com.google.guava:guava/maven-metadata.xml from http://repo2.maven.org/maven2/org/bouncycastle was cached in the local repository, resolution will not be reattempted until the update interval of bouncycastle has elapsed or updates are forced. Original error: Could not transfer metadata com.google.guava:guava/maven-metadata.xml from/to bouncycastle (http://repo2.maven.org/maven2/org/bouncycastle): repo2.maven.org
Downloading: https://oss.sonatype.org/content/repositories/snapshots/com/google/guava/guava/maven-metadata.xml
429/429 B   
            
Downloaded: https://oss.sonatype.org/content/repositories/snapshots/com/google/guava/guava/maven-metadata.xml (429 B at 3.1 KB/sec)
[WARNING] Failure to transfer com.google.guava:guava/maven-metadata.xml from http://repo1.maven.org/maven2 was cached in the local repository, resolution will not be reattempted until the update interval of central has elapsed or updates are forced. Original error: Could not transfer metadata com.google.guava:guava/maven-metadata.xml from/to central (http://repo1.maven.org/maven2): Failed to transfer file: http://repo1.maven.org/maven2/com/google/guava/guava/maven-metadata.xml. Return code is: 501 , ReasonPhrase:HTTPS Required.
[WARNING] Failure to transfer com.google.guava:guava/maven-metadata.xml from http://repo2.maven.org/maven2/org/bouncycastle was cached in the local repository, resolution will not be reattempted until the update interval of bouncycastle has elapsed or updates are forced. Original error: Could not transfer metadata com.google.guava:guava/maven-metadata.xml from/to bouncycastle (http://repo2.maven.org/maven2/org/bouncycastle): repo2.maven.org
Downloading: https://oss.sonatype.org/content/repositories/snapshots/com/google/guava/guava/maven-metadata.xml
429/429 B   
            
Downloaded: https://oss.sonatype.org/content/repositories/snapshots/com/google/guava/guava/maven-metadata.xml (429 B at 11.0 KB/sec)
[WARNING] Failure to transfer com.google.guava:guava/maven-metadata.xml from http://repo1.maven.org/maven2 was cached in the local repository, resolution will not be reattempted until the update interval of central has elapsed or updates are forced. Original error: Could not transfer metadata com.google.guava:guava/maven-metadata.xml from/to central (http://repo1.maven.org/maven2): Failed to transfer file: http://repo1.maven.org/maven2/com/google/guava/guava/maven-metadata.xml. Return code is: 501 , ReasonPhrase:HTTPS Required.
[WARNING] Failure to transfer com.google.guava:guava/maven-metadata.xml from http://repo2.maven.org/maven2/org/bouncycastle was cached in the local repository, resolution will not be reattempted until the update interval of bouncycastle has elapsed or updates are forced. Original error: Could not transfer metadata com.google.guava:guava/maven-metadata.xml from/to bouncycastle (http://repo2.maven.org/maven2/org/bouncycastle): repo2.maven.org
[WARNING] Failure to transfer com.google.guava:guava/maven-metadata.xml from http://repo1.maven.org/maven2 was cached in the local repository, resolution will not be reattempted until the update interval of central has elapsed or updates are forced. Original error: Could not transfer metadata com.google.guava:guava/maven-metadata.xml from/to central (http://repo1.maven.org/maven2): Failed to transfer file: http://repo1.maven.org/maven2/com/google/guava/guava/maven-metadata.xml. Return code is: 501 , ReasonPhrase:HTTPS Required.
[WARNING] Failure to transfer com.google.guava:guava/maven-metadata.xml from http://repo2.maven.org/maven2/org/bouncycastle was cached in the local repository, resolution will not be reattempted until the update interval of bouncycastle has elapsed or updates are forced. Original error: Could not transfer metadata com.google.guava:guava/maven-metadata.xml from/to bouncycastle (http://repo2.maven.org/maven2/org/bouncycastle): repo2.maven.org
[WARNING] Failure to transfer net.minidev:json-smart/maven-metadata.xml from http://repo2.maven.org/maven2/org/bouncycastle was cached in the local repository, resolution will not be reattempted until the update interval of bouncycastle has elapsed or updates are forced. Original error: Could not transfer metadata net.minidev:json-smart/maven-metadata.xml from/to bouncycastle (http://repo2.maven.org/maven2/org/bouncycastle): repo2.maven.org
[WARNING] Failure to transfer com.google.guava:guava/maven-metadata.xml from http://repo1.maven.org/maven2 was cached in the local repository, resolution will not be reattempted until the update interval of central has elapsed or updates are forced. Original error: Could not transfer metadata com.google.guava:guava/maven-metadata.xml from/to central (http://repo1.maven.org/maven2): Failed to transfer file: http://repo1.maven.org/maven2/com/google/guava/guava/maven-metadata.xml. Return code is: 501 , ReasonPhrase:HTTPS Required.
[WARNING] Failure to transfer com.google.guava:guava/maven-metadata.xml from http://repo2.maven.org/maven2/org/bouncycastle was cached in the local repository, resolution will not be reattempted until the update interval of bouncycastle has elapsed or updates are forced. Original error: Could not transfer metadata com.google.guava:guava/maven-metadata.xml from/to bouncycastle (http://repo2.maven.org/maven2/org/bouncycastle): repo2.maven.org
[WARNING] Failure to transfer com.google.guava:guava/maven-metadata.xml from http://repo1.maven.org/maven2 was cached in the local repository, resolution will not be reattempted until the update interval of central has elapsed or updates are forced. Original error: Could not transfer metadata com.google.guava:guava/maven-metadata.xml from/to central (http://repo1.maven.org/maven2): Failed to transfer file: http://repo1.maven.org/maven2/com/google/guava/guava/maven-metadata.xml. Return code is: 501 , ReasonPhrase:HTTPS Required.
[WARNING] Failure to transfer com.google.guava:guava/maven-metadata.xml from http://repo2.maven.org/maven2/org/bouncycastle was cached in the local repository, resolution will not be reattempted until the update interval of bouncycastle has elapsed or updates are forced. Original error: Could not transfer metadata com.google.guava:guava/maven-metadata.xml from/to bouncycastle (http://repo2.maven.org/maven2/org/bouncycastle): repo2.maven.org
Downloading: http://repo2.maven.org/maven2/org/bouncycastle/org/gluu/oxcore-service/5.0.0-SNAPSHOT/maven-metadata.xml
Downloading: http://repo1.maven.org/maven2/org/gluu/oxcore-service/5.0.0-SNAPSHOT/maven-metadata.xml
Downloading: file:///home/jenkins/.jenkins/jobs/oxD_master/workspace/oxd-server/../oxd-repo/org/gluu/oxcore-service/5.0.0-SNAPSHOT/maven-metadata.xml
            
            
            
[WARNING] Could not transfer metadata org.gluu:oxcore-service:5.0.0-SNAPSHOT/maven-metadata.xml from/to central (http://repo1.maven.org/maven2): Failed to transfer file: http://repo1.maven.org/maven2/org/gluu/oxcore-service/5.0.0-SNAPSHOT/maven-metadata.xml. Return code is: 501 , ReasonPhrase:HTTPS Required.
[WARNING] Could not transfer metadata org.gluu:oxcore-service:5.0.0-SNAPSHOT/maven-metadata.xml from/to bouncycastle (http://repo2.maven.org/maven2/org/bouncycastle): repo2.maven.org: Name or service not known
[WARNING] Failure to transfer org.gluu:oxcore-service:5.0.0-SNAPSHOT/maven-metadata.xml from http://repo1.maven.org/maven2 was cached in the local repository, resolution will not be reattempted until the update interval of central has elapsed or updates are forced. Original error: Could not transfer metadata org.gluu:oxcore-service:5.0.0-SNAPSHOT/maven-metadata.xml from/to central (http://repo1.maven.org/maven2): Failed to transfer file: http://repo1.maven.org/maven2/org/gluu/oxcore-service/5.0.0-SNAPSHOT/maven-metadata.xml. Return code is: 501 , ReasonPhrase:HTTPS Required.
[WARNING] Failure to transfer org.gluu:oxcore-service:5.0.0-SNAPSHOT/maven-metadata.xml from http://repo2.maven.org/maven2/org/bouncycastle was cached in the local repository, resolution will not be reattempted until the update interval of bouncycastle has elapsed or updates are forced. Original error: Could not transfer metadata org.gluu:oxcore-service:5.0.0-SNAPSHOT/maven-metadata.xml from/to bouncycastle (http://repo2.maven.org/maven2/org/bouncycastle): repo2.maven.org: Name or service not known
Downloading: file:///home/jenkins/.jenkins/jobs/oxD_master/workspace/oxd-server/../oxd-repo/org/gluu/oxcore-persistence-couchbase/5.0.0-SNAPSHOT/maven-metadata.xml
Downloading: http://repo1.maven.org/maven2/org/gluu/oxcore-persistence-couchbase/5.0.0-SNAPSHOT/maven-metadata.xml
Downloading: http://repo2.maven.org/maven2/org/bouncycastle/org/gluu/oxcore-persistence-couchbase/5.0.0-SNAPSHOT/maven-metadata.xml
            
            
            
[WARNING] Could not transfer metadata org.gluu:oxcore-persistence-couchbase:5.0.0-SNAPSHOT/maven-metadata.xml from/to central (http://repo1.maven.org/maven2): Failed to transfer file: http://repo1.maven.org/maven2/org/gluu/oxcore-persistence-couchbase/5.0.0-SNAPSHOT/maven-metadata.xml. Return code is: 501 , ReasonPhrase:HTTPS Required.
[WARNING] Could not transfer metadata org.gluu:oxcore-persistence-couchbase:5.0.0-SNAPSHOT/maven-metadata.xml from/to bouncycastle (http://repo2.maven.org/maven2/org/bouncycastle): repo2.maven.org
[WARNING] Failure to transfer org.gluu:oxcore-persistence-couchbase:5.0.0-SNAPSHOT/maven-metadata.xml from http://repo1.maven.org/maven2 was cached in the local repository, resolution will not be reattempted until the update interval of central has elapsed or updates are forced. Original error: Could not transfer metadata org.gluu:oxcore-persistence-couchbase:5.0.0-SNAPSHOT/maven-metadata.xml from/to central (http://repo1.maven.org/maven2): Failed to transfer file: http://repo1.maven.org/maven2/org/gluu/oxcore-persistence-couchbase/5.0.0-SNAPSHOT/maven-metadata.xml. Return code is: 501 , ReasonPhrase:HTTPS Required.
[WARNING] Failure to transfer org.gluu:oxcore-persistence-couchbase:5.0.0-SNAPSHOT/maven-metadata.xml from http://repo2.maven.org/maven2/org/bouncycastle was cached in the local repository, resolution will not be reattempted until the update interval of bouncycastle has elapsed or updates are forced. Original error: Could not transfer metadata org.gluu:oxcore-persistence-couchbase:5.0.0-SNAPSHOT/maven-metadata.xml from/to bouncycastle (http://repo2.maven.org/maven2/org/bouncycastle): repo2.maven.org
Downloading: file:///home/jenkins/.jenkins/jobs/oxD_master/workspace/oxd-server/../oxd-repo/org/gluu/oxcore-persistence-filter/5.0.0-SNAPSHOT/maven-metadata.xml
Downloading: http://repo2.maven.org/maven2/org/bouncycastle/org/gluu/oxcore-persistence-filter/5.0.0-SNAPSHOT/maven-metadata.xml
Downloading: http://repo1.maven.org/maven2/org/gluu/oxcore-persistence-filter/5.0.0-SNAPSHOT/maven-metadata.xml
            
            
            
[WARNING] Could not transfer metadata org.gluu:oxcore-persistence-filter:5.0.0-SNAPSHOT/maven-metadata.xml from/to central (http://repo1.maven.org/maven2): Failed to transfer file: http://repo1.maven.org/maven2/org/gluu/oxcore-persistence-filter/5.0.0-SNAPSHOT/maven-metadata.xml. Return code is: 501 , ReasonPhrase:HTTPS Required.
[WARNING] Could not transfer metadata org.gluu:oxcore-persistence-filter:5.0.0-SNAPSHOT/maven-metadata.xml from/to bouncycastle (http://repo2.maven.org/maven2/org/bouncycastle): repo2.maven.org
[WARNING] Failure to transfer org.gluu:oxcore-persistence-filter:5.0.0-SNAPSHOT/maven-metadata.xml from http://repo1.maven.org/maven2 was cached in the local repository, resolution will not be reattempted until the update interval of central has elapsed or updates are forced. Original error: Could not transfer metadata org.gluu:oxcore-persistence-filter:5.0.0-SNAPSHOT/maven-metadata.xml from/to central (http://repo1.maven.org/maven2): Failed to transfer file: http://repo1.maven.org/maven2/org/gluu/oxcore-persistence-filter/5.0.0-SNAPSHOT/maven-metadata.xml. Return code is: 501 , ReasonPhrase:HTTPS Required.
[WARNING] Failure to transfer org.gluu:oxcore-persistence-filter:5.0.0-SNAPSHOT/maven-metadata.xml from http://repo2.maven.org/maven2/org/bouncycastle was cached in the local repository, resolution will not be reattempted until the update interval of bouncycastle has elapsed or updates are forced. Original error: Could not transfer metadata org.gluu:oxcore-persistence-filter:5.0.0-SNAPSHOT/maven-metadata.xml from/to bouncycastle (http://repo2.maven.org/maven2/org/bouncycastle): repo2.maven.org
Downloading: http://repo2.maven.org/maven2/org/bouncycastle/org/gluu/oxcore-persistence-core/5.0.0-SNAPSHOT/maven-metadata.xml
Downloading: http://repo1.maven.org/maven2/org/gluu/oxcore-persistence-core/5.0.0-SNAPSHOT/maven-metadata.xml
Downloading: file:///home/jenkins/.jenkins/jobs/oxD_master/workspace/oxd-server/../oxd-repo/org/gluu/oxcore-persistence-core/5.0.0-SNAPSHOT/maven-metadata.xml
            
            
            
[WARNING] Could not transfer metadata org.gluu:oxcore-persistence-core:5.0.0-SNAPSHOT/maven-metadata.xml from/to central (http://repo1.maven.org/maven2): Failed to transfer file: http://repo1.maven.org/maven2/org/gluu/oxcore-persistence-core/5.0.0-SNAPSHOT/maven-metadata.xml. Return code is: 501 , ReasonPhrase:HTTPS Required.
[WARNING] Could not transfer metadata org.gluu:oxcore-persistence-core:5.0.0-SNAPSHOT/maven-metadata.xml from/to bouncycastle (http://repo2.maven.org/maven2/org/bouncycastle): repo2.maven.org
[WARNING] Failure to transfer org.gluu:oxcore-persistence-core:5.0.0-SNAPSHOT/maven-metadata.xml from http://repo1.maven.org/maven2 was cached in the local repository, resolution will not be reattempted until the update interval of central has elapsed or updates are forced. Original error: Could not transfer metadata org.gluu:oxcore-persistence-core:5.0.0-SNAPSHOT/maven-metadata.xml from/to central (http://repo1.maven.org/maven2): Failed to transfer file: http://repo1.maven.org/maven2/org/gluu/oxcore-persistence-core/5.0.0-SNAPSHOT/maven-metadata.xml. Return code is: 501 , ReasonPhrase:HTTPS Required.
[WARNING] Failure to transfer org.gluu:oxcore-persistence-core:5.0.0-SNAPSHOT/maven-metadata.xml from http://repo2.maven.org/maven2/org/bouncycastle was cached in the local repository, resolution will not be reattempted until the update interval of bouncycastle has elapsed or updates are forced. Original error: Could not transfer metadata org.gluu:oxcore-persistence-core:5.0.0-SNAPSHOT/maven-metadata.xml from/to bouncycastle (http://repo2.maven.org/maven2/org/bouncycastle): repo2.maven.org
Downloading: http://repo1.maven.org/maven2/org/gluu/oxcore-persistence-hybrid/5.0.0-SNAPSHOT/maven-metadata.xml
Downloading: http://repo2.maven.org/maven2/org/bouncycastle/org/gluu/oxcore-persistence-hybrid/5.0.0-SNAPSHOT/maven-metadata.xml
Downloading: file:///home/jenkins/.jenkins/jobs/oxD_master/workspace/oxd-server/../oxd-repo/org/gluu/oxcore-persistence-hybrid/5.0.0-SNAPSHOT/maven-metadata.xml
            
            
            
[WARNING] Could not transfer metadata org.gluu:oxcore-persistence-hybrid:5.0.0-SNAPSHOT/maven-metadata.xml from/to central (http://repo1.maven.org/maven2): Failed to transfer file: http://repo1.maven.org/maven2/org/gluu/oxcore-persistence-hybrid/5.0.0-SNAPSHOT/maven-metadata.xml. Return code is: 501 , ReasonPhrase:HTTPS Required.
[WARNING] Could not transfer metadata org.gluu:oxcore-persistence-hybrid:5.0.0-SNAPSHOT/maven-metadata.xml from/to bouncycastle (http://repo2.maven.org/maven2/org/bouncycastle): repo2.maven.org
[WARNING] Failure to transfer org.gluu:oxcore-persistence-hybrid:5.0.0-SNAPSHOT/maven-metadata.xml from http://repo1.maven.org/maven2 was cached in the local repository, resolution will not be reattempted until the update interval of central has elapsed or updates are forced. Original error: Could not transfer metadata org.gluu:oxcore-persistence-hybrid:5.0.0-SNAPSHOT/maven-metadata.xml from/to central (http://repo1.maven.org/maven2): Failed to transfer file: http://repo1.maven.org/maven2/org/gluu/oxcore-persistence-hybrid/5.0.0-SNAPSHOT/maven-metadata.xml. Return code is: 501 , ReasonPhrase:HTTPS Required.
[WARNING] Failure to transfer org.gluu:oxcore-persistence-hybrid:5.0.0-SNAPSHOT/maven-metadata.xml from http://repo2.maven.org/maven2/org/bouncycastle was cached in the local repository, resolution will not be reattempted until the update interval of bouncycastle has elapsed or updates are forced. Original error: Could not transfer metadata org.gluu:oxcore-persistence-hybrid:5.0.0-SNAPSHOT/maven-metadata.xml from/to bouncycastle (http://repo2.maven.org/maven2/org/bouncycastle): repo2.maven.org
Downloading: http://repo1.maven.org/maven2/org/gluu/oxcore-persistence-cdi/5.0.0-SNAPSHOT/maven-metadata.xml
Downloading: file:///home/jenkins/.jenkins/jobs/oxD_master/workspace/oxd-server/../oxd-repo/org/gluu/oxcore-persistence-cdi/5.0.0-SNAPSHOT/maven-metadata.xml
Downloading: http://repo2.maven.org/maven2/org/bouncycastle/org/gluu/oxcore-persistence-cdi/5.0.0-SNAPSHOT/maven-metadata.xml
            
            
            
[WARNING] Could not transfer metadata org.gluu:oxcore-persistence-cdi:5.0.0-SNAPSHOT/maven-metadata.xml from/to central (http://repo1.maven.org/maven2): Failed to transfer file: http://repo1.maven.org/maven2/org/gluu/oxcore-persistence-cdi/5.0.0-SNAPSHOT/maven-metadata.xml. Return code is: 501 , ReasonPhrase:HTTPS Required.
[WARNING] Could not transfer metadata org.gluu:oxcore-persistence-cdi:5.0.0-SNAPSHOT/maven-metadata.xml from/to bouncycastle (http://repo2.maven.org/maven2/org/bouncycastle): repo2.maven.org
[WARNING] Failure to transfer org.gluu:oxcore-persistence-cdi:5.0.0-SNAPSHOT/maven-metadata.xml from http://repo1.maven.org/maven2 was cached in the local repository, resolution will not be reattempted until the update interval of central has elapsed or updates are forced. Original error: Could not transfer metadata org.gluu:oxcore-persistence-cdi:5.0.0-SNAPSHOT/maven-metadata.xml from/to central (http://repo1.maven.org/maven2): Failed to transfer file: http://repo1.maven.org/maven2/org/gluu/oxcore-persistence-cdi/5.0.0-SNAPSHOT/maven-metadata.xml. Return code is: 501 , ReasonPhrase:HTTPS Required.
[WARNING] Failure to transfer org.gluu:oxcore-persistence-cdi:5.0.0-SNAPSHOT/maven-metadata.xml from http://repo2.maven.org/maven2/org/bouncycastle was cached in the local repository, resolution will not be reattempted until the update interval of bouncycastle has elapsed or updates are forced. Original error: Could not transfer metadata org.gluu:oxcore-persistence-cdi:5.0.0-SNAPSHOT/maven-metadata.xml from/to bouncycastle (http://repo2.maven.org/maven2/org/bouncycastle): repo2.maven.org
Downloading: file:///home/jenkins/.jenkins/jobs/oxD_master/workspace/oxd-server/../oxd-repo/org/gluu/oxcore-cache/5.0.0-SNAPSHOT/maven-metadata.xml
Downloading: http://repo2.maven.org/maven2/org/bouncycastle/org/gluu/oxcore-cache/5.0.0-SNAPSHOT/maven-metadata.xml
Downloading: http://repo1.maven.org/maven2/org/gluu/oxcore-cache/5.0.0-SNAPSHOT/maven-metadata.xml
            
            
            
[WARNING] Could not transfer metadata org.gluu:oxcore-cache:5.0.0-SNAPSHOT/maven-metadata.xml from/to central (http://repo1.maven.org/maven2): Failed to transfer file: http://repo1.maven.org/maven2/org/gluu/oxcore-cache/5.0.0-SNAPSHOT/maven-metadata.xml. Return code is: 501 , ReasonPhrase:HTTPS Required.
[WARNING] Could not transfer metadata org.gluu:oxcore-cache:5.0.0-SNAPSHOT/maven-metadata.xml from/to bouncycastle (http://repo2.maven.org/maven2/org/bouncycastle): repo2.maven.org
[WARNING] Failure to transfer org.gluu:oxcore-cache:5.0.0-SNAPSHOT/maven-metadata.xml from http://repo1.maven.org/maven2 was cached in the local repository, resolution will not be reattempted until the update interval of central has elapsed or updates are forced. Original error: Could not transfer metadata org.gluu:oxcore-cache:5.0.0-SNAPSHOT/maven-metadata.xml from/to central (http://repo1.maven.org/maven2): Failed to transfer file: http://repo1.maven.org/maven2/org/gluu/oxcore-cache/5.0.0-SNAPSHOT/maven-metadata.xml. Return code is: 501 , ReasonPhrase:HTTPS Required.
[WARNING] Failure to transfer org.gluu:oxcore-cache:5.0.0-SNAPSHOT/maven-metadata.xml from http://repo2.maven.org/maven2/org/bouncycastle was cached in the local repository, resolution will not be reattempted until the update interval of bouncycastle has elapsed or updates are forced. Original error: Could not transfer metadata org.gluu:oxcore-cache:5.0.0-SNAPSHOT/maven-metadata.xml from/to bouncycastle (http://repo2.maven.org/maven2/org/bouncycastle): repo2.maven.org
Downloading: http://repo2.maven.org/maven2/org/bouncycastle/org/gluu/oxcore-script/5.0.0-SNAPSHOT/maven-metadata.xml
Downloading: http://repo1.maven.org/maven2/org/gluu/oxcore-script/5.0.0-SNAPSHOT/maven-metadata.xml
Downloading: file:///home/jenkins/.jenkins/jobs/oxD_master/workspace/oxd-server/../oxd-repo/org/gluu/oxcore-script/5.0.0-SNAPSHOT/maven-metadata.xml
            
            
            
[WARNING] Could not transfer metadata org.gluu:oxcore-script:5.0.0-SNAPSHOT/maven-metadata.xml from/to central (http://repo1.maven.org/maven2): Failed to transfer file: http://repo1.maven.org/maven2/org/gluu/oxcore-script/5.0.0-SNAPSHOT/maven-metadata.xml. Return code is: 501 , ReasonPhrase:HTTPS Required.
[WARNING] Could not transfer metadata org.gluu:oxcore-script:5.0.0-SNAPSHOT/maven-metadata.xml from/to bouncycastle (http://repo2.maven.org/maven2/org/bouncycastle): repo2.maven.org
[WARNING] Failure to transfer org.gluu:oxcore-script:5.0.0-SNAPSHOT/maven-metadata.xml from http://repo1.maven.org/maven2 was cached in the local repository, resolution will not be reattempted until the update interval of central has elapsed or updates are forced. Original error: Could not transfer metadata org.gluu:oxcore-script:5.0.0-SNAPSHOT/maven-metadata.xml from/to central (http://repo1.maven.org/maven2): Failed to transfer file: http://repo1.maven.org/maven2/org/gluu/oxcore-script/5.0.0-SNAPSHOT/maven-metadata.xml. Return code is: 501 , ReasonPhrase:HTTPS Required.
[WARNING] Failure to transfer org.gluu:oxcore-script:5.0.0-SNAPSHOT/maven-metadata.xml from http://repo2.maven.org/maven2/org/bouncycastle was cached in the local repository, resolution will not be reattempted until the update interval of bouncycastle has elapsed or updates are forced. Original error: Could not transfer metadata org.gluu:oxcore-script:5.0.0-SNAPSHOT/maven-metadata.xml from/to bouncycastle (http://repo2.maven.org/maven2/org/bouncycastle): repo2.maven.org
Downloading: http://repo1.maven.org/maven2/org/gluu/oxcore-cdi/5.0.0-SNAPSHOT/maven-metadata.xml
Downloading: file:///home/jenkins/.jenkins/jobs/oxD_master/workspace/oxd-server/../oxd-repo/org/gluu/oxcore-cdi/5.0.0-SNAPSHOT/maven-metadata.xml
Downloading: http://repo2.maven.org/maven2/org/bouncycastle/org/gluu/oxcore-cdi/5.0.0-SNAPSHOT/maven-metadata.xml
            
            
            
[WARNING] Could not transfer metadata org.gluu:oxcore-cdi:5.0.0-SNAPSHOT/maven-metadata.xml from/to central (http://repo1.maven.org/maven2): Failed to transfer file: http://repo1.maven.org/maven2/org/gluu/oxcore-cdi/5.0.0-SNAPSHOT/maven-metadata.xml. Return code is: 501 , ReasonPhrase:HTTPS Required.
[WARNING] Could not transfer metadata org.gluu:oxcore-cdi:5.0.0-SNAPSHOT/maven-metadata.xml from/to bouncycastle (http://repo2.maven.org/maven2/org/bouncycastle): repo2.maven.org
[WARNING] Failure to transfer org.gluu:oxcore-cdi:5.0.0-SNAPSHOT/maven-metadata.xml from http://repo1.maven.org/maven2 was cached in the local repository, resolution will not be reattempted until the update interval of central has elapsed or updates are forced. Original error: Could not transfer metadata org.gluu:oxcore-cdi:5.0.0-SNAPSHOT/maven-metadata.xml from/to central (http://repo1.maven.org/maven2): Failed to transfer file: http://repo1.maven.org/maven2/org/gluu/oxcore-cdi/5.0.0-SNAPSHOT/maven-metadata.xml. Return code is: 501 , ReasonPhrase:HTTPS Required.
[WARNING] Failure to transfer org.gluu:oxcore-cdi:5.0.0-SNAPSHOT/maven-metadata.xml from http://repo2.maven.org/maven2/org/bouncycastle was cached in the local repository, resolution will not be reattempted until the update interval of bouncycastle has elapsed or updates are forced. Original error: Could not transfer metadata org.gluu:oxcore-cdi:5.0.0-SNAPSHOT/maven-metadata.xml from/to bouncycastle (http://repo2.maven.org/maven2/org/bouncycastle): repo2.maven.org
Downloading: file:///home/jenkins/.jenkins/jobs/oxD_master/workspace/oxd-server/../oxd-repo/org/gluu/oxcore-standalone/5.0.0-SNAPSHOT/maven-metadata.xml
Downloading: http://repo1.maven.org/maven2/org/gluu/oxcore-standalone/5.0.0-SNAPSHOT/maven-metadata.xml
Downloading: http://repo2.maven.org/maven2/org/bouncycastle/org/gluu/oxcore-standalone/5.0.0-SNAPSHOT/maven-metadata.xml
            
            
            
[WARNING] Could not transfer metadata org.gluu:oxcore-standalone:5.0.0-SNAPSHOT/maven-metadata.xml from/to central (http://repo1.maven.org/maven2): Failed to transfer file: http://repo1.maven.org/maven2/org/gluu/oxcore-standalone/5.0.0-SNAPSHOT/maven-metadata.xml. Return code is: 501 , ReasonPhrase:HTTPS Required.
[WARNING] Could not transfer metadata org.gluu:oxcore-standalone:5.0.0-SNAPSHOT/maven-metadata.xml from/to bouncycastle (http://repo2.maven.org/maven2/org/bouncycastle): repo2.maven.org
[WARNING] Failure to transfer org.gluu:oxcore-standalone:5.0.0-SNAPSHOT/maven-metadata.xml from http://repo1.maven.org/maven2 was cached in the local repository, resolution will not be reattempted until the update interval of central has elapsed or updates are forced. Original error: Could not transfer metadata org.gluu:oxcore-standalone:5.0.0-SNAPSHOT/maven-metadata.xml from/to central (http://repo1.maven.org/maven2): Failed to transfer file: http://repo1.maven.org/maven2/org/gluu/oxcore-standalone/5.0.0-SNAPSHOT/maven-metadata.xml. Return code is: 501 , ReasonPhrase:HTTPS Required.
[WARNING] Failure to transfer org.gluu:oxcore-standalone:5.0.0-SNAPSHOT/maven-metadata.xml from http://repo2.maven.org/maven2/org/bouncycastle was cached in the local repository, resolution will not be reattempted until the update interval of bouncycastle has elapsed or updates are forced. Original error: Could not transfer metadata org.gluu:oxcore-standalone:5.0.0-SNAPSHOT/maven-metadata.xml from/to bouncycastle (http://repo2.maven.org/maven2/org/bouncycastle): repo2.maven.org
Downloading: http://repo1.maven.org/maven2/org/gluu/oxcore-persistence-ldap/5.0.0-SNAPSHOT/maven-metadata.xml
Downloading: file:///home/jenkins/.jenkins/jobs/oxD_master/workspace/oxd-server/../oxd-repo/org/gluu/oxcore-persistence-ldap/5.0.0-SNAPSHOT/maven-metadata.xml
Downloading: http://repo2.maven.org/maven2/org/bouncycastle/org/gluu/oxcore-persistence-ldap/5.0.0-SNAPSHOT/maven-metadata.xml
            
            
            
[WARNING] Could not transfer metadata org.gluu:oxcore-persistence-ldap:5.0.0-SNAPSHOT/maven-metadata.xml from/to central (http://repo1.maven.org/maven2): Failed to transfer file: http://repo1.maven.org/maven2/org/gluu/oxcore-persistence-ldap/5.0.0-SNAPSHOT/maven-metadata.xml. Return code is: 501 , ReasonPhrase:HTTPS Required.
[WARNING] Could not transfer metadata org.gluu:oxcore-persistence-ldap:5.0.0-SNAPSHOT/maven-metadata.xml from/to bouncycastle (http://repo2.maven.org/maven2/org/bouncycastle): repo2.maven.org
[WARNING] Failure to transfer org.gluu:oxcore-persistence-ldap:5.0.0-SNAPSHOT/maven-metadata.xml from http://repo1.maven.org/maven2 was cached in the local repository, resolution will not be reattempted until the update interval of central has elapsed or updates are forced. Original error: Could not transfer metadata org.gluu:oxcore-persistence-ldap:5.0.0-SNAPSHOT/maven-metadata.xml from/to central (http://repo1.maven.org/maven2): Failed to transfer file: http://repo1.maven.org/maven2/org/gluu/oxcore-persistence-ldap/5.0.0-SNAPSHOT/maven-metadata.xml. Return code is: 501 , ReasonPhrase:HTTPS Required.
[WARNING] Failure to transfer org.gluu:oxcore-persistence-ldap:5.0.0-SNAPSHOT/maven-metadata.xml from http://repo2.maven.org/maven2/org/bouncycastle was cached in the local repository, resolution will not be reattempted until the update interval of bouncycastle has elapsed or updates are forced. Original error: Could not transfer metadata org.gluu:oxcore-persistence-ldap:5.0.0-SNAPSHOT/maven-metadata.xml from/to bouncycastle (http://repo2.maven.org/maven2/org/bouncycastle): repo2.maven.org
Downloading: http://repo2.maven.org/maven2/org/bouncycastle/org/gluu/oxcore-persistence-standalone/5.0.0-SNAPSHOT/maven-metadata.xml
Downloading: http://repo1.maven.org/maven2/org/gluu/oxcore-persistence-standalone/5.0.0-SNAPSHOT/maven-metadata.xml
Downloading: file:///home/jenkins/.jenkins/jobs/oxD_master/workspace/oxd-server/../oxd-repo/org/gluu/oxcore-persistence-standalone/5.0.0-SNAPSHOT/maven-metadata.xml
            
            
            
[WARNING] Could not transfer metadata org.gluu:oxcore-persistence-standalone:5.0.0-SNAPSHOT/maven-metadata.xml from/to central (http://repo1.maven.org/maven2): Failed to transfer file: http://repo1.maven.org/maven2/org/gluu/oxcore-persistence-standalone/5.0.0-SNAPSHOT/maven-metadata.xml. Return code is: 501 , ReasonPhrase:HTTPS Required.
[WARNING] Could not transfer metadata org.gluu:oxcore-persistence-standalone:5.0.0-SNAPSHOT/maven-metadata.xml from/to bouncycastle (http://repo2.maven.org/maven2/org/bouncycastle): repo2.maven.org
[WARNING] Failure to transfer org.gluu:oxcore-persistence-standalone:5.0.0-SNAPSHOT/maven-metadata.xml from http://repo1.maven.org/maven2 was cached in the local repository, resolution will not be reattempted until the update interval of central has elapsed or updates are forced. Original error: Could not transfer metadata org.gluu:oxcore-persistence-standalone:5.0.0-SNAPSHOT/maven-metadata.xml from/to central (http://repo1.maven.org/maven2): Failed to transfer file: http://repo1.maven.org/maven2/org/gluu/oxcore-persistence-standalone/5.0.0-SNAPSHOT/maven-metadata.xml. Return code is: 501 , ReasonPhrase:HTTPS Required.
[WARNING] Failure to transfer org.gluu:oxcore-persistence-standalone:5.0.0-SNAPSHOT/maven-metadata.xml from http://repo2.maven.org/maven2/org/bouncycastle was cached in the local repository, resolution will not be reattempted until the update interval of bouncycastle has elapsed or updates are forced. Original error: Could not transfer metadata org.gluu:oxcore-persistence-standalone:5.0.0-SNAPSHOT/maven-metadata.xml from/to bouncycastle (http://repo2.maven.org/maven2/org/bouncycastle): repo2.maven.org
[WARNING] Failure to transfer org.gluu:uma-rs-resteasy:5.0.0-SNAPSHOT/maven-metadata.xml from http://repo1.maven.org/maven2 was cached in the local repository, resolution will not be reattempted until the update interval of central has elapsed or updates are forced. Original error: Could not transfer metadata org.gluu:uma-rs-resteasy:5.0.0-SNAPSHOT/maven-metadata.xml from/to central (http://repo1.maven.org/maven2): Failed to transfer file: http://repo1.maven.org/maven2/org/gluu/uma-rs-resteasy/5.0.0-SNAPSHOT/maven-metadata.xml. Return code is: 501 , ReasonPhrase:HTTPS Required.
[WARNING] Failure to transfer org.gluu:uma-rs-resteasy:5.0.0-SNAPSHOT/maven-metadata.xml from http://repo2.maven.org/maven2/org/bouncycastle was cached in the local repository, resolution will not be reattempted until the update interval of bouncycastle has elapsed or updates are forced. Original error: Could not transfer metadata org.gluu:uma-rs-resteasy:5.0.0-SNAPSHOT/maven-metadata.xml from/to bouncycastle (http://repo2.maven.org/maven2/org/bouncycastle): repo2.maven.org
[WARNING] Failure to transfer org.gluu:uma-rs-core:5.0.0-SNAPSHOT/maven-metadata.xml from http://repo1.maven.org/maven2 was cached in the local repository, resolution will not be reattempted until the update interval of central has elapsed or updates are forced. Original error: Could not transfer metadata org.gluu:uma-rs-core:5.0.0-SNAPSHOT/maven-metadata.xml from/to central (http://repo1.maven.org/maven2): Failed to transfer file: http://repo1.maven.org/maven2/org/gluu/uma-rs-core/5.0.0-SNAPSHOT/maven-metadata.xml. Return code is: 501 , ReasonPhrase:HTTPS Required.
[WARNING] Failure to transfer org.gluu:uma-rs-core:5.0.0-SNAPSHOT/maven-metadata.xml from http://repo2.maven.org/maven2/org/bouncycastle was cached in the local repository, resolution will not be reattempted until the update interval of bouncycastle has elapsed or updates are forced. Original error: Could not transfer metadata org.gluu:uma-rs-core:5.0.0-SNAPSHOT/maven-metadata.xml from/to bouncycastle (http://repo2.maven.org/maven2/org/bouncycastle): repo2.maven.org
[WARNING] Failure to transfer org.gluu:oxcore-persistence-annotation:5.0.0-SNAPSHOT/maven-metadata.xml from http://repo1.maven.org/maven2 was cached in the local repository, resolution will not be reattempted until the update interval of central has elapsed or updates are forced. Original error: Could not transfer metadata org.gluu:oxcore-persistence-annotation:5.0.0-SNAPSHOT/maven-metadata.xml from/to central (http://repo1.maven.org/maven2): Failed to transfer file: http://repo1.maven.org/maven2/org/gluu/oxcore-persistence-annotation/5.0.0-SNAPSHOT/maven-metadata.xml. Return code is: 501 , ReasonPhrase:HTTPS Required.
[WARNING] Failure to transfer org.gluu:oxcore-persistence-annotation:5.0.0-SNAPSHOT/maven-metadata.xml from http://repo2.maven.org/maven2/org/bouncycastle was cached in the local repository, resolution will not be reattempted until the update interval of bouncycastle has elapsed or updates are forced. Original error: Could not transfer metadata org.gluu:oxcore-persistence-annotation:5.0.0-SNAPSHOT/maven-metadata.xml from/to bouncycastle (http://repo2.maven.org/maven2/org/bouncycastle): repo2.maven.org
[WARNING] Failure to transfer org.gluu:oxauth-client:5.0.0-SNAPSHOT/maven-metadata.xml from http://repo1.maven.org/maven2 was cached in the local repository, resolution will not be reattempted until the update interval of central has elapsed or updates are forced. Original error: Could not transfer metadata org.gluu:oxauth-client:5.0.0-SNAPSHOT/maven-metadata.xml from/to central (http://repo1.maven.org/maven2): Failed to transfer file: http://repo1.maven.org/maven2/org/gluu/oxauth-client/5.0.0-SNAPSHOT/maven-metadata.xml. Return code is: 501 , ReasonPhrase:HTTPS Required.
[WARNING] Failure to transfer org.gluu:oxauth-client:5.0.0-SNAPSHOT/maven-metadata.xml from http://repo2.maven.org/maven2/org/bouncycastle was cached in the local repository, resolution will not be reattempted until the update interval of bouncycastle has elapsed or updates are forced. Original error: Could not transfer metadata org.gluu:oxauth-client:5.0.0-SNAPSHOT/maven-metadata.xml from/to bouncycastle (http://repo2.maven.org/maven2/org/bouncycastle): repo2.maven.org
[WARNING] Failure to transfer org.gluu:oxauth-model:5.0.0-SNAPSHOT/maven-metadata.xml from http://repo1.maven.org/maven2 was cached in the local repository, resolution will not be reattempted until the update interval of central has elapsed or updates are forced. Original error: Could not transfer metadata org.gluu:oxauth-model:5.0.0-SNAPSHOT/maven-metadata.xml from/to central (http://repo1.maven.org/maven2): Failed to transfer file: http://repo1.maven.org/maven2/org/gluu/oxauth-model/5.0.0-SNAPSHOT/maven-metadata.xml. Return code is: 501 , ReasonPhrase:HTTPS Required.
[WARNING] Failure to transfer org.gluu:oxauth-model:5.0.0-SNAPSHOT/maven-metadata.xml from http://repo2.maven.org/maven2/org/bouncycastle was cached in the local repository, resolution will not be reattempted until the update interval of bouncycastle has elapsed or updates are forced. Original error: Could not transfer metadata org.gluu:oxauth-model:5.0.0-SNAPSHOT/maven-metadata.xml from/to bouncycastle (http://repo2.maven.org/maven2/org/bouncycastle): repo2.maven.org
[WARNING] Failure to transfer org.gluu:oxeleven-client:5.0.0-SNAPSHOT/maven-metadata.xml from http://repo1.maven.org/maven2 was cached in the local repository, resolution will not be reattempted until the update interval of central has elapsed or updates are forced. Original error: Could not transfer metadata org.gluu:oxeleven-client:5.0.0-SNAPSHOT/maven-metadata.xml from/to central (http://repo1.maven.org/maven2): Failed to transfer file: http://repo1.maven.org/maven2/org/gluu/oxeleven-client/5.0.0-SNAPSHOT/maven-metadata.xml. Return code is: 501 , ReasonPhrase:HTTPS Required.
[WARNING] Failure to transfer org.gluu:oxeleven-client:5.0.0-SNAPSHOT/maven-metadata.xml from http://repo2.maven.org/maven2/org/bouncycastle was cached in the local repository, resolution will not be reattempted until the update interval of bouncycastle has elapsed or updates are forced. Original error: Could not transfer metadata org.gluu:oxeleven-client:5.0.0-SNAPSHOT/maven-metadata.xml from/to bouncycastle (http://repo2.maven.org/maven2/org/bouncycastle): repo2.maven.org
[WARNING] Failure to transfer org.gluu:oxeleven-model:5.0.0-SNAPSHOT/maven-metadata.xml from http://repo1.maven.org/maven2 was cached in the local repository, resolution will not be reattempted until the update interval of central has elapsed or updates are forced. Original error: Could not transfer metadata org.gluu:oxeleven-model:5.0.0-SNAPSHOT/maven-metadata.xml from/to central (http://repo1.maven.org/maven2): Failed to transfer file: http://repo1.maven.org/maven2/org/gluu/oxeleven-model/5.0.0-SNAPSHOT/maven-metadata.xml. Return code is: 501 , ReasonPhrase:HTTPS Required.
[WARNING] Failure to transfer org.gluu:oxeleven-model:5.0.0-SNAPSHOT/maven-metadata.xml from http://repo2.maven.org/maven2/org/bouncycastle was cached in the local repository, resolution will not be reattempted until the update interval of bouncycastle has elapsed or updates are forced. Original error: Could not transfer metadata org.gluu:oxeleven-model:5.0.0-SNAPSHOT/maven-metadata.xml from/to bouncycastle (http://repo2.maven.org/maven2/org/bouncycastle): repo2.maven.org
[WARNING] Failure to transfer org.gluu:oxcore-model:5.0.0-SNAPSHOT/maven-metadata.xml from http://repo1.maven.org/maven2 was cached in the local repository, resolution will not be reattempted until the update interval of central has elapsed or updates are forced. Original error: Could not transfer metadata org.gluu:oxcore-model:5.0.0-SNAPSHOT/maven-metadata.xml from/to central (http://repo1.maven.org/maven2): Failed to transfer file: http://repo1.maven.org/maven2/org/gluu/oxcore-model/5.0.0-SNAPSHOT/maven-metadata.xml. Return code is: 501 , ReasonPhrase:HTTPS Required.
[WARNING] Failure to transfer org.gluu:oxcore-model:5.0.0-SNAPSHOT/maven-metadata.xml from http://repo2.maven.org/maven2/org/bouncycastle was cached in the local repository, resolution will not be reattempted until the update interval of bouncycastle has elapsed or updates are forced. Original error: Could not transfer metadata org.gluu:oxcore-model:5.0.0-SNAPSHOT/maven-metadata.xml from/to bouncycastle (http://repo2.maven.org/maven2/org/bouncycastle): repo2.maven.org
[WARNING] Failure to transfer org.gluu:oxcore-persistence-model:5.0.0-SNAPSHOT/maven-metadata.xml from http://repo1.maven.org/maven2 was cached in the local repository, resolution will not be reattempted until the update interval of central has elapsed or updates are forced. Original error: Could not transfer metadata org.gluu:oxcore-persistence-model:5.0.0-SNAPSHOT/maven-metadata.xml from/to central (http://repo1.maven.org/maven2): Failed to transfer file: http://repo1.maven.org/maven2/org/gluu/oxcore-persistence-model/5.0.0-SNAPSHOT/maven-metadata.xml. Return code is: 501 , ReasonPhrase:HTTPS Required.
[WARNING] Failure to transfer org.gluu:oxcore-persistence-model:5.0.0-SNAPSHOT/maven-metadata.xml from http://repo2.maven.org/maven2/org/bouncycastle was cached in the local repository, resolution will not be reattempted until the update interval of bouncycastle has elapsed or updates are forced. Original error: Could not transfer metadata org.gluu:oxcore-persistence-model:5.0.0-SNAPSHOT/maven-metadata.xml from/to bouncycastle (http://repo2.maven.org/maven2/org/bouncycastle): repo2.maven.org
[WARNING] Failure to transfer org.gluu:oxcore-util:5.0.0-SNAPSHOT/maven-metadata.xml from http://repo1.maven.org/maven2 was cached in the local repository, resolution will not be reattempted until the update interval of central has elapsed or updates are forced. Original error: Could not transfer metadata org.gluu:oxcore-util:5.0.0-SNAPSHOT/maven-metadata.xml from/to central (http://repo1.maven.org/maven2): Failed to transfer file: http://repo1.maven.org/maven2/org/gluu/oxcore-util/5.0.0-SNAPSHOT/maven-metadata.xml. Return code is: 501 , ReasonPhrase:HTTPS Required.
[WARNING] Failure to transfer org.gluu:oxcore-util:5.0.0-SNAPSHOT/maven-metadata.xml from http://repo2.maven.org/maven2/org/bouncycastle was cached in the local repository, resolution will not be reattempted until the update interval of bouncycastle has elapsed or updates are forced. Original error: Could not transfer metadata org.gluu:oxcore-util:5.0.0-SNAPSHOT/maven-metadata.xml from/to bouncycastle (http://repo2.maven.org/maven2/org/bouncycastle): repo2.maven.org
[INFO] 
[INFO] --- maven-clean-plugin:2.5:clean (default-clean) @ oxd-server ---
[INFO] Deleting /home/jenkins/.jenkins/jobs/oxD_master/workspace/oxd-server/target
[INFO] 
[INFO] --- git-commit-id-plugin:2.1.12:revision (get-the-git-infos) @ oxd-server ---
[INFO] 
[INFO] --- maven-resources-plugin:2.4:resources (default-resources) @ oxd-server ---
[INFO] Using 'UTF-8' encoding to copy filtered resources.
[INFO] Copying 3 resources
[INFO] 
[INFO] --- maven-compiler-plugin:2.3.2:compile (default-compile) @ oxd-server ---
[INFO] Compiling 90 source files to /home/jenkins/.jenkins/jobs/oxD_master/workspace/oxd-server/target/classes
[INFO] 
[INFO] --- git-commit-id-plugin:2.1.12:revision (get-the-git-infos) @ oxd-server ---
[INFO] 
[INFO] --- maven-resources-plugin:2.4:resources (default-resources) @ oxd-server ---
[INFO] Using 'UTF-8' encoding to copy filtered resources.
[INFO] Copying 3 resources
[INFO] 
[INFO] --- maven-compiler-plugin:2.3.2:compile (default-compile) @ oxd-server ---
[INFO] Nothing to compile - all classes are up to date
[INFO] 
[INFO] --- maven-resources-plugin:2.4:testResources (default-testResources) @ oxd-server ---
[INFO] Using 'UTF-8' encoding to copy filtered resources.
[INFO] Copying 13 resources
[INFO] 
[INFO] --- maven-compiler-plugin:2.3.2:testCompile (default-testCompile) @ oxd-server ---
[INFO] Compiling 54 source files to /home/jenkins/.jenkins/jobs/oxD_master/workspace/oxd-server/target/test-classes
[INFO] 
[INFO] --- maven-surefire-plugin:2.12.4:test (default-test) @ oxd-server ---
[INFO] Surefire report directory: /home/jenkins/.jenkins/jobs/oxD_master/workspace/oxd-server/target/surefire-reports

-------------------------------------------------------
 T E S T S
-------------------------------------------------------
Running TestSuite
SLF4J: Class path contains multiple SLF4J bindings.
SLF4J: Found binding in [jar:file:/var/www/html/maven/ch/qos/logback/logback-classic/1.2.3/logback-classic-1.2.3.jar!/org/slf4j/impl/StaticLoggerBinder.class]
SLF4J: Found binding in [jar:file:/var/www/html/maven/org/slf4j/slf4j-simple/1.7.30/slf4j-simple-1.7.30.jar!/org/slf4j/impl/StaticLoggerBinder.class]
SLF4J: Found binding in [jar:file:/var/www/html/maven/org/apache/logging/log4j/log4j-slf4j-impl/2.13.3/log4j-slf4j-impl-2.13.3.jar!/org/slf4j/impl/StaticLoggerBinder.class]
SLF4J: See http://www.slf4j.org/codes.html#multiple_bindings for an explanation.
SLF4J: Actual binding is of type [ch.qos.logback.classic.util.ContextSelectorStaticBinder]
16:38:59.847 [main] DEBUG org.gluu.oxd.server.SetUpTest - Running beforeSuite ...
INFO  [2020-10-06 16:39:03,382] io.dropwizard.server.DefaultServerFactory: Registering jersey handler with root path prefix: /
INFO  [2020-10-06 16:39:03,385] io.dropwizard.server.DefaultServerFactory: Registering admin handler with root path prefix: /
INFO  [2020-10-06 16:39:03,388] org.gluu.oxd.server.ServerLauncher: Starting service configuration...
INFO  [2020-10-06 16:39:03,399] org.gluu.oxd.server.ServerLauncher: commit: df2550a3184a2d3ab4d7aea474d5247bf76e618b, branch: origin/master, build time:06.10.2020 @ 16:38:54 UTC
DEBUG [2020-10-06 16:39:03,454] org.gluu.oxd.server.ServerLauncher: BC registered: false
DEBUG [2020-10-06 16:39:03,642] org.gluu.oxd.server.ServerLauncher: Registered BC successfully.
INFO  [2020-10-06 16:39:03,658] org.gluu.oxd.server.ServerLauncher: Configuration: OxdServerConfiguration{, registerClientAppType='web', registerClientResponesType='code', useClientAuthenticationForPat=true, trustAllCerts=true, keyStorePath='', keyStorePassword='', cryptProviderKeyStorePath='./oxd-jwks.keystore', cryptProviderKeyStorePassword='example', cryptProviderDnName='CN=oxd CA Certificates', supportGoogleLogout=true, stateExpirationInMinutes=5, nonceExpirationInMinutes=5, dbCleanupIntervalInHours=1, rpCacheExpirationInMinutes=60, publicOpKeyCacheExpirationInMinutes=60, protectCommandsWithAccessToken=true, acceptIdTokenWithoutSignature=true, uma2AuthRegisterClaimsGatheringEndpointAsRedirectUriOfClient=true, migrationSourceFolderPath='', storage='h2', storageConfiguration={"dbFileLocation":"./oxd_db"}', defaultSiteConfig={"op_configuration_endpoint":"","response_types":["code"],"grant_type":["authorization_code"],"acr_values":[""],"scope":["openid","profile","email"],"ui_locales":["en"],"claims_locales":["en"],"contacts":[],"redirect_uris":[],"logout_redirect_uris":[],"client_name":"","client_jwks_uri":"","token_endpoint_auth_method":"","token_endpoint_auth_signing_alg":"","request_uris":[],"front_channel_logout_uris":[],"sector_identifier_uri":"","claims_redirect_uri":[],"client_id":"","client_secret":"","trusted_client":false,"access_token_as_jwt":false,"access_token_signing_alg":"","rpt_as_jwt":false,"logo_uri":"","client_uri":"","policy_uri":"","front_channel_logout_session_required":false,"tos_uri":"","jwks":"","id_token_binding_cnf":"","tls_client_auth_subject_dn":"","run_introspection_script_beforeaccess_token_as_jwt_creation_and_include_claims":false,"id_token_signed_response_alg":"","id_token_encrypted_response_alg":"","id_token_encrypted_response_enc":"","user_info_signed_response_alg":"","user_info_encrypted_response_alg":"","user_info_encrypted_response_enc":"","request_object_signing_alg":"","request_object_encryption_alg":"","request_object_encryption_enc":"","default_max_age":null,"require_auth_time":false,"initiate_login_uri":"","authorized_origins":[],"access_token_lifetime":null,"software_id":"","software_version":"","software_statement":"","custom_attributes":{}}', allowedOpHosts=[]', addClientCredentialsGrantTypeAutomaticallyDuringClientRegistration=true, proxyConfiguration=null', idTokenValidationCHashRequired=true', idTokenValidationAtHashRequired=true', validateUserInfoWithIdToken=true', protectCommandsWithOxdId=[]', persistenceManagerRemoveCount=1000', bindIpAddresses=null', enableJwksGeneration=true', jwksExpirationInHours=720', requestObjectExpirationInMinutes=5', jwksRegenerationIntervalInHours=720', tlsVersion=null', mtlsEnabled=false', mtlsClientKeyStorePath=null', mtlsClientKeyStorePassword=null', idTokenValidationSHashRequired=false', encodeStateFromRequestParameter=false', encodeNonceFromRequestParameter=false', fapiEnabled=false', iatExpirationInHours=1', encodeClientIdInAuthorizationUrl=false'}
DEBUG [2020-10-06 16:39:04,091] org.gluu.oxd.server.persistence.service.SqlPersistenceServiceImpl: Schema created successfully.
INFO  [2020-10-06 16:39:04,112] org.gluu.oxd.server.persistence.service.SqlPersistenceServiceImpl: Loaded 0 RPs.
DEBUG [2020-10-06 16:39:04,113] org.gluu.oxd.server.service.MigrationService: Migration source folder is not specified.
DEBUG [2020-10-06 16:39:04,113] org.gluu.oxd.server.service.MigrationService: Skip migration because migration source folder is not specified or otherwise invalid.
INFO  [2020-10-06 16:39:04,217] org.gluu.oxd.server.ServerLauncher: oxD Services are configured successfully.
INFO  [2020-10-06 16:39:04,240] io.dropwizard.server.ServerFactory: Starting OxdServerApplication
INFO  [2020-10-06 16:39:04,425] org.eclipse.jetty.setuid.SetUIDListener: Opened application@1b6924cb{HTTP/1.1, (http/1.1)}{0.0.0.0:40745}
INFO  [2020-10-06 16:39:04,426] org.eclipse.jetty.setuid.SetUIDListener: Opened admin@3a8d467e{HTTP/1.1, (http/1.1)}{0.0.0.0:8085}
INFO  [2020-10-06 16:39:04,429] org.eclipse.jetty.server.Server: jetty-9.4.30.v20200611; built: 2020-06-11T12:34:51.929Z; git: 271836e4c1f4612f12b7bb13ef5a92a927634b0d; jvm 1.8.0_222-b10
INFO  [2020-10-06 16:39:05,904] io.dropwizard.jersey.DropwizardResourceConfig: The following paths were found for the configured resources:

    POST    /authorization-code-flow (org.gluu.oxd.server.RestResource)
    POST    /check-access-token (org.gluu.oxd.server.RestResource)
    POST    /check-id-token (org.gluu.oxd.server.RestResource)
    POST    /get-access-token-by-refresh-token (org.gluu.oxd.server.RestResource)
    POST    /get-authorization-code (org.gluu.oxd.server.RestResource)
    POST    /get-authorization-url (org.gluu.oxd.server.RestResource)
    POST    /get-client-token (org.gluu.oxd.server.RestResource)
    POST    /get-discovery (org.gluu.oxd.server.RestResource)
    POST    /get-issuer (org.gluu.oxd.server.RestResource)
    POST    /get-jwks (org.gluu.oxd.server.RestResource)
    POST    /get-logout-uri (org.gluu.oxd.server.RestResource)
    POST    /get-request-object-uri (org.gluu.oxd.server.RestResource)
    GET     /get-request-object/{request_object_id} (org.gluu.oxd.server.RestResource)
    POST    /get-rp (org.gluu.oxd.server.RestResource)
    GET     /get-rp-jwks (org.gluu.oxd.server.RestResource)
    POST    /get-tokens-by-code (org.gluu.oxd.server.RestResource)
    POST    /get-user-info (org.gluu.oxd.server.RestResource)
    GET     /health-check (org.gluu.oxd.server.RestResource)
    POST    /introspect-access-token (org.gluu.oxd.server.RestResource)
    POST    /introspect-rpt (org.gluu.oxd.server.RestResource)
    POST    /register-site (org.gluu.oxd.server.RestResource)
    POST    /remove-site (org.gluu.oxd.server.RestResource)
    POST    /uma-rp-get-claims-gathering-url (org.gluu.oxd.server.RestResource)
    POST    /uma-rp-get-rpt (org.gluu.oxd.server.RestResource)
    POST    /uma-rs-check-access (org.gluu.oxd.server.RestResource)
    POST    /uma-rs-modify (org.gluu.oxd.server.RestResource)
    POST    /uma-rs-protect (org.gluu.oxd.server.RestResource)
    POST    /update-site (org.gluu.oxd.server.RestResource)

INFO  [2020-10-06 16:39:05,935] org.eclipse.jetty.server.handler.ContextHandler: Started i.d.j.MutableServletContextHandler@1e30db85{/,null,AVAILABLE}
INFO  [2020-10-06 16:39:05,954] io.dropwizard.setup.AdminEnvironment: tasks = 

    POST    /tasks/log-level (io.dropwizard.servlets.tasks.LogConfigurationTask)
    POST    /tasks/gc (io.dropwizard.servlets.tasks.GarbageCollectionTask)

INFO  [2020-10-06 16:39:05,969] org.eclipse.jetty.server.handler.ContextHandler: Started i.d.j.MutableServletContextHandler@29962b2f{/,null,AVAILABLE}
INFO  [2020-10-06 16:39:06,071] org.eclipse.jetty.server.AbstractConnector: Started application@1b6924cb{HTTP/1.1, (http/1.1)}{0.0.0.0:40745}
INFO  [2020-10-06 16:39:06,111] org.eclipse.jetty.server.AbstractConnector: Started admin@3a8d467e{HTTP/1.1, (http/1.1)}{0.0.0.0:8085}
INFO  [2020-10-06 16:39:06,111] org.eclipse.jetty.server.Server: Started @8308ms
DEBUG [2020-10-06 16:39:06,111] org.gluu.oxd.server.SetUpTest: HTTP server started.
DEBUG [2020-10-06 16:39:06,112] org.gluu.oxd.server.persistence.service.SqlPersistenceServiceImpl: Schema created successfully.
DEBUG [2020-10-06 16:39:06,115] org.gluu.oxd.server.persistence.service.SqlPersistenceServiceImpl: All RPs are removed successfully.
INFO  [2020-10-06 16:39:06,115] org.gluu.oxd.server.persistence.service.SqlPersistenceServiceImpl: Loaded 0 RPs.
DEBUG [2020-10-06 16:39:06,116] org.gluu.oxd.server.SetUpTest: Finished removeExistingRps successfullly.
DEBUG [2020-10-06 16:39:06,116] org.gluu.oxd.server.SetUpTest: Existing RPs are removed.
TRACE [2020-10-06 16:39:07,673] org.gluu.oxd.server.RestResource: Checking if caller ipAddress : 127.0.0.1 is allowed to make request to oxd.
TRACE [2020-10-06 16:39:07,673] org.gluu.oxd.server.RestResource: Command: {"clientRegistrationAccessToken":null,"clientRegistrationClientUri":null,"postLogoutRedirectUris":["https://client.example.com/cb/home1","https://client.example.com/cb/home2"],"clientFrontchannelLogoutUri":"","redirectUris":["https://client.example.com/cb/home1","https://client.example.com/cb/home2"],"acrValues":null,"grantTypes":["authorization_code","client_credentials"],"responseTypes":null,"clientName":null,"clientTokenEndpointAuthMethod":null,"clientTokenEndpointAuthSigningAlg":null,"claimsRedirectUri":null,"accessTokenSigningAlg":null,"rptAsJwt":false,"accessTokenAsJwt":false,"frontChannelLogoutSessionRequired":false,"runIntrospectionScriptBeforeAccessTokenAsJwtCreationAndIncludeClaims":false,"requireAuthTime":false,"logoUri":null,"clientUri":null,"policyUri":null,"tosUri":null,"idTokenBindingCnf":null,"tlsClientAuthSubjectDn":null,"subjectType":null,"idTokenSignedResponseAlg":null,"idTokenEncryptedResponseAlg":null,"idTokenEncryptedResponseEnc":null,"userInfoSignedResponseAlg":null,"userInfoEncryptedResponseAlg":null,"userInfoEncryptedResponseEnc":null,"requestObjectEncryptionAlg":null,"requestObjectSigningAlg":null,"opHost":"https://jenkins-ldap.gluu.org","opDiscoveryPath":null,"opConfigurationEndpoint":null,"requestObjectEncryptionEnc":null,"defaultMaxAge":null,"initiateLoginUri":null,"authorizedOrigins":null,"accessTokenLifetime":null,"softwareId":null,"softwareVersion":null,"customAttributes":null,"clientId":null,"softwareStatement":null,"clientJwksUri":null,"clientSecret":null,"claimsLocales":null,"uiLocales":null,"clientSectorIdentifierUri":null,"clientRequestUris":null,"op_host":"https://jenkins-ldap.gluu.org","op_discovery_path":null,"op_configuration_endpoint":null,"post_logout_redirect_uris":["https://client.example.com/cb/home1","https://client.example.com/cb/home2"],"redirect_uris":["https://client.example.com/cb/home1","https://client.example.com/cb/home2"],"response_types":null,"claims_redirect_uri":null,"client_id":null,"client_secret":null,"client_registration_access_token":null,"client_registration_client_uri":null,"client_name":null,"client_jwks_uri":null,"client_token_endpoint_auth_method":null,"client_token_endpoint_auth_signing_alg":null,"client_request_uris":null,"client_frontchannel_logout_uri":"","client_sector_identifier_uri":null,"scope":["openid","uma_protection","profile","oxd"],"ui_locales":null,"claims_locales":null,"acr_values":null,"grant_types":["authorization_code","client_credentials"],"contacts":null,"access_token_as_jwt":false,"access_token_signing_alg":null,"rpt_as_jwt":false,"logo_uri":null,"client_uri":null,"policy_uri":null,"front_channel_logout_session_required":false,"tos_uri":null,"jwks":null,"id_token_binding_cnf":null,"tls_client_auth_subject_dn":null,"subject_type":null,"run_introspection_script_beforeaccess_token_as_jwt_creation_and_include_claims":false,"id_token_signed_response_alg":null,"id_token_encrypted_response_alg":null,"id_token_encrypted_response_enc":null,"user_info_signed_response_alg":null,"user_info_encrypted_response_alg":null,"user_info_encrypted_response_enc":null,"request_object_signing_alg":null,"request_object_encryption_alg":null,"request_object_encryption_enc":null,"default_max_age":null,"require_auth_time":false,"initiate_login_uri":null,"authorized_origins":null,"access_token_lifetime":null,"software_id":null,"software_version":null,"software_statement":null,"custom_attributes":null,"sync_client_from_op":false,"sync_client_period_in_seconds":86400,"allow_spontaneous_scopes":false,"spontaneous_scopes":null}
INFO  [2020-10-06 16:39:07,766] org.gluu.oxd.server.op.RegisterSiteOperation: Either 'op_configuration_endpoint' or 'op_host' should be set. oxd will now check which of these parameter is available.
WARN  [2020-10-06 16:39:07,767] org.gluu.oxd.server.op.RegisterSiteOperation: 'op_configuration_endpoint' is not set for parameter: RegisterSiteParams{op_host='https://jenkins-ldap.gluu.org', op_discovery_path='null', op_configuration_endpoint='null', post_logout_redirect_uris='[https://client.example.com/cb/home1, https://client.example.com/cb/home2]', redirect_uris=[https://client.example.com/cb/home1, https://client.example.com/cb/home2], response_types=null, claims_redirect_uri=null, client_id='null', client_registration_access_token='null', client_registration_client_uri='null', client_name='null', client_jwks_uri='null', client_token_endpoint_auth_method='null', client_token_endpoint_auth_signing_alg='null', client_request_uris=null, client_frontchannel_logout_uri=, client_sector_identifier_uri='null', scope=[openid, uma_protection, profile, oxd], ui_locales=null, claims_locales=null, acr_values=null, grant_types=[authorization_code, client_credentials], contacts=null, access_token_as_jwt=false, access_token_signing_alg=null, rpt_as_jwt=false, logo_uri='null', client_uri='null', policy_uri='null', front_channel_logout_session_required='false', tos_uri='null', jwks='null', id_token_binding_cnf='null', tls_client_auth_subject_dn='null', subject_type='null', run_introspection_script_beforeaccess_token_as_jwt_creation_and_include_claims='false', id_token_signed_response_alg='null', id_token_encrypted_response_alg='null', id_token_encrypted_response_enc='null', user_info_signed_response_alg='null', user_info_encrypted_response_alg='null', user_info_encrypted_response_enc='null', request_object_signing_alg='null', request_object_encryption_alg='null', request_object_encryption_enc='null', default_max_age='null', require_auth_time='false', initiate_login_uri='null', authorized_origins='null', access_token_lifetime='null', software_id='null', software_version='null', software_statement='null', custom_attributes='null', syncClientFromOp='false', syncClientPeriodInSeconds='86400', allowSpontaneousScopes='false', spontaneousScopes='null'}. Look up at configuration file for fallback of 'op_configuration_endpoint'.
TRACE [2020-10-06 16:39:07,791] org.gluu.oxd.server.service.HttpService: Created TRUST_ALL client.
ERROR [2020-10-06 16:39:08,226] org.gluu.oxauth.client.OpenIdConfigurationClient: There is an error in the JSON response. Check if there is a syntax error in the JSON response or there is a wrong key
! org.json.JSONException: A JSONObject text must begin with '{' at 1 [character 2 line 1]
! at org.json.JSONTokener.syntaxError(JSONTokener.java:507)
! at org.json.JSONObject.<init>(JSONObject.java:222)
! at org.json.JSONObject.<init>(JSONObject.java:406)
! at org.gluu.oxauth.client.OpenIdConfigurationClient.parse(OpenIdConfigurationClient.java:112)
! at org.gluu.oxauth.client.OpenIdConfigurationClient._execOpenIdConfiguration(OpenIdConfigurationClient.java:88)
! at org.gluu.oxauth.client.OpenIdConfigurationClient.execOpenIdConfiguration(OpenIdConfigurationClient.java:52)
! at org.gluu.oxd.server.service.DiscoveryService.getConnectDiscoveryResponse(DiscoveryService.java:82)
! at org.gluu.oxd.server.service.DiscoveryService.getConnectDiscoveryResponse(DiscoveryService.java:68)
! at org.gluu.oxd.server.op.RegisterSiteOperation.validateParametersAndFallbackIfNeeded(RegisterSiteOperation.java:170)
! at org.gluu.oxd.server.op.RegisterSiteOperation.execute_(RegisterSiteOperation.java:59)
! at org.gluu.oxd.server.op.RegisterSiteOperation.execute(RegisterSiteOperation.java:84)
! at org.gluu.oxd.server.op.RegisterSiteOperation.execute(RegisterSiteOperation.java:43)
! at org.gluu.oxd.server.Processor.process(Processor.java:47)
! at org.gluu.oxd.server.RestResource.getObjectForJsonConversion(RestResource.java:337)
! at org.gluu.oxd.server.RestResource.process(RestResource.java:283)
! at org.gluu.oxd.server.RestResource.registerSite(RestResource.java:95)
! at sun.reflect.NativeMethodAccessorImpl.invoke0(Native Method)
! at sun.reflect.NativeMethodAccessorImpl.invoke(NativeMethodAccessorImpl.java:62)
! at sun.reflect.DelegatingMethodAccessorImpl.invoke(DelegatingMethodAccessorImpl.java:43)
! at java.lang.reflect.Method.invoke(Method.java:498)
! at org.glassfish.jersey.server.model.internal.ResourceMethodInvocationHandlerFactory.lambda$static$0(ResourceMethodInvocationHandlerFactory.java:52)
! at org.glassfish.jersey.server.model.internal.AbstractJavaResourceMethodDispatcher$1.run(AbstractJavaResourceMethodDispatcher.java:124)
! at org.glassfish.jersey.server.model.internal.AbstractJavaResourceMethodDispatcher.invoke(AbstractJavaResourceMethodDispatcher.java:167)
! at org.glassfish.jersey.server.model.internal.JavaResourceMethodDispatcherProvider$TypeOutInvoker.doDispatch(JavaResourceMethodDispatcherProvider.java:219)
! at org.glassfish.jersey.server.model.internal.AbstractJavaResourceMethodDispatcher.dispatch(AbstractJavaResourceMethodDispatcher.java:79)
! at org.glassfish.jersey.server.model.ResourceMethodInvoker.invoke(ResourceMethodInvoker.java:469)
! at org.glassfish.jersey.server.model.ResourceMethodInvoker.apply(ResourceMethodInvoker.java:391)
! at org.glassfish.jersey.server.model.ResourceMethodInvoker.apply(ResourceMethodInvoker.java:80)
! at org.glassfish.jersey.server.ServerRuntime$1.run(ServerRuntime.java:253)
! at org.glassfish.jersey.internal.Errors$1.call(Errors.java:248)
! at org.glassfish.jersey.internal.Errors$1.call(Errors.java:244)
! at org.glassfish.jersey.internal.Errors.process(Errors.java:292)
! at org.glassfish.jersey.internal.Errors.process(Errors.java:274)
! at org.glassfish.jersey.internal.Errors.process(Errors.java:244)
! at org.glassfish.jersey.process.internal.RequestScope.runInScope(RequestScope.java:265)
! at org.glassfish.jersey.server.ServerRuntime.process(ServerRuntime.java:232)
! at org.glassfish.jersey.server.ApplicationHandler.handle(ApplicationHandler.java:680)
! at org.glassfish.jersey.servlet.WebComponent.serviceImpl(WebComponent.java:394)
! at org.glassfish.jersey.servlet.WebComponent.service(WebComponent.java:346)
! at org.glassfish.jersey.servlet.ServletContainer.service(ServletContainer.java:366)
! at org.glassfish.jersey.servlet.ServletContainer.service(ServletContainer.java:319)
! at org.glassfish.jersey.servlet.ServletContainer.service(ServletContainer.java:205)
! at io.dropwizard.jetty.NonblockingServletHolder.handle(NonblockingServletHolder.java:50)
! at org.eclipse.jetty.servlet.ServletHandler$CachedChain.doFilter(ServletHandler.java:1631)
! at io.dropwizard.servlets.ThreadNameFilter.doFilter(ThreadNameFilter.java:35)
! at org.eclipse.jetty.servlet.ServletHandler$CachedChain.doFilter(ServletHandler.java:1618)
! at io.dropwizard.jersey.filter.AllowedMethodsFilter.handle(AllowedMethodsFilter.java:47)
! at io.dropwizard.jersey.filter.AllowedMethodsFilter.doFilter(AllowedMethodsFilter.java:41)
! at org.eclipse.jetty.servlet.ServletHandler$CachedChain.doFilter(ServletHandler.java:1618)
! at org.eclipse.jetty.servlet.ServletHandler.doHandle(ServletHandler.java:549)
! at org.eclipse.jetty.server.handler.ScopedHandler.nextHandle(ScopedHandler.java:233)
! at org.eclipse.jetty.server.handler.ContextHandler.doHandle(ContextHandler.java:1369)
! at org.eclipse.jetty.server.handler.ScopedHandler.nextScope(ScopedHandler.java:188)
! at org.eclipse.jetty.servlet.ServletHandler.doScope(ServletHandler.java:489)
! at org.eclipse.jetty.server.handler.ScopedHandler.nextScope(ScopedHandler.java:186)
! at org.eclipse.jetty.server.handler.ContextHandler.doScope(ContextHandler.java:1284)
! at org.eclipse.jetty.server.handler.ScopedHandler.handle(ScopedHandler.java:141)
! at org.eclipse.jetty.server.handler.HandlerWrapper.handle(HandlerWrapper.java:127)
! at com.codahale.metrics.jetty9.InstrumentedHandler.handle(InstrumentedHandler.java:249)
! at io.dropwizard.jetty.RoutingHandler.handle(RoutingHandler.java:52)
! at org.eclipse.jetty.server.handler.gzip.GzipHandler.handle(GzipHandler.java:717)
! at org.eclipse.jetty.server.handler.RequestLogHandler.handle(RequestLogHandler.java:54)
! at org.eclipse.jetty.server.handler.StatisticsHandler.handle(StatisticsHandler.java:173)
! at org.eclipse.jetty.server.handler.HandlerWrapper.handle(HandlerWrapper.java:127)
! at org.eclipse.jetty.server.Server.handle(Server.java:501)
! at org.eclipse.jetty.server.HttpChannel.lambda$handle$1(HttpChannel.java:383)
! at org.eclipse.jetty.server.HttpChannel.dispatch(HttpChannel.java:556)
! at org.eclipse.jetty.server.HttpChannel.handle(HttpChannel.java:375)
! at org.eclipse.jetty.server.HttpConnection.onFillable(HttpConnection.java:272)
! at org.eclipse.jetty.io.AbstractConnection$ReadCallback.succeeded(AbstractConnection.java:311)
! at org.eclipse.jetty.io.FillInterest.fillable(FillInterest.java:103)
! at org.eclipse.jetty.io.ChannelEndPoint$1.run(ChannelEndPoint.java:104)
! at org.eclipse.jetty.util.thread.QueuedThreadPool.runJob(QueuedThreadPool.java:806)
! at org.eclipse.jetty.util.thread.QueuedThreadPool$Runner.run(QueuedThreadPool.java:938)
! at java.lang.Thread.run(Thread.java:748)
ERROR [2020-10-06 16:39:08,227] org.gluu.oxauth.client.OpenIdConfigurationClient: Invalid JSON: <!DOCTYPE HTML PUBLIC "-//IETF//DTD HTML 2.0//EN">
<html><head>
<title>503 Service Unavailable</title>
</head><body>
<h1>Service Unavailable</h1>
<p>The server is temporarily unable to service your
request due to maintenance downtime or capacity
problems. Please try again later.</p>
<hr>
<address>Apache/2.4.29 (Ubuntu) Server at jenkins-ldap.gluu.org Port 443</address>
</body></html>

TRACE [2020-10-06 16:39:08,227] org.gluu.oxd.server.service.DiscoveryService: Discovery response: <!DOCTYPE HTML PUBLIC "-//IETF//DTD HTML 2.0//EN">
<html><head>
<title>503 Service Unavailable</title>
</head><body>
<h1>Service Unavailable</h1>
<p>The server is temporarily unable to service your
request due to maintenance downtime or capacity
problems. Please try again later.</p>
<hr>
<address>Apache/2.4.29 (Ubuntu) Server at jenkins-ldap.gluu.org Port 443</address>
</body></html>
 
ERROR [2020-10-06 16:39:08,227] org.gluu.oxd.server.op.RegisterSiteOperation: null
! java.lang.NullPointerException: null
! at java.lang.String.contains(String.java:2133)
! at org.gluu.oxd.server.op.RegisterSiteOperation.validateParametersAndFallbackIfNeeded(RegisterSiteOperation.java:170)
! at org.gluu.oxd.server.op.RegisterSiteOperation.execute_(RegisterSiteOperation.java:59)
! at org.gluu.oxd.server.op.RegisterSiteOperation.execute(RegisterSiteOperation.java:84)
! at org.gluu.oxd.server.op.RegisterSiteOperation.execute(RegisterSiteOperation.java:43)
! at org.gluu.oxd.server.Processor.process(Processor.java:47)
! at org.gluu.oxd.server.RestResource.getObjectForJsonConversion(RestResource.java:337)
! at org.gluu.oxd.server.RestResource.process(RestResource.java:283)
! at org.gluu.oxd.server.RestResource.registerSite(RestResource.java:95)
! at sun.reflect.NativeMethodAccessorImpl.invoke0(Native Method)
! at sun.reflect.NativeMethodAccessorImpl.invoke(NativeMethodAccessorImpl.java:62)
! at sun.reflect.DelegatingMethodAccessorImpl.invoke(DelegatingMethodAccessorImpl.java:43)
! at java.lang.reflect.Method.invoke(Method.java:498)
! at org.glassfish.jersey.server.model.internal.ResourceMethodInvocationHandlerFactory.lambda$static$0(ResourceMethodInvocationHandlerFactory.java:52)
! at org.glassfish.jersey.server.model.internal.AbstractJavaResourceMethodDispatcher$1.run(AbstractJavaResourceMethodDispatcher.java:124)
! at org.glassfish.jersey.server.model.internal.AbstractJavaResourceMethodDispatcher.invoke(AbstractJavaResourceMethodDispatcher.java:167)
! at org.glassfish.jersey.server.model.internal.JavaResourceMethodDispatcherProvider$TypeOutInvoker.doDispatch(JavaResourceMethodDispatcherProvider.java:219)
! at org.glassfish.jersey.server.model.internal.AbstractJavaResourceMethodDispatcher.dispatch(AbstractJavaResourceMethodDispatcher.java:79)
! at org.glassfish.jersey.server.model.ResourceMethodInvoker.invoke(ResourceMethodInvoker.java:469)
! at org.glassfish.jersey.server.model.ResourceMethodInvoker.apply(ResourceMethodInvoker.java:391)
! at org.glassfish.jersey.server.model.ResourceMethodInvoker.apply(ResourceMethodInvoker.java:80)
! at org.glassfish.jersey.server.ServerRuntime$1.run(ServerRuntime.java:253)
! at org.glassfish.jersey.internal.Errors$1.call(Errors.java:248)
! at org.glassfish.jersey.internal.Errors$1.call(Errors.java:244)
! at org.glassfish.jersey.internal.Errors.process(Errors.java:292)
! at org.glassfish.jersey.internal.Errors.process(Errors.java:274)
! at org.glassfish.jersey.internal.Errors.process(Errors.java:244)
! at org.glassfish.jersey.process.internal.RequestScope.runInScope(RequestScope.java:265)
! at org.glassfish.jersey.server.ServerRuntime.process(ServerRuntime.java:232)
! at org.glassfish.jersey.server.ApplicationHandler.handle(ApplicationHandler.java:680)
! at org.glassfish.jersey.servlet.WebComponent.serviceImpl(WebComponent.java:394)
! at org.glassfish.jersey.servlet.WebComponent.service(WebComponent.java:346)
! at org.glassfish.jersey.servlet.ServletContainer.service(ServletContainer.java:366)
! at org.glassfish.jersey.servlet.ServletContainer.service(ServletContainer.java:319)
! at org.glassfish.jersey.servlet.ServletContainer.service(ServletContainer.java:205)
! at io.dropwizard.jetty.NonblockingServletHolder.handle(NonblockingServletHolder.java:50)
! at org.eclipse.jetty.servlet.ServletHandler$CachedChain.doFilter(ServletHandler.java:1631)
! at io.dropwizard.servlets.ThreadNameFilter.doFilter(ThreadNameFilter.java:35)
! at org.eclipse.jetty.servlet.ServletHandler$CachedChain.doFilter(ServletHandler.java:1618)
! at io.dropwizard.jersey.filter.AllowedMethodsFilter.handle(AllowedMethodsFilter.java:47)
! at io.dropwizard.jersey.filter.AllowedMethodsFilter.doFilter(AllowedMethodsFilter.java:41)
! at org.eclipse.jetty.servlet.ServletHandler$CachedChain.doFilter(ServletHandler.java:1618)
! at org.eclipse.jetty.servlet.ServletHandler.doHandle(ServletHandler.java:549)
! at org.eclipse.jetty.server.handler.ScopedHandler.nextHandle(ScopedHandler.java:233)
! at org.eclipse.jetty.server.handler.ContextHandler.doHandle(ContextHandler.java:1369)
! at org.eclipse.jetty.server.handler.ScopedHandler.nextScope(ScopedHandler.java:188)
! at org.eclipse.jetty.servlet.ServletHandler.doScope(ServletHandler.java:489)
! at org.eclipse.jetty.server.handler.ScopedHandler.nextScope(ScopedHandler.java:186)
! at org.eclipse.jetty.server.handler.ContextHandler.doScope(ContextHandler.java:1284)
! at org.eclipse.jetty.server.handler.ScopedHandler.handle(ScopedHandler.java:141)
! at org.eclipse.jetty.server.handler.HandlerWrapper.handle(HandlerWrapper.java:127)
! at com.codahale.metrics.jetty9.InstrumentedHandler.handle(InstrumentedHandler.java:249)
! at io.dropwizard.jetty.RoutingHandler.handle(RoutingHandler.java:52)
! at org.eclipse.jetty.server.handler.gzip.GzipHandler.handle(GzipHandler.java:717)
! at org.eclipse.jetty.server.handler.RequestLogHandler.handle(RequestLogHandler.java:54)
! at org.eclipse.jetty.server.handler.StatisticsHandler.handle(StatisticsHandler.java:173)
! at org.eclipse.jetty.server.handler.HandlerWrapper.handle(HandlerWrapper.java:127)
! at org.eclipse.jetty.server.Server.handle(Server.java:501)
! at org.eclipse.jetty.server.HttpChannel.lambda$handle$1(HttpChannel.java:383)
! at org.eclipse.jetty.server.HttpChannel.dispatch(HttpChannel.java:556)
! at org.eclipse.jetty.server.HttpChannel.handle(HttpChannel.java:375)
! at org.eclipse.jetty.server.HttpConnection.onFillable(HttpConnection.java:272)
! at org.eclipse.jetty.io.AbstractConnection$ReadCallback.succeeded(AbstractConnection.java:311)
! at org.eclipse.jetty.io.FillInterest.fillable(FillInterest.java:103)
! at org.eclipse.jetty.io.ChannelEndPoint$1.run(ChannelEndPoint.java:104)
! at org.eclipse.jetty.util.thread.QueuedThreadPool.runJob(QueuedThreadPool.java:806)
! at org.eclipse.jetty.util.thread.QueuedThreadPool$Runner.run(QueuedThreadPool.java:938)
! at java.lang.Thread.run(Thread.java:748)
ERROR [2020-10-06 16:39:08,263] org.gluu.oxd.server.Processor: HTTP 500 Internal Server Error
! org.gluu.oxd.server.HttpException: HTTP 500 Internal Server Error
! at org.gluu.oxd.server.HttpException.internalError(HttpException.java:30)
! at org.gluu.oxd.server.op.RegisterSiteOperation.execute(RegisterSiteOperation.java:90)
! at org.gluu.oxd.server.op.RegisterSiteOperation.execute(RegisterSiteOperation.java:43)
! at org.gluu.oxd.server.Processor.process(Processor.java:47)
! at org.gluu.oxd.server.RestResource.getObjectForJsonConversion(RestResource.java:337)
! at org.gluu.oxd.server.RestResource.process(RestResource.java:283)
! at org.gluu.oxd.server.RestResource.registerSite(RestResource.java:95)
! at sun.reflect.NativeMethodAccessorImpl.invoke0(Native Method)
! at sun.reflect.NativeMethodAccessorImpl.invoke(NativeMethodAccessorImpl.java:62)
! at sun.reflect.DelegatingMethodAccessorImpl.invoke(DelegatingMethodAccessorImpl.java:43)
! at java.lang.reflect.Method.invoke(Method.java:498)
! at org.glassfish.jersey.server.model.internal.ResourceMethodInvocationHandlerFactory.lambda$static$0(ResourceMethodInvocationHandlerFactory.java:52)
! at org.glassfish.jersey.server.model.internal.AbstractJavaResourceMethodDispatcher$1.run(AbstractJavaResourceMethodDispatcher.java:124)
! at org.glassfish.jersey.server.model.internal.AbstractJavaResourceMethodDispatcher.invoke(AbstractJavaResourceMethodDispatcher.java:167)
! at org.glassfish.jersey.server.model.internal.JavaResourceMethodDispatcherProvider$TypeOutInvoker.doDispatch(JavaResourceMethodDispatcherProvider.java:219)
! at org.glassfish.jersey.server.model.internal.AbstractJavaResourceMethodDispatcher.dispatch(AbstractJavaResourceMethodDispatcher.java:79)
! at org.glassfish.jersey.server.model.ResourceMethodInvoker.invoke(ResourceMethodInvoker.java:469)
! at org.glassfish.jersey.server.model.ResourceMethodInvoker.apply(ResourceMethodInvoker.java:391)
! at org.glassfish.jersey.server.model.ResourceMethodInvoker.apply(ResourceMethodInvoker.java:80)
! at org.glassfish.jersey.server.ServerRuntime$1.run(ServerRuntime.java:253)
! at org.glassfish.jersey.internal.Errors$1.call(Errors.java:248)
! at org.glassfish.jersey.internal.Errors$1.call(Errors.java:244)
! at org.glassfish.jersey.internal.Errors.process(Errors.java:292)
! at org.glassfish.jersey.internal.Errors.process(Errors.java:274)
! at org.glassfish.jersey.internal.Errors.process(Errors.java:244)
! at org.glassfish.jersey.process.internal.RequestScope.runInScope(RequestScope.java:265)
! at org.glassfish.jersey.server.ServerRuntime.process(ServerRuntime.java:232)
! at org.glassfish.jersey.server.ApplicationHandler.handle(ApplicationHandler.java:680)
! at org.glassfish.jersey.servlet.WebComponent.serviceImpl(WebComponent.java:394)
! at org.glassfish.jersey.servlet.WebComponent.service(WebComponent.java:346)
! at org.glassfish.jersey.servlet.ServletContainer.service(ServletContainer.java:366)
! at org.glassfish.jersey.servlet.ServletContainer.service(ServletContainer.java:319)
! at org.glassfish.jersey.servlet.ServletContainer.service(ServletContainer.java:205)
! at io.dropwizard.jetty.NonblockingServletHolder.handle(NonblockingServletHolder.java:50)
! at org.eclipse.jetty.servlet.ServletHandler$CachedChain.doFilter(ServletHandler.java:1631)
! at io.dropwizard.servlets.ThreadNameFilter.doFilter(ThreadNameFilter.java:35)
! at org.eclipse.jetty.servlet.ServletHandler$CachedChain.doFilter(ServletHandler.java:1618)
! at io.dropwizard.jersey.filter.AllowedMethodsFilter.handle(AllowedMethodsFilter.java:47)
! at io.dropwizard.jersey.filter.AllowedMethodsFilter.doFilter(AllowedMethodsFilter.java:41)
! at org.eclipse.jetty.servlet.ServletHandler$CachedChain.doFilter(ServletHandler.java:1618)
! at org.eclipse.jetty.servlet.ServletHandler.doHandle(ServletHandler.java:549)
! at org.eclipse.jetty.server.handler.ScopedHandler.nextHandle(ScopedHandler.java:233)
! at org.eclipse.jetty.server.handler.ContextHandler.doHandle(ContextHandler.java:1369)
! at org.eclipse.jetty.server.handler.ScopedHandler.nextScope(ScopedHandler.java:188)
! at org.eclipse.jetty.servlet.ServletHandler.doScope(ServletHandler.java:489)
! at org.eclipse.jetty.server.handler.ScopedHandler.nextScope(ScopedHandler.java:186)
! at org.eclipse.jetty.server.handler.ContextHandler.doScope(ContextHandler.java:1284)
! at org.eclipse.jetty.server.handler.ScopedHandler.handle(ScopedHandler.java:141)
! at org.eclipse.jetty.server.handler.HandlerWrapper.handle(HandlerWrapper.java:127)
! at com.codahale.metrics.jetty9.InstrumentedHandler.handle(InstrumentedHandler.java:249)
! at io.dropwizard.jetty.RoutingHandler.handle(RoutingHandler.java:52)
! at org.eclipse.jetty.server.handler.gzip.GzipHandler.handle(GzipHandler.java:717)
! at org.eclipse.jetty.server.handler.RequestLogHandler.handle(RequestLogHandler.java:54)
! at org.eclipse.jetty.server.handler.StatisticsHandler.handle(StatisticsHandler.java:173)
! at org.eclipse.jetty.server.handler.HandlerWrapper.handle(HandlerWrapper.java:127)
! at org.eclipse.jetty.server.Server.handle(Server.java:501)
! at org.eclipse.jetty.server.HttpChannel.lambda$handle$1(HttpChannel.java:383)
! at org.eclipse.jetty.server.HttpChannel.dispatch(HttpChannel.java:556)
! at org.eclipse.jetty.server.HttpChannel.handle(HttpChannel.java:375)
! at org.eclipse.jetty.server.HttpConnection.onFillable(HttpConnection.java:272)
! at org.eclipse.jetty.io.AbstractConnection$ReadCallback.succeeded(AbstractConnection.java:311)
! at org.eclipse.jetty.io.FillInterest.fillable(FillInterest.java:103)
! at org.eclipse.jetty.io.ChannelEndPoint$1.run(ChannelEndPoint.java:104)
! at org.eclipse.jetty.util.thread.QueuedThreadPool.runJob(QueuedThreadPool.java:806)
! at org.eclipse.jetty.util.thread.QueuedThreadPool$Runner.run(QueuedThreadPool.java:938)
! at java.lang.Thread.run(Thread.java:748)
ERROR [2020-10-06 16:39:08,296] org.gluu.oxd.server.SetUpTest: Failed to start suite.
! javax.ws.rs.InternalServerErrorException: HTTP 500 Internal Server Error
! at org.jboss.resteasy.client.jaxrs.internal.ClientInvocation.handleErrorStatus(ClientInvocation.java:234)
! at org.jboss.resteasy.client.jaxrs.internal.ClientInvocation.extractResult(ClientInvocation.java:196)
! at org.jboss.resteasy.client.jaxrs.internal.ClientInvocation.invoke(ClientInvocation.java:473)
! at org.jboss.resteasy.client.jaxrs.internal.ClientInvocationBuilder.method(ClientInvocationBuilder.java:335)
! at org.glassfish.jersey.client.proxy.WebResourceFactory.invoke(WebResourceFactory.java:316)
! at com.sun.proxy.$Proxy72.registerSite(Unknown Source)
! at org.gluu.oxd.server.SetupClientTest.setupClient(SetupClientTest.java:68)
! at org.gluu.oxd.server.SetupClientTest.setupClient(SetupClientTest.java:53)
! at org.gluu.oxd.server.SetUpTest.beforeSuite(SetUpTest.java:47)
! at sun.reflect.NativeMethodAccessorImpl.invoke0(Native Method)
! at sun.reflect.NativeMethodAccessorImpl.invoke(NativeMethodAccessorImpl.java:62)
! at sun.reflect.DelegatingMethodAccessorImpl.invoke(DelegatingMethodAccessorImpl.java:43)
! at java.lang.reflect.Method.invoke(Method.java:498)
! at org.testng.internal.MethodInvocationHelper.invokeMethod(MethodInvocationHelper.java:124)
! at org.testng.internal.MethodInvocationHelper.invokeMethodConsideringTimeout(MethodInvocationHelper.java:59)
! at org.testng.internal.Invoker.invokeConfigurationMethod(Invoker.java:458)
! at org.testng.internal.Invoker.invokeConfigurations(Invoker.java:222)
! at org.testng.internal.Invoker.invokeConfigurations(Invoker.java:142)
! at org.testng.SuiteRunner.privateRun(SuiteRunner.java:401)
! at org.testng.SuiteRunner.run(SuiteRunner.java:364)
! at org.testng.SuiteRunnerWorker.runSuite(SuiteRunnerWorker.java:52)
! at org.testng.SuiteRunnerWorker.run(SuiteRunnerWorker.java:84)
! at org.testng.TestNG.runSuitesSequentially(TestNG.java:1208)
! at org.testng.TestNG.runSuitesLocally(TestNG.java:1137)
! at org.testng.TestNG.runSuites(TestNG.java:1049)
! at org.testng.TestNG.run(TestNG.java:1017)
! at org.apache.maven.surefire.testng.TestNGExecutor.run(TestNGExecutor.java:178)
! at org.apache.maven.surefire.testng.TestNGXmlTestSuite.execute(TestNGXmlTestSuite.java:92)
! at org.apache.maven.surefire.testng.TestNGProvider.invoke(TestNGProvider.java:96)
! at sun.reflect.NativeMethodAccessorImpl.invoke0(Native Method)
! at sun.reflect.NativeMethodAccessorImpl.invoke(NativeMethodAccessorImpl.java:62)
! at sun.reflect.DelegatingMethodAccessorImpl.invoke(DelegatingMethodAccessorImpl.java:43)
! at java.lang.reflect.Method.invoke(Method.java:498)
! at org.apache.maven.surefire.util.ReflectionUtils.invokeMethodWithArray(ReflectionUtils.java:189)
! at org.apache.maven.surefire.booter.ProviderFactory$ProviderProxy.invoke(ProviderFactory.java:165)
! at org.apache.maven.surefire.booter.ProviderFactory.invokeProvider(ProviderFactory.java:85)
! at org.apache.maven.surefire.booter.ForkedBooter.runSuitesInProcess(ForkedBooter.java:115)
! at org.apache.maven.surefire.booter.ForkedBooter.main(ForkedBooter.java:75)
127.0.0.1 - - [06/Oct/2020:16:39:08 +0000] "POST /register-site HTTP/1.1" 500 115 "-" "Apache-HttpClient/4.5.3 (Java/1.8.0_222)" 800
Tests run: 155, Failures: 3, Errors: 0, Skipped: 152, Time elapsed: 10.951 sec <<< FAILURE!
beforeSuite(org.gluu.oxd.server.SetUpTest)  Time elapsed: 10.165 sec  <<< FAILURE!
java.lang.AssertionError: Failed to start suite.
	at org.gluu.oxd.server.SetUpTest.beforeSuite(SetUpTest.java:58)
	at sun.reflect.NativeMethodAccessorImpl.invoke0(Native Method)
	at sun.reflect.NativeMethodAccessorImpl.invoke(NativeMethodAccessorImpl.java:62)
	at sun.reflect.DelegatingMethodAccessorImpl.invoke(DelegatingMethodAccessorImpl.java:43)
	at java.lang.reflect.Method.invoke(Method.java:498)
	at org.testng.internal.MethodInvocationHelper.invokeMethod(MethodInvocationHelper.java:124)
	at org.testng.internal.MethodInvocationHelper.invokeMethodConsideringTimeout(MethodInvocationHelper.java:59)
	at org.testng.internal.Invoker.invokeConfigurationMethod(Invoker.java:458)
	at org.testng.internal.Invoker.invokeConfigurations(Invoker.java:222)
	at org.testng.internal.Invoker.invokeConfigurations(Invoker.java:142)
	at org.testng.SuiteRunner.privateRun(SuiteRunner.java:401)
	at org.testng.SuiteRunner.run(SuiteRunner.java:364)
	at org.testng.SuiteRunnerWorker.runSuite(SuiteRunnerWorker.java:52)
	at org.testng.SuiteRunnerWorker.run(SuiteRunnerWorker.java:84)
	at org.testng.TestNG.runSuitesSequentially(TestNG.java:1208)
	at org.testng.TestNG.runSuitesLocally(TestNG.java:1137)
	at org.testng.TestNG.runSuites(TestNG.java:1049)
	at org.testng.TestNG.run(TestNG.java:1017)
	at org.apache.maven.surefire.testng.TestNGExecutor.run(TestNGExecutor.java:178)
	at org.apache.maven.surefire.testng.TestNGXmlTestSuite.execute(TestNGXmlTestSuite.java:92)
	at org.apache.maven.surefire.testng.TestNGProvider.invoke(TestNGProvider.java:96)
	at sun.reflect.NativeMethodAccessorImpl.invoke0(Native Method)
	at sun.reflect.NativeMethodAccessorImpl.invoke(NativeMethodAccessorImpl.java:62)
	at sun.reflect.DelegatingMethodAccessorImpl.invoke(DelegatingMethodAccessorImpl.java:43)
	at java.lang.reflect.Method.invoke(Method.java:498)
	at org.apache.maven.surefire.util.ReflectionUtils.invokeMethodWithArray(ReflectionUtils.java:189)
	at org.apache.maven.surefire.booter.ProviderFactory$ProviderProxy.invoke(ProviderFactory.java:165)
	at org.apache.maven.surefire.booter.ProviderFactory.invokeProvider(ProviderFactory.java:85)
	at org.apache.maven.surefire.booter.ForkedBooter.runSuitesInProcess(ForkedBooter.java:115)
	at org.apache.maven.surefire.booter.ForkedBooter.main(ForkedBooter.java:75)

testWithInvalidAuthorization(io.swagger.client.api.IntrospectAccessTokenTest)  Time elapsed: 10.467 sec  <<< FAILURE!
org.testng.SkipException: Skipping the test as protection access token is not enabled. Ignore the exception.
	at io.swagger.client.api.TestMethodListener.beforeInvocation(TestMethodListener.java:26)
	at org.testng.internal.invokers.InvokedMethodListenerInvoker$InvokeBeforeInvocationWithoutContextStrategy.callMethod(InvokedMethodListenerInvoker.java:84)
	at org.testng.internal.invokers.InvokedMethodListenerInvoker.invokeListener(InvokedMethodListenerInvoker.java:62)
	at org.testng.internal.Invoker.runInvokedMethodListeners(Invoker.java:493)
	at org.testng.internal.Invoker.invokeMethod(Invoker.java:533)
	at org.testng.internal.Invoker.invokeTestMethod(Invoker.java:719)
	at org.testng.internal.Invoker.invokeTestMethods(Invoker.java:989)
	at org.testng.internal.TestMethodWorker.invokeTestMethods(TestMethodWorker.java:125)
	at org.testng.internal.TestMethodWorker.run(TestMethodWorker.java:109)
	at org.testng.TestRunner.privateRun(TestRunner.java:648)
	at org.testng.TestRunner.run(TestRunner.java:505)
	at org.testng.SuiteRunner.runTest(SuiteRunner.java:455)
	at org.testng.SuiteRunner.runSequentially(SuiteRunner.java:450)
	at org.testng.SuiteRunner.privateRun(SuiteRunner.java:415)
	at org.testng.SuiteRunner.run(SuiteRunner.java:364)
	at org.testng.SuiteRunnerWorker.runSuite(SuiteRunnerWorker.java:52)
	at org.testng.SuiteRunnerWorker.run(SuiteRunnerWorker.java:84)
	at org.testng.TestNG.runSuitesSequentially(TestNG.java:1208)
	at org.testng.TestNG.runSuitesLocally(TestNG.java:1137)
	at org.testng.TestNG.runSuites(TestNG.java:1049)
	at org.testng.TestNG.run(TestNG.java:1017)
	at org.apache.maven.surefire.testng.TestNGExecutor.run(TestNGExecutor.java:178)
	at org.apache.maven.surefire.testng.TestNGXmlTestSuite.execute(TestNGXmlTestSuite.java:92)
	at org.apache.maven.surefire.testng.TestNGProvider.invoke(TestNGProvider.java:96)
	at sun.reflect.NativeMethodAccessorImpl.invoke0(Native Method)
	at sun.reflect.NativeMethodAccessorImpl.invoke(NativeMethodAccessorImpl.java:62)
	at sun.reflect.DelegatingMethodAccessorImpl.invoke(DelegatingMethodAccessorImpl.java:43)
	at java.lang.reflect.Method.invoke(Method.java:498)
	at org.apache.maven.surefire.util.ReflectionUtils.invokeMethodWithArray(ReflectionUtils.java:189)
	at org.apache.maven.surefire.booter.ProviderFactory$ProviderProxy.invoke(ProviderFactory.java:165)
	at org.apache.maven.surefire.booter.ProviderFactory.invokeProvider(ProviderFactory.java:85)
	at org.apache.maven.surefire.booter.ForkedBooter.runSuitesInProcess(ForkedBooter.java:115)
	at org.apache.maven.surefire.booter.ForkedBooter.main(ForkedBooter.java:75)

testWithInvalidToken(io.swagger.client.api.IntrospectAccessTokenTest)  Time elapsed: 10.468 sec  <<< FAILURE!
org.testng.SkipException: Skipping the test as protection access token is not enabled. Ignore the exception.
	at io.swagger.client.api.TestMethodListener.beforeInvocation(TestMethodListener.java:26)
	at org.testng.internal.invokers.InvokedMethodListenerInvoker$InvokeBeforeInvocationWithoutContextStrategy.callMethod(InvokedMethodListenerInvoker.java:84)
	at org.testng.internal.invokers.InvokedMethodListenerInvoker.invokeListener(InvokedMethodListenerInvoker.java:62)
	at org.testng.internal.Invoker.runInvokedMethodListeners(Invoker.java:493)
	at org.testng.internal.Invoker.invokeMethod(Invoker.java:533)
	at org.testng.internal.Invoker.invokeTestMethod(Invoker.java:719)
	at org.testng.internal.Invoker.invokeTestMethods(Invoker.java:989)
	at org.testng.internal.TestMethodWorker.invokeTestMethods(TestMethodWorker.java:125)
	at org.testng.internal.TestMethodWorker.run(TestMethodWorker.java:109)
	at org.testng.TestRunner.privateRun(TestRunner.java:648)
	at org.testng.TestRunner.run(TestRunner.java:505)
	at org.testng.SuiteRunner.runTest(SuiteRunner.java:455)
	at org.testng.SuiteRunner.runSequentially(SuiteRunner.java:450)
	at org.testng.SuiteRunner.privateRun(SuiteRunner.java:415)
	at org.testng.SuiteRunner.run(SuiteRunner.java:364)
	at org.testng.SuiteRunnerWorker.runSuite(SuiteRunnerWorker.java:52)
	at org.testng.SuiteRunnerWorker.run(SuiteRunnerWorker.java:84)
	at org.testng.TestNG.runSuitesSequentially(TestNG.java:1208)
	at org.testng.TestNG.runSuitesLocally(TestNG.java:1137)
	at org.testng.TestNG.runSuites(TestNG.java:1049)
	at org.testng.TestNG.run(TestNG.java:1017)
	at org.apache.maven.surefire.testng.TestNGExecutor.run(TestNGExecutor.java:178)
	at org.apache.maven.surefire.testng.TestNGXmlTestSuite.execute(TestNGXmlTestSuite.java:92)
	at org.apache.maven.surefire.testng.TestNGProvider.invoke(TestNGProvider.java:96)
	at sun.reflect.NativeMethodAccessorImpl.invoke0(Native Method)
	at sun.reflect.NativeMethodAccessorImpl.invoke(NativeMethodAccessorImpl.java:62)
	at sun.reflect.DelegatingMethodAccessorImpl.invoke(DelegatingMethodAccessorImpl.java:43)
	at java.lang.reflect.Method.invoke(Method.java:498)
	at org.apache.maven.surefire.util.ReflectionUtils.invokeMethodWithArray(ReflectionUtils.java:189)
	at org.apache.maven.surefire.booter.ProviderFactory$ProviderProxy.invoke(ProviderFactory.java:165)
	at org.apache.maven.surefire.booter.ProviderFactory.invokeProvider(ProviderFactory.java:85)
	at org.apache.maven.surefire.booter.ForkedBooter.runSuitesInProcess(ForkedBooter.java:115)
	at org.apache.maven.surefire.booter.ForkedBooter.main(ForkedBooter.java:75)

INFO  [2020-10-06 16:39:09,125] org.eclipse.jetty.server.AbstractConnector: Stopped application@1b6924cb{HTTP/1.1, (http/1.1)}{0.0.0.0:0}
INFO  [2020-10-06 16:39:09,130] org.eclipse.jetty.server.AbstractConnector: Stopped admin@3a8d467e{HTTP/1.1, (http/1.1)}{0.0.0.0:8085}
INFO  [2020-10-06 16:39:09,134] org.eclipse.jetty.server.handler.ContextHandler: Stopped i.d.j.MutableServletContextHandler@29962b2f{/,null,UNAVAILABLE}
INFO  [2020-10-06 16:39:09,155] org.eclipse.jetty.server.handler.ContextHandler: Stopped i.d.j.MutableServletContextHandler@1e30db85{/,null,UNAVAILABLE}

Results :

Failed tests:   beforeSuite(org.gluu.oxd.server.SetUpTest): Failed to start suite.
  testWithInvalidAuthorization(io.swagger.client.api.IntrospectAccessTokenTest): Skipping the test as protection access token is not enabled. Ignore the exception.
  testWithInvalidToken(io.swagger.client.api.IntrospectAccessTokenTest): Skipping the test as protection access token is not enabled. Ignore the exception.

Tests run: 155, Failures: 3, Errors: 0, Skipped: 152

[INFO] ------------------------------------------------------------------------
[INFO] Reactor Summary:
[INFO] 
[INFO] oxD ................................................ SUCCESS [  0.282 s]
[INFO] oxD Common ......................................... SUCCESS [ 10.865 s]
[INFO] oxD Client ......................................... SUCCESS [  1.499 s]
[INFO] oxd-gen-client ..................................... SUCCESS [ 20.019 s]
[INFO] oxD Server ......................................... FAILURE [ 21.500 s]
[INFO] ------------------------------------------------------------------------
[INFO] BUILD FAILURE
[INFO] ------------------------------------------------------------------------
[INFO] Total time: 55.206 s
[INFO] Finished at: 2020-10-06T16:39:09+00:00
[INFO] Final Memory: 135M/1048M
[INFO] ------------------------------------------------------------------------
[ERROR] Failed to execute goal org.apache.maven.plugins:maven-surefire-plugin:2.12.4:test (default-test) on project oxd-server: There are test failures.
[ERROR] 
[ERROR] Please refer to /home/jenkins/.jenkins/jobs/oxD_master/workspace/oxd-server/target/surefire-reports for the individual test results.
[ERROR] -> [Help 1]
[ERROR] 
[ERROR] To see the full stack trace of the errors, re-run Maven with the -e switch.
[ERROR] Re-run Maven using the -X switch to enable full debug logging.
[ERROR] 
[ERROR] For more information about the errors and possible solutions, please read the following articles:
[ERROR] [Help 1] http://cwiki.apache.org/confluence/display/MAVEN/MojoFailureException
[ERROR] 
[ERROR] After correcting the problems, you can resume the build with the command
[ERROR]   mvn <goals> -rf :oxd-server
Build step 'Invoke top-level Maven targets' marked build as failure
[FINDBUGS] Skipping publisher since build result is FAILURE
TestNG Reports Processing: START
Looking for TestNG results report in workspace using pattern: **/testng-results.xml
Saving reports...
Processing '/home/jenkins/.jenkins/jobs/oxD_master/builds/311/testng/testng-results-1.xml'
Processing '/home/jenkins/.jenkins/jobs/oxD_master/builds/311/testng/testng-results.xml'
1.360544% of tests failed, which exceeded threshold of 0%. Marking build as UNSTABLE
TestNG Reports Processing: FINISH
Sending e-mails to: support@gluu.org arnab@gluu.org
Finished: FAILURE