FailedConsole Output

Started by an SCM change
Building on master in workspace /home/tomcat/.jenkins/jobs/oxD_3.1.5/workspace
 > git rev-parse --is-inside-work-tree # timeout=10
Fetching changes from the remote Git repository
 > git config remote.origin.url https://github.com/GluuFederation/oxD # timeout=10
Fetching upstream changes from https://github.com/GluuFederation/oxD
 > git --version # timeout=10
 > git fetch --tags --progress https://github.com/GluuFederation/oxD +refs/heads/*:refs/remotes/origin/*
 > git rev-parse refs/remotes/origin/version_3.1.5^{commit} # timeout=10
 > git rev-parse refs/remotes/origin/origin/version_3.1.5^{commit} # timeout=10
Checking out Revision 5cbce1132e72af85bf3efd1c937ae73da96d25ec (refs/remotes/origin/version_3.1.5)
 > git config core.sparsecheckout # timeout=10
 > git checkout -f 5cbce1132e72af85bf3efd1c937ae73da96d25ec
Commit message: "Final 3.1.5 code"
 > git rev-list --no-walk 47a841bd23ed25d630e3d72114db1a5a61171b06 # timeout=10
[workspace] $ /bin/bash /opt/tomcat/temp/jenkins5372624078275772107.sh
Cloning into 'oxHudsonProfiles'...
[workspace] $ /home/tomcat/.jenkins/tools/hudson.tasks.Maven_MavenInstallation/maven_3.3.9/bin/mvn -DVERSION_NAME=version_3.1.5 -DSERVER_PROFILE=ce-dev3 -DMAVEN_SKIP_TESTS=false -DOXD_CONF=/home/tomcat/.jenkins/jobs/oxD_3.1.4/workspace/oxd-server/src/test/resources/oxd-conf-test.json -Doxd.server.config=/home/tomcat/.jenkins/jobs/oxD_3.1.4/workspace/oxd-server/src/test/resources/oxd-conf-test.json -Dmaven.test.skip=false clean compile javadoc:aggregate-jar install
[INFO] Scanning for projects...
[WARNING] 
[WARNING] Some problems were encountered while building the effective model for org.xdi:oxd-common:jar:3.1.5.Final
[WARNING] 'repositories.repository.id' must not be 'local', this identifier is reserved for the local repository, using it for other repositories will corrupt your repository metadata. @ org.xdi:oxd:3.1.5.Final, /home/tomcat/.jenkins/jobs/oxD_3.1.5/workspace/pom.xml, line 64, column 17
[WARNING] 
[WARNING] Some problems were encountered while building the effective model for org.xdi:oxd-client:jar:3.1.5.Final
[WARNING] 'repositories.repository.id' must not be 'local', this identifier is reserved for the local repository, using it for other repositories will corrupt your repository metadata. @ org.xdi:oxd:3.1.5.Final, /home/tomcat/.jenkins/jobs/oxD_3.1.5/workspace/pom.xml, line 64, column 17
[WARNING] 
[WARNING] Some problems were encountered while building the effective model for org.xdi:oxd-server:jar:3.1.5.Final
[WARNING] 'repositories.repository.id' must not be 'local', this identifier is reserved for the local repository, using it for other repositories will corrupt your repository metadata. @ org.xdi:oxd:3.1.5.Final, /home/tomcat/.jenkins/jobs/oxD_3.1.5/workspace/pom.xml, line 64, column 17
[WARNING] 
[WARNING] Some problems were encountered while building the effective model for org.xdi:oxd-rp-client:jar:3.1.5.Final
[WARNING] 'repositories.repository.id' must not be 'local', this identifier is reserved for the local repository, using it for other repositories will corrupt your repository metadata. @ org.xdi:oxd:3.1.5.Final, /home/tomcat/.jenkins/jobs/oxD_3.1.5/workspace/pom.xml, line 64, column 17
[WARNING] 
[WARNING] Some problems were encountered while building the effective model for org.xdi:oxd-https-extension:jar:3.1.5.Final
[WARNING] 'repositories.repository.id' must not be 'local', this identifier is reserved for the local repository, using it for other repositories will corrupt your repository metadata. @ org.xdi:oxd:3.1.5.Final, /home/tomcat/.jenkins/jobs/oxD_3.1.5/workspace/pom.xml, line 64, column 17
[WARNING] 
[WARNING] Some problems were encountered while building the effective model for org.xdi:oxd:pom:3.1.5.Final
[WARNING] 'repositories.repository.id' must not be 'local', this identifier is reserved for the local repository, using it for other repositories will corrupt your repository metadata. @ line 64, column 17
[WARNING] 
[WARNING] It is highly recommended to fix these problems because they threaten the stability of your build.
[WARNING] 
[WARNING] For this reason, future Maven versions might no longer support building such malformed projects.
[WARNING] 
[INFO] ------------------------------------------------------------------------
[INFO] Reactor Build Order:
[INFO] 
[INFO] oxD
[INFO] oxD Common
[INFO] oxD Client
[INFO] oxD Server
[INFO] oxD RP Client
[INFO] oxd-https-extension
[WARNING] The POM for org.codehaus.mojo:gwt-maven-plugin:jar:${gwt.version} is missing, no dependency information available
[WARNING] Failed to retrieve plugin descriptor for org.codehaus.mojo:gwt-maven-plugin:${gwt.version}: Plugin org.codehaus.mojo:gwt-maven-plugin:${gwt.version} or one of its dependencies could not be resolved: Failure to find org.codehaus.mojo:gwt-maven-plugin:jar:${gwt.version} in https://repo.maven.apache.org/maven2 was cached in the local repository, resolution will not be reattempted until the update interval of central has elapsed or updates are forced
[INFO]                                                                         
[INFO] ------------------------------------------------------------------------
[INFO] Building oxD 3.1.5.Final
[INFO] ------------------------------------------------------------------------
[INFO] 
[INFO] --- maven-clean-plugin:2.5:clean (default-clean) @ oxd ---
[INFO] Deleting /home/tomcat/.jenkins/jobs/oxD_3.1.5/workspace/target
[INFO]                                                                         
[INFO] ------------------------------------------------------------------------
[INFO] Building oxD Common 3.1.5.Final
[INFO] ------------------------------------------------------------------------
Downloading: http://ox.gluu.org/maven/org/xdi/oxauth-model/3.1.5.Final/oxauth-model-3.1.5.Final.pom

Downloading: http://repo1.maven.org/maven2/org/xdi/oxauth-model/3.1.5.Final/oxauth-model-3.1.5.Final.pom

Downloading: http://repository.jboss.org/nexus/content/groups/public-jboss/org/xdi/oxauth-model/3.1.5.Final/oxauth-model-3.1.5.Final.pom

Downloading: http://repo2.maven.org/maven2/org/bouncycastle/org/xdi/oxauth-model/3.1.5.Final/oxauth-model-3.1.5.Final.pom

Downloading: file:///home/tomcat/.jenkins/jobs/oxD_3.1.5/workspace/oxd-common/../oxd-repo/org/xdi/oxauth-model/3.1.5.Final/oxauth-model-3.1.5.Final.pom

[WARNING] The POM for org.xdi:oxauth-model:jar:3.1.5.Final is missing, no dependency information available
Downloading: http://ox.gluu.org/maven/org/xdi/oxauth-client/3.1.5.Final/oxauth-client-3.1.5.Final.pom

Downloading: http://repo1.maven.org/maven2/org/xdi/oxauth-client/3.1.5.Final/oxauth-client-3.1.5.Final.pom

Downloading: http://repository.jboss.org/nexus/content/groups/public-jboss/org/xdi/oxauth-client/3.1.5.Final/oxauth-client-3.1.5.Final.pom

Downloading: http://repo2.maven.org/maven2/org/bouncycastle/org/xdi/oxauth-client/3.1.5.Final/oxauth-client-3.1.5.Final.pom

Downloading: file:///home/tomcat/.jenkins/jobs/oxD_3.1.5/workspace/oxd-common/../oxd-repo/org/xdi/oxauth-client/3.1.5.Final/oxauth-client-3.1.5.Final.pom

[WARNING] The POM for org.xdi:oxauth-client:jar:3.1.5.Final is missing, no dependency information available
Downloading: http://ox.gluu.org/maven/org/xdi/oxauth-client/3.1.5.Final/oxauth-client-3.1.5.Final.jar
Downloading: http://ox.gluu.org/maven/org/xdi/oxauth-model/3.1.5.Final/oxauth-model-3.1.5.Final.jar


Downloading: http://repo1.maven.org/maven2/org/xdi/oxauth-client/3.1.5.Final/oxauth-client-3.1.5.Final.jar
Downloading: http://repo1.maven.org/maven2/org/xdi/oxauth-model/3.1.5.Final/oxauth-model-3.1.5.Final.jar


Downloading: http://repository.jboss.org/nexus/content/groups/public-jboss/org/xdi/oxauth-model/3.1.5.Final/oxauth-model-3.1.5.Final.jar
Downloading: http://repository.jboss.org/nexus/content/groups/public-jboss/org/xdi/oxauth-client/3.1.5.Final/oxauth-client-3.1.5.Final.jar


Downloading: http://repo2.maven.org/maven2/org/bouncycastle/org/xdi/oxauth-client/3.1.5.Final/oxauth-client-3.1.5.Final.jar
Downloading: http://repo2.maven.org/maven2/org/bouncycastle/org/xdi/oxauth-model/3.1.5.Final/oxauth-model-3.1.5.Final.jar


Downloading: file:///home/tomcat/.jenkins/jobs/oxD_3.1.5/workspace/oxd-common/../oxd-repo/org/xdi/oxauth-client/3.1.5.Final/oxauth-client-3.1.5.Final.jar

Downloading: file:///home/tomcat/.jenkins/jobs/oxD_3.1.5/workspace/oxd-common/../oxd-repo/org/xdi/oxauth-model/3.1.5.Final/oxauth-model-3.1.5.Final.jar

[INFO]                                                                         
[INFO] ------------------------------------------------------------------------
[INFO] Skipping oxD
[INFO] This project has been banned from the build due to previous failures.
[INFO] ------------------------------------------------------------------------
[INFO]                                                                         
[INFO] ------------------------------------------------------------------------
[INFO] Skipping oxD
[INFO] This project has been banned from the build due to previous failures.
[INFO] ------------------------------------------------------------------------
[INFO] ------------------------------------------------------------------------
[INFO] Reactor Summary:
[INFO] 
[INFO] oxD ................................................ SUCCESS [  0.328 s]
[INFO] oxD Common ......................................... FAILURE [  3.868 s]
[INFO] oxD Client ......................................... SKIPPED
[INFO] oxD Server ......................................... SKIPPED
[INFO] oxD RP Client ...................................... SKIPPED
[INFO] oxd-https-extension ................................ SKIPPED
[INFO] ------------------------------------------------------------------------
[INFO] BUILD FAILURE
[INFO] ------------------------------------------------------------------------
[INFO] Total time: 5.482 s
[INFO] Finished at: 2019-01-07T03:42:19-05:00
[INFO] Final Memory: 18M/205M
[INFO] ------------------------------------------------------------------------
[ERROR] Failed to execute goal on project oxd-common: Could not resolve dependencies for project org.xdi:oxd-common:jar:3.1.5.Final: The following artifacts could not be resolved: org.xdi:oxauth-client:jar:3.1.5.Final, org.xdi:oxauth-model:jar:3.1.5.Final: Could not find artifact org.xdi:oxauth-client:jar:3.1.5.Final in gluu (http://ox.gluu.org/maven) -> [Help 1]
[ERROR] 
[ERROR] To see the full stack trace of the errors, re-run Maven with the -e switch.
[ERROR] Re-run Maven using the -X switch to enable full debug logging.
[ERROR] 
[ERROR] For more information about the errors and possible solutions, please read the following articles:
[ERROR] [Help 1] http://cwiki.apache.org/confluence/display/MAVEN/DependencyResolutionException
[ERROR] 
[ERROR] After correcting the problems, you can resume the build with the command
[ERROR]   mvn <goals> -rf :oxd-common
Build step 'Invoke top-level Maven targets' marked build as failure
[FINDBUGS] Skipping publisher since build result is FAILURE
TestNG Reports Processing: START
Looking for TestNG results report in workspace using pattern: **/testng-results.xml
testng-results.xml was last modified before this build started. Ignoring it.
testng-results.xml was last modified before this build started. Ignoring it.
Saving reports...
Found matching files but did not find any TestNG results.
Sending e-mails to: support@gluu.org yure@gluu.org
Finished: FAILURE