FailedConsole Output

Started by an SCM change
Building on master in workspace /home/tomcat/.jenkins/jobs/oxD_3.1.5/workspace
 > git rev-parse --is-inside-work-tree # timeout=10
Fetching changes from the remote Git repository
 > git config remote.origin.url https://github.com/GluuFederation/oxD # timeout=10
Fetching upstream changes from https://github.com/GluuFederation/oxD
 > git --version # timeout=10
 > git fetch --tags --progress https://github.com/GluuFederation/oxD +refs/heads/*:refs/remotes/origin/*
 > git rev-parse refs/remotes/origin/version_3.1.5^{commit} # timeout=10
 > git rev-parse refs/remotes/origin/origin/version_3.1.5^{commit} # timeout=10
Checking out Revision 3852381a9f418f6d690489f9d4025dfb3f519261 (refs/remotes/origin/version_3.1.5)
 > git config core.sparsecheckout # timeout=10
 > git checkout -f 3852381a9f418f6d690489f9d4025dfb3f519261
Commit message: "Update oxd-server.spec"
 > git rev-list --no-walk b76f0eef6fa1de80da732f7cdf459cd8dbf60e1e # timeout=10
[workspace] $ /bin/bash /opt/tomcat/temp/jenkins4504813610585481591.sh
Cloning into 'oxHudsonProfiles'...
[workspace] $ /home/tomcat/.jenkins/tools/hudson.tasks.Maven_MavenInstallation/maven_3.3.9/bin/mvn -DVERSION_NAME=version_3.1.5 -DSERVER_PROFILE=ce-dev3 -DMAVEN_SKIP_TESTS=false -DOXD_CONF=/home/tomcat/.jenkins/jobs/oxD_3.1.4/workspace/oxd-server/src/test/resources/oxd-conf-test.json -Doxd.server.config=/home/tomcat/.jenkins/jobs/oxD_3.1.4/workspace/oxd-server/src/test/resources/oxd-conf-test.json -Dmaven.test.skip=false clean compile javadoc:aggregate-jar install
[INFO] Scanning for projects...
[WARNING] 
[WARNING] Some problems were encountered while building the effective model for org.xdi:oxd-common:jar:3.1.5-SNAPSHOT
[WARNING] 'repositories.repository.id' must not be 'local', this identifier is reserved for the local repository, using it for other repositories will corrupt your repository metadata. @ org.xdi:oxd:3.1.5-SNAPSHOT, /home/tomcat/.jenkins/jobs/oxD_3.1.5/workspace/pom.xml, line 64, column 17
[WARNING] 
[WARNING] Some problems were encountered while building the effective model for org.xdi:oxd-client:jar:3.1.5-SNAPSHOT
[WARNING] 'repositories.repository.id' must not be 'local', this identifier is reserved for the local repository, using it for other repositories will corrupt your repository metadata. @ org.xdi:oxd:3.1.5-SNAPSHOT, /home/tomcat/.jenkins/jobs/oxD_3.1.5/workspace/pom.xml, line 64, column 17
[WARNING] 
[WARNING] Some problems were encountered while building the effective model for org.xdi:oxd-server:jar:3.1.5-SNAPSHOT
[WARNING] 'repositories.repository.id' must not be 'local', this identifier is reserved for the local repository, using it for other repositories will corrupt your repository metadata. @ org.xdi:oxd:3.1.5-SNAPSHOT, /home/tomcat/.jenkins/jobs/oxD_3.1.5/workspace/pom.xml, line 64, column 17
[WARNING] 
[WARNING] Some problems were encountered while building the effective model for org.xdi:oxd-rp-client:jar:3.1.5-SNAPSHOT
[WARNING] 'repositories.repository.id' must not be 'local', this identifier is reserved for the local repository, using it for other repositories will corrupt your repository metadata. @ org.xdi:oxd:3.1.5-SNAPSHOT, /home/tomcat/.jenkins/jobs/oxD_3.1.5/workspace/pom.xml, line 64, column 17
[WARNING] 
[WARNING] Some problems were encountered while building the effective model for org.xdi:oxd-https-extension:jar:3.1.5-SNAPSHOT
[WARNING] 'repositories.repository.id' must not be 'local', this identifier is reserved for the local repository, using it for other repositories will corrupt your repository metadata. @ org.xdi:oxd:3.1.5-SNAPSHOT, /home/tomcat/.jenkins/jobs/oxD_3.1.5/workspace/pom.xml, line 64, column 17
[WARNING] 
[WARNING] Some problems were encountered while building the effective model for org.xdi:oxd:pom:3.1.5-SNAPSHOT
[WARNING] 'repositories.repository.id' must not be 'local', this identifier is reserved for the local repository, using it for other repositories will corrupt your repository metadata. @ line 64, column 17
[WARNING] 
[WARNING] It is highly recommended to fix these problems because they threaten the stability of your build.
[WARNING] 
[WARNING] For this reason, future Maven versions might no longer support building such malformed projects.
[WARNING] 
[INFO] ------------------------------------------------------------------------
[INFO] Reactor Build Order:
[INFO] 
[INFO] oxD
[INFO] oxD Common
[INFO] oxD Client
[INFO] oxD Server
[INFO] oxD RP Client
[INFO] oxd-https-extension
[WARNING] The POM for org.codehaus.mojo:gwt-maven-plugin:jar:${gwt.version} is missing, no dependency information available
[WARNING] Failed to retrieve plugin descriptor for org.codehaus.mojo:gwt-maven-plugin:${gwt.version}: Plugin org.codehaus.mojo:gwt-maven-plugin:${gwt.version} or one of its dependencies could not be resolved: Failure to find org.codehaus.mojo:gwt-maven-plugin:jar:${gwt.version} in https://repo.maven.apache.org/maven2 was cached in the local repository, resolution will not be reattempted until the update interval of central has elapsed or updates are forced
[INFO]                                                                         
[INFO] ------------------------------------------------------------------------
[INFO] Building oxD 3.1.5-SNAPSHOT
[INFO] ------------------------------------------------------------------------
[INFO] 
[INFO] --- maven-clean-plugin:2.5:clean (default-clean) @ oxd ---
[INFO] Deleting /home/tomcat/.jenkins/jobs/oxD_3.1.5/workspace/target
[INFO]                                                                         
[INFO] ------------------------------------------------------------------------
[INFO] Building oxD Common 3.1.5-SNAPSHOT
[INFO] ------------------------------------------------------------------------
[INFO] 
[INFO] --- maven-clean-plugin:2.5:clean (default-clean) @ oxd-common ---
[INFO] Deleting /home/tomcat/.jenkins/jobs/oxD_3.1.5/workspace/oxd-common/target
[INFO] 
[INFO] --- maven-resources-plugin:2.4:resources (default-resources) @ oxd-common ---
[INFO] Using 'UTF-8' encoding to copy filtered resources.
[INFO] skip non existing resourceDirectory /home/tomcat/.jenkins/jobs/oxD_3.1.5/workspace/oxd-common/src/main/resources
[INFO] 
[INFO] --- maven-compiler-plugin:2.3.2:compile (default-compile) @ oxd-common ---
[INFO] Compiling 61 source files to /home/tomcat/.jenkins/jobs/oxD_3.1.5/workspace/oxd-common/target/classes
[INFO]                                                                         
[INFO] ------------------------------------------------------------------------
[INFO] Building oxD Client 3.1.5-SNAPSHOT
[INFO] ------------------------------------------------------------------------
[INFO] 
[INFO] --- maven-clean-plugin:2.5:clean (default-clean) @ oxd-client ---
[INFO] Deleting /home/tomcat/.jenkins/jobs/oxD_3.1.5/workspace/oxd-client/target
[INFO] 
[INFO] --- maven-resources-plugin:2.4:resources (default-resources) @ oxd-client ---
[INFO] Using 'UTF-8' encoding to copy filtered resources.
[INFO] Copying 1 resource
[INFO] 
[INFO] --- maven-compiler-plugin:2.3.2:compile (default-compile) @ oxd-client ---
[INFO] Compiling 6 source files to /home/tomcat/.jenkins/jobs/oxD_3.1.5/workspace/oxd-client/target/classes
[INFO]                                                                         
[INFO] ------------------------------------------------------------------------
[INFO] Building oxD Server 3.1.5-SNAPSHOT
[INFO] ------------------------------------------------------------------------
[INFO] 
[INFO] --- maven-clean-plugin:2.5:clean (default-clean) @ oxd-server ---
[INFO] Deleting /home/tomcat/.jenkins/jobs/oxD_3.1.5/workspace/oxd-server/target
[INFO] 
[INFO] --- git-commit-id-plugin:2.1.12:revision (get-the-git-infos) @ oxd-server ---
[INFO] 
[INFO] --- maven-resources-plugin:2.4:resources (default-resources) @ oxd-server ---
[INFO] Using 'UTF-8' encoding to copy filtered resources.
[INFO] Copying 3 resources
[INFO] 
[INFO] --- maven-compiler-plugin:2.3.2:compile (default-compile) @ oxd-server ---
[INFO] Compiling 72 source files to /home/tomcat/.jenkins/jobs/oxD_3.1.5/workspace/oxd-server/target/classes
[INFO]                                                                         
[INFO] ------------------------------------------------------------------------
[INFO] Building oxD RP Client 3.1.5-SNAPSHOT
[INFO] ------------------------------------------------------------------------
[INFO] 
[INFO] --- maven-clean-plugin:2.5:clean (default-clean) @ oxd-rp-client ---
[INFO] Deleting /home/tomcat/.jenkins/jobs/oxD_3.1.5/workspace/oxd-rp-client/target
[INFO] 
[INFO] --- maven-resources-plugin:2.4:resources (default-resources) @ oxd-rp-client ---
[INFO] Using 'UTF-8' encoding to copy filtered resources.
[INFO] skip non existing resourceDirectory /home/tomcat/.jenkins/jobs/oxD_3.1.5/workspace/oxd-rp-client/src/main/resources
[INFO] 
[INFO] --- maven-compiler-plugin:2.3.2:compile (default-compile) @ oxd-rp-client ---
[INFO] Compiling 5 source files to /home/tomcat/.jenkins/jobs/oxD_3.1.5/workspace/oxd-rp-client/target/classes
[INFO]                                                                         
[INFO] ------------------------------------------------------------------------
[INFO] Building oxd-https-extension 3.1.5-SNAPSHOT
[INFO] ------------------------------------------------------------------------
[INFO] 
[INFO] --- maven-clean-plugin:2.6.1:clean (default-clean) @ oxd-https-extension ---
[INFO] Deleting /home/tomcat/.jenkins/jobs/oxD_3.1.5/workspace/oxd-https-extension/target
[INFO] 
[INFO] --- maven-resources-plugin:2.7:resources (default-resources) @ oxd-https-extension ---
[INFO] Using 'UTF-8' encoding to copy filtered resources.
[INFO] Copying 1 resource
[INFO] 
[INFO] --- maven-compiler-plugin:3.3:compile (default-compile) @ oxd-https-extension ---
[INFO] Changes detected - recompiling the module!
[INFO] Compiling 3 source files to /home/tomcat/.jenkins/jobs/oxD_3.1.5/workspace/oxd-https-extension/target/classes
[INFO]                                                                         
[INFO] ------------------------------------------------------------------------
[INFO] Building oxD 3.1.5-SNAPSHOT
[INFO] ------------------------------------------------------------------------
[WARNING] The POM for org.codehaus.mojo:gwt-maven-plugin:jar:${gwt.version} is missing, no dependency information available
[WARNING] Failed to retrieve plugin descriptor for org.codehaus.mojo:gwt-maven-plugin:${gwt.version}: Plugin org.codehaus.mojo:gwt-maven-plugin:${gwt.version} or one of its dependencies could not be resolved: Failure to find org.codehaus.mojo:gwt-maven-plugin:jar:${gwt.version} in https://repo.maven.apache.org/maven2 was cached in the local repository, resolution will not be reattempted until the update interval of central has elapsed or updates are forced
[INFO] 
[INFO] --- maven-javadoc-plugin:2.10.4:aggregate-jar (default-cli) @ oxd ---
[WARNING] The dependency: [org.xdi:oxd-server:jar:3.1.5-SNAPSHOT] can't be resolved but has been found in the reactor (probably snapshots).
This dependency has been excluded from the Javadoc classpath. You should rerun javadoc after executing mvn install.
[WARNING] IGNORED to add some artifacts in the classpath. See above.
[INFO] 
Loading source files for package org.xdi.oxd.common.params...
Loading source files for package org.xdi.oxd.common...
Loading source files for package org.xdi.oxd.common.introspection...
Loading source files for package org.xdi.oxd.common.response...
Loading source files for package org.xdi.oxd.client...
Loading source files for package org.xdi.oxd.server.model...
Loading source files for package org.xdi.oxd.server...
Loading source files for package org.xdi.oxd.server.op...
Loading source files for package org.xdi.oxd.server.introspection...
Loading source files for package org.xdi.oxd.server.license...
Loading source files for package org.xdi.oxd.server.persistence...
Loading source files for package org.xdi.oxd.server.guice...
Loading source files for package org.xdi.oxd.server.service...
Loading source files for package org.xdi.oxd.rp.client...
Loading source files for package org.gluu.oxd...
Constructing Javadoc information...
Standard Doclet version 1.8.0_121
Building tree for all the packages and classes...
Generating /home/tomcat/.jenkins/jobs/oxD_3.1.5/workspace/target/apidocs/org/xdi/oxd/common/params/AuthorizationCodeFlowParams.html...
Generating /home/tomcat/.jenkins/jobs/oxD_3.1.5/workspace/target/apidocs/org/xdi/oxd/common/params/CheckAccessTokenParams.html...
Generating /home/tomcat/.jenkins/jobs/oxD_3.1.5/workspace/target/apidocs/org/xdi/oxd/common/params/CheckIdTokenParams.html...
Generating /home/tomcat/.jenkins/jobs/oxD_3.1.5/workspace/target/apidocs/org/xdi/oxd/common/params/EmptyParams.html...
Generating /home/tomcat/.jenkins/jobs/oxD_3.1.5/workspace/target/apidocs/org/xdi/oxd/common/params/GetAccessTokenByRefreshTokenParams.html...
Generating /home/tomcat/.jenkins/jobs/oxD_3.1.5/workspace/target/apidocs/org/xdi/oxd/common/params/GetAuthorizationCodeParams.html...
Generating /home/tomcat/.jenkins/jobs/oxD_3.1.5/workspace/target/apidocs/org/xdi/oxd/common/params/GetAuthorizationUrlParams.html...
Generating /home/tomcat/.jenkins/jobs/oxD_3.1.5/workspace/target/apidocs/org/xdi/oxd/common/params/GetClientTokenParams.html...
Generating /home/tomcat/.jenkins/jobs/oxD_3.1.5/workspace/target/apidocs/org/xdi/oxd/common/params/GetLogoutUrlParams.html...
Generating /home/tomcat/.jenkins/jobs/oxD_3.1.5/workspace/target/apidocs/org/xdi/oxd/common/params/GetRpParams.html...
Generating /home/tomcat/.jenkins/jobs/oxD_3.1.5/workspace/target/apidocs/org/xdi/oxd/common/params/GetTokensByCodeParams.html...
Generating /home/tomcat/.jenkins/jobs/oxD_3.1.5/workspace/target/apidocs/org/xdi/oxd/common/params/GetUserInfoParams.html...
Generating /home/tomcat/.jenkins/jobs/oxD_3.1.5/workspace/target/apidocs/org/xdi/oxd/common/params/HasOxdIdParams.html...
Generating /home/tomcat/.jenkins/jobs/oxD_3.1.5/workspace/target/apidocs/org/xdi/oxd/common/params/HasProtectionAccessTokenParams.html...
Generating /home/tomcat/.jenkins/jobs/oxD_3.1.5/workspace/target/apidocs/org/xdi/oxd/common/params/ImplicitFlowParams.html...
Generating /home/tomcat/.jenkins/jobs/oxD_3.1.5/workspace/target/apidocs/org/xdi/oxd/common/params/IntrospectAccessTokenParams.html...
Generating /home/tomcat/.jenkins/jobs/oxD_3.1.5/workspace/target/apidocs/org/xdi/oxd/common/params/IntrospectRptParams.html...
Generating /home/tomcat/.jenkins/jobs/oxD_3.1.5/workspace/target/apidocs/org/xdi/oxd/common/params/IParams.html...
Generating /home/tomcat/.jenkins/jobs/oxD_3.1.5/workspace/target/apidocs/org/xdi/oxd/common/params/LicenseStatusParams.html...
Generating /home/tomcat/.jenkins/jobs/oxD_3.1.5/workspace/target/apidocs/org/xdi/oxd/common/params/RegisterSiteParams.html...
Generating /home/tomcat/.jenkins/jobs/oxD_3.1.5/workspace/target/apidocs/org/xdi/oxd/common/params/RemoveSiteParams.html...
Generating /home/tomcat/.jenkins/jobs/oxD_3.1.5/workspace/target/apidocs/org/xdi/oxd/common/params/RpGetClaimsGatheringUrlParams.html...
Generating /home/tomcat/.jenkins/jobs/oxD_3.1.5/workspace/target/apidocs/org/xdi/oxd/common/params/RpGetRptParams.html...
Generating /home/tomcat/.jenkins/jobs/oxD_3.1.5/workspace/target/apidocs/org/xdi/oxd/common/params/RsCheckAccessParams.html...
Generating /home/tomcat/.jenkins/jobs/oxD_3.1.5/workspace/target/apidocs/org/xdi/oxd/common/params/RsProtectParams.html...
Generating /home/tomcat/.jenkins/jobs/oxD_3.1.5/workspace/target/apidocs/org/xdi/oxd/common/params/SetupClientParams.html...
Generating /home/tomcat/.jenkins/jobs/oxD_3.1.5/workspace/target/apidocs/org/xdi/oxd/common/params/UpdateSiteParams.html...
Generating /home/tomcat/.jenkins/jobs/oxD_3.1.5/workspace/target/apidocs/org/xdi/oxd/common/params/ValidateParams.html...
Generating /home/tomcat/.jenkins/jobs/oxD_3.1.5/workspace/target/apidocs/org/xdi/oxd/common/Command.html...
Generating /home/tomcat/.jenkins/jobs/oxD_3.1.5/workspace/target/apidocs/org/xdi/oxd/common/CommandResponse.html...
Generating /home/tomcat/.jenkins/jobs/oxD_3.1.5/workspace/target/apidocs/org/xdi/oxd/common/CommandType.html...
Generating /home/tomcat/.jenkins/jobs/oxD_3.1.5/workspace/target/apidocs/org/xdi/oxd/common/CoreUtils.html...
Generating /home/tomcat/.jenkins/jobs/oxD_3.1.5/workspace/target/apidocs/org/xdi/oxd/common/ErrorResponse.html...
Generating /home/tomcat/.jenkins/jobs/oxD_3.1.5/workspace/target/apidocs/org/xdi/oxd/common/ErrorResponseCode.html...
Generating /home/tomcat/.jenkins/jobs/oxD_3.1.5/workspace/target/apidocs/org/xdi/oxd/common/ErrorResponseException.html...
Generating /home/tomcat/.jenkins/jobs/oxD_3.1.5/workspace/target/apidocs/org/xdi/oxd/common/HttpErrorResponseException.html...
Generating /home/tomcat/.jenkins/jobs/oxD_3.1.5/workspace/target/apidocs/org/xdi/oxd/common/ReadResult.html...
Generating /home/tomcat/.jenkins/jobs/oxD_3.1.5/workspace/target/apidocs/org/xdi/oxd/common/ResponseStatus.html...
Generating /home/tomcat/.jenkins/jobs/oxD_3.1.5/workspace/target/apidocs/org/xdi/oxd/common/introspection/CorrectRptIntrospectionResponse.html...
Generating /home/tomcat/.jenkins/jobs/oxD_3.1.5/workspace/target/apidocs/org/xdi/oxd/common/introspection/CorrectUmaPermission.html...
Generating /home/tomcat/.jenkins/jobs/oxD_3.1.5/workspace/target/apidocs/org/xdi/oxd/common/response/AuthorizationCodeFlowResponse.html...
Generating /home/tomcat/.jenkins/jobs/oxD_3.1.5/workspace/target/apidocs/org/xdi/oxd/common/response/CheckAccessTokenResponse.html...
Generating /home/tomcat/.jenkins/jobs/oxD_3.1.5/workspace/target/apidocs/org/xdi/oxd/common/response/CheckIdTokenResponse.html...
Generating /home/tomcat/.jenkins/jobs/oxD_3.1.5/workspace/target/apidocs/org/xdi/oxd/common/response/GetAuthorizationCodeResponse.html...
Generating /home/tomcat/.jenkins/jobs/oxD_3.1.5/workspace/target/apidocs/org/xdi/oxd/common/response/GetAuthorizationUrlResponse.html...
Generating /home/tomcat/.jenkins/jobs/oxD_3.1.5/workspace/target/apidocs/org/xdi/oxd/common/response/GetClientTokenResponse.html...
Generating /home/tomcat/.jenkins/jobs/oxD_3.1.5/workspace/target/apidocs/org/xdi/oxd/common/response/GetRpResponse.html...
Generating /home/tomcat/.jenkins/jobs/oxD_3.1.5/workspace/target/apidocs/org/xdi/oxd/common/response/GetTokensByCodeResponse.html...
Generating /home/tomcat/.jenkins/jobs/oxD_3.1.5/workspace/target/apidocs/org/xdi/oxd/common/response/GetUserInfoResponse.html...
Generating /home/tomcat/.jenkins/jobs/oxD_3.1.5/workspace/target/apidocs/org/xdi/oxd/common/response/ImplicitFlowResponse.html...
Generating /home/tomcat/.jenkins/jobs/oxD_3.1.5/workspace/target/apidocs/org/xdi/oxd/common/response/IOpResponse.html...
Generating /home/tomcat/.jenkins/jobs/oxD_3.1.5/workspace/target/apidocs/org/xdi/oxd/common/response/LicenseStatusOpResponse.html...
Generating /home/tomcat/.jenkins/jobs/oxD_3.1.5/workspace/target/apidocs/org/xdi/oxd/common/response/LogoutResponse.html...
Generating /home/tomcat/.jenkins/jobs/oxD_3.1.5/workspace/target/apidocs/org/xdi/oxd/common/response/RegisterSiteResponse.html...
Generating /home/tomcat/.jenkins/jobs/oxD_3.1.5/workspace/target/apidocs/org/xdi/oxd/common/response/RemoveSiteResponse.html...
Generating /home/tomcat/.jenkins/jobs/oxD_3.1.5/workspace/target/apidocs/org/xdi/oxd/common/response/RpGetClaimsGatheringUrlResponse.html...
Generating /home/tomcat/.jenkins/jobs/oxD_3.1.5/workspace/target/apidocs/org/xdi/oxd/common/response/RpGetRptResponse.html...
Generating /home/tomcat/.jenkins/jobs/oxD_3.1.5/workspace/target/apidocs/org/xdi/oxd/common/response/RsCheckAccessResponse.html...
Generating /home/tomcat/.jenkins/jobs/oxD_3.1.5/workspace/target/apidocs/org/xdi/oxd/common/response/RsProtectResponse.html...
Generating /home/tomcat/.jenkins/jobs/oxD_3.1.5/workspace/target/apidocs/org/xdi/oxd/common/response/SetupClientResponse.html...
Generating /home/tomcat/.jenkins/jobs/oxD_3.1.5/workspace/target/apidocs/org/xdi/oxd/common/response/UpdateSiteResponse.html...
Generating /home/tomcat/.jenkins/jobs/oxD_3.1.5/workspace/target/apidocs/org/xdi/oxd/client/CommandClient.html...
Generating /home/tomcat/.jenkins/jobs/oxD_3.1.5/workspace/target/apidocs/org/xdi/oxd/client/CommandClientPool.html...
Generating /home/tomcat/.jenkins/jobs/oxD_3.1.5/workspace/target/apidocs/org/xdi/oxd/client/HttpClient.html...
Generating /home/tomcat/.jenkins/jobs/oxD_3.1.5/workspace/target/apidocs/org/xdi/oxd/client/HttpClientInterface.html...
Generating /home/tomcat/.jenkins/jobs/oxD_3.1.5/workspace/target/apidocs/org/xdi/oxd/client/ObjectPool.html...
Generating /home/tomcat/.jenkins/jobs/oxD_3.1.5/workspace/target/apidocs/org/xdi/oxd/client/TransportClient.html...
Generating /home/tomcat/.jenkins/jobs/oxD_3.1.5/workspace/target/apidocs/org/xdi/oxd/server/model/Pat.html...
Generating /home/tomcat/.jenkins/jobs/oxD_3.1.5/workspace/target/apidocs/org/xdi/oxd/server/model/UmaResource.html...
Generating /home/tomcat/.jenkins/jobs/oxD_3.1.5/workspace/target/apidocs/org/xdi/oxd/server/model/UmaToken.html...
Generating /home/tomcat/.jenkins/jobs/oxD_3.1.5/workspace/target/apidocs/org/xdi/oxd/server/model/UmaTokenFactory.html...
Generating /home/tomcat/.jenkins/jobs/oxD_3.1.5/workspace/target/apidocs/org/xdi/oxd/server/Cli.html...
Generating /home/tomcat/.jenkins/jobs/oxD_3.1.5/workspace/target/apidocs/org/xdi/oxd/server/Configuration.html...
Generating /home/tomcat/.jenkins/jobs/oxD_3.1.5/workspace/target/apidocs/org/xdi/oxd/server/Convertor.html...
Generating /home/tomcat/.jenkins/jobs/oxD_3.1.5/workspace/target/apidocs/org/xdi/oxd/server/Processor.html...
Generating /home/tomcat/.jenkins/jobs/oxD_3.1.5/workspace/target/apidocs/org/xdi/oxd/server/ServerLauncher.html...
Generating /home/tomcat/.jenkins/jobs/oxD_3.1.5/workspace/target/apidocs/org/xdi/oxd/server/ShutdownException.html...
Generating /home/tomcat/.jenkins/jobs/oxD_3.1.5/workspace/target/apidocs/org/xdi/oxd/server/SocketProcessor.html...
Generating /home/tomcat/.jenkins/jobs/oxD_3.1.5/workspace/target/apidocs/org/xdi/oxd/server/Utils.html...
Generating /home/tomcat/.jenkins/jobs/oxD_3.1.5/workspace/target/apidocs/org/xdi/oxd/server/op/AuthorizationCodeFlowOperation.html...
Generating /home/tomcat/.jenkins/jobs/oxD_3.1.5/workspace/target/apidocs/org/xdi/oxd/server/op/BaseOperation.html...
Generating /home/tomcat/.jenkins/jobs/oxD_3.1.5/workspace/target/apidocs/org/xdi/oxd/server/op/CheckAccessTokenOperation.html...
Generating /home/tomcat/.jenkins/jobs/oxD_3.1.5/workspace/target/apidocs/org/xdi/oxd/server/op/CheckIdTokenOperation.html...
Generating /home/tomcat/.jenkins/jobs/oxD_3.1.5/workspace/target/apidocs/org/xdi/oxd/server/op/GetAccessTokenByRefreshTokenOperation.html...
Generating /home/tomcat/.jenkins/jobs/oxD_3.1.5/workspace/target/apidocs/org/xdi/oxd/server/op/GetAuthorizationCodeOperation.html...
Generating /home/tomcat/.jenkins/jobs/oxD_3.1.5/workspace/target/apidocs/org/xdi/oxd/server/op/GetAuthorizationUrlOperation.html...
Generating /home/tomcat/.jenkins/jobs/oxD_3.1.5/workspace/target/apidocs/org/xdi/oxd/server/op/GetClientTokenOperation.html...
Generating /home/tomcat/.jenkins/jobs/oxD_3.1.5/workspace/target/apidocs/org/xdi/oxd/server/op/GetLogoutUrlOperation.html...
Generating /home/tomcat/.jenkins/jobs/oxD_3.1.5/workspace/target/apidocs/org/xdi/oxd/server/op/GetRpOperation.html...
Generating /home/tomcat/.jenkins/jobs/oxD_3.1.5/workspace/target/apidocs/org/xdi/oxd/server/op/GetTokensByCodeOperation.html...
Generating /home/tomcat/.jenkins/jobs/oxD_3.1.5/workspace/target/apidocs/org/xdi/oxd/server/op/GetUserInfoOperation.html...
Generating /home/tomcat/.jenkins/jobs/oxD_3.1.5/workspace/target/apidocs/org/xdi/oxd/server/op/ImplicitFlowOperation.html...
Generating /home/tomcat/.jenkins/jobs/oxD_3.1.5/workspace/target/apidocs/org/xdi/oxd/server/op/IntrospectAccessTokenOperation.html...
Generating /home/tomcat/.jenkins/jobs/oxD_3.1.5/workspace/target/apidocs/org/xdi/oxd/server/op/IntrospectRptOperation.html...
Generating /home/tomcat/.jenkins/jobs/oxD_3.1.5/workspace/target/apidocs/org/xdi/oxd/server/op/IOperation.html...
Generating /home/tomcat/.jenkins/jobs/oxD_3.1.5/workspace/target/apidocs/org/xdi/oxd/server/op/LicenseStatusOperation.html...
Generating /home/tomcat/.jenkins/jobs/oxD_3.1.5/workspace/target/apidocs/org/xdi/oxd/server/op/OperationFactory.html...
Generating /home/tomcat/.jenkins/jobs/oxD_3.1.5/workspace/target/apidocs/org/xdi/oxd/server/op/RegisterSiteOperation.html...
Generating /home/tomcat/.jenkins/jobs/oxD_3.1.5/workspace/target/apidocs/org/xdi/oxd/server/op/RemoveSiteOperation.html...
Generating /home/tomcat/.jenkins/jobs/oxD_3.1.5/workspace/target/apidocs/org/xdi/oxd/server/op/RpGetGetClaimsGatheringUrlOperation.html...
Generating /home/tomcat/.jenkins/jobs/oxD_3.1.5/workspace/target/apidocs/org/xdi/oxd/server/op/RpGetRptOperation.html...
Generating /home/tomcat/.jenkins/jobs/oxD_3.1.5/workspace/target/apidocs/org/xdi/oxd/server/op/RsCheckAccessOperation.html...
Generating /home/tomcat/.jenkins/jobs/oxD_3.1.5/workspace/target/apidocs/org/xdi/oxd/server/op/RsProtectOperation.html...
Generating /home/tomcat/.jenkins/jobs/oxD_3.1.5/workspace/target/apidocs/org/xdi/oxd/server/op/SetupClientOperation.html...
Generating /home/tomcat/.jenkins/jobs/oxD_3.1.5/workspace/target/apidocs/org/xdi/oxd/server/op/UpdateSiteOperation.html...
Generating /home/tomcat/.jenkins/jobs/oxD_3.1.5/workspace/target/apidocs/org/xdi/oxd/server/op/ValidateOperation.html...
Generating /home/tomcat/.jenkins/jobs/oxD_3.1.5/workspace/target/apidocs/org/xdi/oxd/server/op/Validator.html...
Generating /home/tomcat/.jenkins/jobs/oxD_3.1.5/workspace/target/apidocs/org/xdi/oxd/server/introspection/BackCompatibleIntrospectionResponse.html...
Generating /home/tomcat/.jenkins/jobs/oxD_3.1.5/workspace/target/apidocs/org/xdi/oxd/server/introspection/BackCompatibleIntrospectionService.html...
Generating /home/tomcat/.jenkins/jobs/oxD_3.1.5/workspace/target/apidocs/org/xdi/oxd/server/introspection/BadRptIntrospectionResponse.html...
Generating /home/tomcat/.jenkins/jobs/oxD_3.1.5/workspace/target/apidocs/org/xdi/oxd/server/introspection/BadRptIntrospectionService.html...
Generating /home/tomcat/.jenkins/jobs/oxD_3.1.5/workspace/target/apidocs/org/xdi/oxd/server/introspection/BadUmaPermission.html...
Generating /home/tomcat/.jenkins/jobs/oxD_3.1.5/workspace/target/apidocs/org/xdi/oxd/server/introspection/ClientFactory.html...
Generating /home/tomcat/.jenkins/jobs/oxD_3.1.5/workspace/target/apidocs/org/xdi/oxd/server/introspection/CorrectRptIntrospectionService.html...
Generating /home/tomcat/.jenkins/jobs/oxD_3.1.5/workspace/target/apidocs/org/xdi/oxd/server/license/LicenseFile.html...
Generating /home/tomcat/.jenkins/jobs/oxD_3.1.5/workspace/target/apidocs/org/xdi/oxd/server/license/LicenseFile.MacAddress.html...
Generating /home/tomcat/.jenkins/jobs/oxD_3.1.5/workspace/target/apidocs/org/xdi/oxd/server/license/LicenseFileUpdateService.html...
Generating /home/tomcat/.jenkins/jobs/oxD_3.1.5/workspace/target/apidocs/org/xdi/oxd/server/license/LicenseService.html...
Generating /home/tomcat/.jenkins/jobs/oxD_3.1.5/workspace/target/apidocs/org/xdi/oxd/server/license/MacAddressProvider.html...
Generating /home/tomcat/.jenkins/jobs/oxD_3.1.5/workspace/target/apidocs/org/xdi/oxd/server/persistence/H2Configuration.html...
Generating /home/tomcat/.jenkins/jobs/oxD_3.1.5/workspace/target/apidocs/org/xdi/oxd/server/persistence/H2PersistenceProvider.html...
Generating /home/tomcat/.jenkins/jobs/oxD_3.1.5/workspace/target/apidocs/org/xdi/oxd/server/persistence/PersistenceService.html...
Generating /home/tomcat/.jenkins/jobs/oxD_3.1.5/workspace/target/apidocs/org/xdi/oxd/server/persistence/PersistenceServiceImpl.html...
Generating /home/tomcat/.jenkins/jobs/oxD_3.1.5/workspace/target/apidocs/org/xdi/oxd/server/persistence/RedisPersistenceService.html...
Generating /home/tomcat/.jenkins/jobs/oxD_3.1.5/workspace/target/apidocs/org/xdi/oxd/server/persistence/SqlPersistenceProvider.html...
Generating /home/tomcat/.jenkins/jobs/oxD_3.1.5/workspace/target/apidocs/org/xdi/oxd/server/persistence/SqlPersistenceServiceImpl.html...
Generating /home/tomcat/.jenkins/jobs/oxD_3.1.5/workspace/target/apidocs/org/xdi/oxd/server/guice/GuiceModule.html...
Generating /home/tomcat/.jenkins/jobs/oxD_3.1.5/workspace/target/apidocs/org/xdi/oxd/server/service/ConfigurationService.html...
Generating /home/tomcat/.jenkins/jobs/oxD_3.1.5/workspace/target/apidocs/org/xdi/oxd/server/service/DiscoveryService.html...
Generating /home/tomcat/.jenkins/jobs/oxD_3.1.5/workspace/target/apidocs/org/xdi/oxd/server/service/HttpService.html...
Generating /home/tomcat/.jenkins/jobs/oxD_3.1.5/workspace/target/apidocs/org/xdi/oxd/server/service/IntrospectionService.html...
Generating /home/tomcat/.jenkins/jobs/oxD_3.1.5/workspace/target/apidocs/org/xdi/oxd/server/service/MigrationService.html...
Generating /home/tomcat/.jenkins/jobs/oxD_3.1.5/workspace/target/apidocs/org/xdi/oxd/server/service/PublicOpKeyService.html...
Generating /home/tomcat/.jenkins/jobs/oxD_3.1.5/workspace/target/apidocs/org/xdi/oxd/server/service/Rp.html...
Generating /home/tomcat/.jenkins/jobs/oxD_3.1.5/workspace/target/apidocs/org/xdi/oxd/server/service/RpService.html...
Generating /home/tomcat/.jenkins/jobs/oxD_3.1.5/workspace/target/apidocs/org/xdi/oxd/server/service/SocketService.html...
Generating /home/tomcat/.jenkins/jobs/oxD_3.1.5/workspace/target/apidocs/org/xdi/oxd/server/service/StateService.html...
Generating /home/tomcat/.jenkins/jobs/oxD_3.1.5/workspace/target/apidocs/org/xdi/oxd/server/service/TimeService.html...
Generating /home/tomcat/.jenkins/jobs/oxD_3.1.5/workspace/target/apidocs/org/xdi/oxd/server/service/UmaTokenService.html...
Generating /home/tomcat/.jenkins/jobs/oxD_3.1.5/workspace/target/apidocs/org/xdi/oxd/server/service/ValidationService.html...
Generating /home/tomcat/.jenkins/jobs/oxD_3.1.5/workspace/target/apidocs/org/xdi/oxd/rp/client/HrefDetails.html...
Generating /home/tomcat/.jenkins/jobs/oxD_3.1.5/workspace/target/apidocs/org/xdi/oxd/rp/client/RpClient.html...
Generating /home/tomcat/.jenkins/jobs/oxD_3.1.5/workspace/target/apidocs/org/xdi/oxd/rp/client/RpClientFactory.html...
Generating /home/tomcat/.jenkins/jobs/oxD_3.1.5/workspace/target/apidocs/org/xdi/oxd/rp/client/RpClientUtils.html...
Generating /home/tomcat/.jenkins/jobs/oxD_3.1.5/workspace/target/apidocs/org/xdi/oxd/rp/client/RpSocketClient.html...
Generating /home/tomcat/.jenkins/jobs/oxD_3.1.5/workspace/target/apidocs/org/gluu/oxd/OxdHttpsApplication.html...
Generating /home/tomcat/.jenkins/jobs/oxD_3.1.5/workspace/target/apidocs/org/gluu/oxd/OxdHttpsConfiguration.html...
Generating /home/tomcat/.jenkins/jobs/oxD_3.1.5/workspace/target/apidocs/org/gluu/oxd/RestResource.html...
Generating /home/tomcat/.jenkins/jobs/oxD_3.1.5/workspace/target/apidocs/overview-frame.html...
Generating /home/tomcat/.jenkins/jobs/oxD_3.1.5/workspace/target/apidocs/org/gluu/oxd/package-frame.html...
Generating /home/tomcat/.jenkins/jobs/oxD_3.1.5/workspace/target/apidocs/org/gluu/oxd/package-summary.html...
Generating /home/tomcat/.jenkins/jobs/oxD_3.1.5/workspace/target/apidocs/org/gluu/oxd/package-tree.html...
Generating /home/tomcat/.jenkins/jobs/oxD_3.1.5/workspace/target/apidocs/org/xdi/oxd/client/package-frame.html...
Generating /home/tomcat/.jenkins/jobs/oxD_3.1.5/workspace/target/apidocs/org/xdi/oxd/client/package-summary.html...
Generating /home/tomcat/.jenkins/jobs/oxD_3.1.5/workspace/target/apidocs/org/xdi/oxd/client/package-tree.html...
Generating /home/tomcat/.jenkins/jobs/oxD_3.1.5/workspace/target/apidocs/org/xdi/oxd/common/package-frame.html...
Generating /home/tomcat/.jenkins/jobs/oxD_3.1.5/workspace/target/apidocs/org/xdi/oxd/common/package-summary.html...
Generating /home/tomcat/.jenkins/jobs/oxD_3.1.5/workspace/target/apidocs/org/xdi/oxd/common/package-tree.html...
Generating /home/tomcat/.jenkins/jobs/oxD_3.1.5/workspace/target/apidocs/org/xdi/oxd/common/introspection/package-frame.html...
Generating /home/tomcat/.jenkins/jobs/oxD_3.1.5/workspace/target/apidocs/org/xdi/oxd/common/introspection/package-summary.html...
Generating /home/tomcat/.jenkins/jobs/oxD_3.1.5/workspace/target/apidocs/org/xdi/oxd/common/introspection/package-tree.html...
Generating /home/tomcat/.jenkins/jobs/oxD_3.1.5/workspace/target/apidocs/org/xdi/oxd/common/params/package-frame.html...
Generating /home/tomcat/.jenkins/jobs/oxD_3.1.5/workspace/target/apidocs/org/xdi/oxd/common/params/package-summary.html...
Generating /home/tomcat/.jenkins/jobs/oxD_3.1.5/workspace/target/apidocs/org/xdi/oxd/common/params/package-tree.html...
Generating /home/tomcat/.jenkins/jobs/oxD_3.1.5/workspace/target/apidocs/org/xdi/oxd/common/response/package-frame.html...
Generating /home/tomcat/.jenkins/jobs/oxD_3.1.5/workspace/target/apidocs/org/xdi/oxd/common/response/package-summary.html...
Generating /home/tomcat/.jenkins/jobs/oxD_3.1.5/workspace/target/apidocs/org/xdi/oxd/common/response/package-tree.html...
Generating /home/tomcat/.jenkins/jobs/oxD_3.1.5/workspace/target/apidocs/org/xdi/oxd/rp/client/package-frame.html...
Generating /home/tomcat/.jenkins/jobs/oxD_3.1.5/workspace/target/apidocs/org/xdi/oxd/rp/client/package-summary.html...
Generating /home/tomcat/.jenkins/jobs/oxD_3.1.5/workspace/target/apidocs/org/xdi/oxd/rp/client/package-tree.html...
Generating /home/tomcat/.jenkins/jobs/oxD_3.1.5/workspace/target/apidocs/org/xdi/oxd/server/package-frame.html...
Generating /home/tomcat/.jenkins/jobs/oxD_3.1.5/workspace/target/apidocs/org/xdi/oxd/server/package-summary.html...
Generating /home/tomcat/.jenkins/jobs/oxD_3.1.5/workspace/target/apidocs/org/xdi/oxd/server/package-tree.html...
Generating /home/tomcat/.jenkins/jobs/oxD_3.1.5/workspace/target/apidocs/org/xdi/oxd/server/guice/package-frame.html...
Generating /home/tomcat/.jenkins/jobs/oxD_3.1.5/workspace/target/apidocs/org/xdi/oxd/server/guice/package-summary.html...
Generating /home/tomcat/.jenkins/jobs/oxD_3.1.5/workspace/target/apidocs/org/xdi/oxd/server/guice/package-tree.html...
Generating /home/tomcat/.jenkins/jobs/oxD_3.1.5/workspace/target/apidocs/org/xdi/oxd/server/introspection/package-frame.html...
Generating /home/tomcat/.jenkins/jobs/oxD_3.1.5/workspace/target/apidocs/org/xdi/oxd/server/introspection/package-summary.html...
Generating /home/tomcat/.jenkins/jobs/oxD_3.1.5/workspace/target/apidocs/org/xdi/oxd/server/introspection/package-tree.html...
Generating /home/tomcat/.jenkins/jobs/oxD_3.1.5/workspace/target/apidocs/org/xdi/oxd/server/license/package-frame.html...
Generating /home/tomcat/.jenkins/jobs/oxD_3.1.5/workspace/target/apidocs/org/xdi/oxd/server/license/package-summary.html...
Generating /home/tomcat/.jenkins/jobs/oxD_3.1.5/workspace/target/apidocs/org/xdi/oxd/server/license/package-tree.html...
Generating /home/tomcat/.jenkins/jobs/oxD_3.1.5/workspace/target/apidocs/org/xdi/oxd/server/model/package-frame.html...
Generating /home/tomcat/.jenkins/jobs/oxD_3.1.5/workspace/target/apidocs/org/xdi/oxd/server/model/package-summary.html...
Generating /home/tomcat/.jenkins/jobs/oxD_3.1.5/workspace/target/apidocs/org/xdi/oxd/server/model/package-tree.html...
Generating /home/tomcat/.jenkins/jobs/oxD_3.1.5/workspace/target/apidocs/org/xdi/oxd/server/op/package-frame.html...
Generating /home/tomcat/.jenkins/jobs/oxD_3.1.5/workspace/target/apidocs/org/xdi/oxd/server/op/package-summary.html...
Generating /home/tomcat/.jenkins/jobs/oxD_3.1.5/workspace/target/apidocs/org/xdi/oxd/server/op/package-tree.html...
Generating /home/tomcat/.jenkins/jobs/oxD_3.1.5/workspace/target/apidocs/org/xdi/oxd/server/persistence/package-frame.html...
Generating /home/tomcat/.jenkins/jobs/oxD_3.1.5/workspace/target/apidocs/org/xdi/oxd/server/persistence/package-summary.html...
Generating /home/tomcat/.jenkins/jobs/oxD_3.1.5/workspace/target/apidocs/org/xdi/oxd/server/persistence/package-tree.html...
Generating /home/tomcat/.jenkins/jobs/oxD_3.1.5/workspace/target/apidocs/org/xdi/oxd/server/service/package-frame.html...
Generating /home/tomcat/.jenkins/jobs/oxD_3.1.5/workspace/target/apidocs/org/xdi/oxd/server/service/package-summary.html...
Generating /home/tomcat/.jenkins/jobs/oxD_3.1.5/workspace/target/apidocs/org/xdi/oxd/server/service/package-tree.html...
Generating /home/tomcat/.jenkins/jobs/oxD_3.1.5/workspace/target/apidocs/constant-values.html...
Generating /home/tomcat/.jenkins/jobs/oxD_3.1.5/workspace/target/apidocs/serialized-form.html...
Generating /home/tomcat/.jenkins/jobs/oxD_3.1.5/workspace/target/apidocs/org/xdi/oxd/common/params/class-use/GetRpParams.html...
Generating /home/tomcat/.jenkins/jobs/oxD_3.1.5/workspace/target/apidocs/org/xdi/oxd/common/params/class-use/GetAuthorizationCodeParams.html...
Generating /home/tomcat/.jenkins/jobs/oxD_3.1.5/workspace/target/apidocs/org/xdi/oxd/common/params/class-use/GetAuthorizationUrlParams.html...
Generating /home/tomcat/.jenkins/jobs/oxD_3.1.5/workspace/target/apidocs/org/xdi/oxd/common/params/class-use/IntrospectAccessTokenParams.html...
Generating /home/tomcat/.jenkins/jobs/oxD_3.1.5/workspace/target/apidocs/org/xdi/oxd/common/params/class-use/CheckAccessTokenParams.html...
Generating /home/tomcat/.jenkins/jobs/oxD_3.1.5/workspace/target/apidocs/org/xdi/oxd/common/params/class-use/GetClientTokenParams.html...
Generating /home/tomcat/.jenkins/jobs/oxD_3.1.5/workspace/target/apidocs/org/xdi/oxd/common/params/class-use/GetUserInfoParams.html...
Generating /home/tomcat/.jenkins/jobs/oxD_3.1.5/workspace/target/apidocs/org/xdi/oxd/common/params/class-use/ImplicitFlowParams.html...
Generating /home/tomcat/.jenkins/jobs/oxD_3.1.5/workspace/target/apidocs/org/xdi/oxd/common/params/class-use/RsProtectParams.html...
Generating /home/tomcat/.jenkins/jobs/oxD_3.1.5/workspace/target/apidocs/org/xdi/oxd/common/params/class-use/LicenseStatusParams.html...
Generating /home/tomcat/.jenkins/jobs/oxD_3.1.5/workspace/target/apidocs/org/xdi/oxd/common/params/class-use/GetTokensByCodeParams.html...
Generating /home/tomcat/.jenkins/jobs/oxD_3.1.5/workspace/target/apidocs/org/xdi/oxd/common/params/class-use/UpdateSiteParams.html...
Generating /home/tomcat/.jenkins/jobs/oxD_3.1.5/workspace/target/apidocs/org/xdi/oxd/common/params/class-use/AuthorizationCodeFlowParams.html...
Generating /home/tomcat/.jenkins/jobs/oxD_3.1.5/workspace/target/apidocs/org/xdi/oxd/common/params/class-use/GetLogoutUrlParams.html...
Generating /home/tomcat/.jenkins/jobs/oxD_3.1.5/workspace/target/apidocs/org/xdi/oxd/common/params/class-use/RegisterSiteParams.html...
Generating /home/tomcat/.jenkins/jobs/oxD_3.1.5/workspace/target/apidocs/org/xdi/oxd/common/params/class-use/HasOxdIdParams.html...
Generating /home/tomcat/.jenkins/jobs/oxD_3.1.5/workspace/target/apidocs/org/xdi/oxd/common/params/class-use/EmptyParams.html...
Generating /home/tomcat/.jenkins/jobs/oxD_3.1.5/workspace/target/apidocs/org/xdi/oxd/common/params/class-use/HasProtectionAccessTokenParams.html...
Generating /home/tomcat/.jenkins/jobs/oxD_3.1.5/workspace/target/apidocs/org/xdi/oxd/common/params/class-use/GetAccessTokenByRefreshTokenParams.html...
Generating /home/tomcat/.jenkins/jobs/oxD_3.1.5/workspace/target/apidocs/org/xdi/oxd/common/params/class-use/IntrospectRptParams.html...
Generating /home/tomcat/.jenkins/jobs/oxD_3.1.5/workspace/target/apidocs/org/xdi/oxd/common/params/class-use/CheckIdTokenParams.html...
Generating /home/tomcat/.jenkins/jobs/oxD_3.1.5/workspace/target/apidocs/org/xdi/oxd/common/params/class-use/IParams.html...
Generating /home/tomcat/.jenkins/jobs/oxD_3.1.5/workspace/target/apidocs/org/xdi/oxd/common/params/class-use/ValidateParams.html...
Generating /home/tomcat/.jenkins/jobs/oxD_3.1.5/workspace/target/apidocs/org/xdi/oxd/common/params/class-use/RemoveSiteParams.html...
Generating /home/tomcat/.jenkins/jobs/oxD_3.1.5/workspace/target/apidocs/org/xdi/oxd/common/params/class-use/RpGetRptParams.html...
Generating /home/tomcat/.jenkins/jobs/oxD_3.1.5/workspace/target/apidocs/org/xdi/oxd/common/params/class-use/RsCheckAccessParams.html...
Generating /home/tomcat/.jenkins/jobs/oxD_3.1.5/workspace/target/apidocs/org/xdi/oxd/common/params/class-use/SetupClientParams.html...
Generating /home/tomcat/.jenkins/jobs/oxD_3.1.5/workspace/target/apidocs/org/xdi/oxd/common/params/class-use/RpGetClaimsGatheringUrlParams.html...
Generating /home/tomcat/.jenkins/jobs/oxD_3.1.5/workspace/target/apidocs/org/xdi/oxd/common/class-use/HttpErrorResponseException.html...
Generating /home/tomcat/.jenkins/jobs/oxD_3.1.5/workspace/target/apidocs/org/xdi/oxd/common/class-use/ResponseStatus.html...
Generating /home/tomcat/.jenkins/jobs/oxD_3.1.5/workspace/target/apidocs/org/xdi/oxd/common/class-use/CommandType.html...
Generating /home/tomcat/.jenkins/jobs/oxD_3.1.5/workspace/target/apidocs/org/xdi/oxd/common/class-use/ErrorResponseCode.html...
Generating /home/tomcat/.jenkins/jobs/oxD_3.1.5/workspace/target/apidocs/org/xdi/oxd/common/class-use/CoreUtils.html...
Generating /home/tomcat/.jenkins/jobs/oxD_3.1.5/workspace/target/apidocs/org/xdi/oxd/common/class-use/ReadResult.html...
Generating /home/tomcat/.jenkins/jobs/oxD_3.1.5/workspace/target/apidocs/org/xdi/oxd/common/class-use/ErrorResponse.html...
Generating /home/tomcat/.jenkins/jobs/oxD_3.1.5/workspace/target/apidocs/org/xdi/oxd/common/class-use/ErrorResponseException.html...
Generating /home/tomcat/.jenkins/jobs/oxD_3.1.5/workspace/target/apidocs/org/xdi/oxd/common/class-use/CommandResponse.html...
Generating /home/tomcat/.jenkins/jobs/oxD_3.1.5/workspace/target/apidocs/org/xdi/oxd/common/class-use/Command.html...
Generating /home/tomcat/.jenkins/jobs/oxD_3.1.5/workspace/target/apidocs/org/xdi/oxd/common/introspection/class-use/CorrectUmaPermission.html...
Generating /home/tomcat/.jenkins/jobs/oxD_3.1.5/workspace/target/apidocs/org/xdi/oxd/common/introspection/class-use/CorrectRptIntrospectionResponse.html...
Generating /home/tomcat/.jenkins/jobs/oxD_3.1.5/workspace/target/apidocs/org/xdi/oxd/common/response/class-use/RpGetRptResponse.html...
Generating /home/tomcat/.jenkins/jobs/oxD_3.1.5/workspace/target/apidocs/org/xdi/oxd/common/response/class-use/CheckIdTokenResponse.html...
Generating /home/tomcat/.jenkins/jobs/oxD_3.1.5/workspace/target/apidocs/org/xdi/oxd/common/response/class-use/IOpResponse.html...
Generating /home/tomcat/.jenkins/jobs/oxD_3.1.5/workspace/target/apidocs/org/xdi/oxd/common/response/class-use/RegisterSiteResponse.html...
Generating /home/tomcat/.jenkins/jobs/oxD_3.1.5/workspace/target/apidocs/org/xdi/oxd/common/response/class-use/GetClientTokenResponse.html...
Generating /home/tomcat/.jenkins/jobs/oxD_3.1.5/workspace/target/apidocs/org/xdi/oxd/common/response/class-use/LicenseStatusOpResponse.html...
Generating /home/tomcat/.jenkins/jobs/oxD_3.1.5/workspace/target/apidocs/org/xdi/oxd/common/response/class-use/AuthorizationCodeFlowResponse.html...
Generating /home/tomcat/.jenkins/jobs/oxD_3.1.5/workspace/target/apidocs/org/xdi/oxd/common/response/class-use/CheckAccessTokenResponse.html...
Generating /home/tomcat/.jenkins/jobs/oxD_3.1.5/workspace/target/apidocs/org/xdi/oxd/common/response/class-use/RpGetClaimsGatheringUrlResponse.html...
Generating /home/tomcat/.jenkins/jobs/oxD_3.1.5/workspace/target/apidocs/org/xdi/oxd/common/response/class-use/GetAuthorizationUrlResponse.html...
Generating /home/tomcat/.jenkins/jobs/oxD_3.1.5/workspace/target/apidocs/org/xdi/oxd/common/response/class-use/GetUserInfoResponse.html...
Generating /home/tomcat/.jenkins/jobs/oxD_3.1.5/workspace/target/apidocs/org/xdi/oxd/common/response/class-use/UpdateSiteResponse.html...
Generating /home/tomcat/.jenkins/jobs/oxD_3.1.5/workspace/target/apidocs/org/xdi/oxd/common/response/class-use/LogoutResponse.html...
Generating /home/tomcat/.jenkins/jobs/oxD_3.1.5/workspace/target/apidocs/org/xdi/oxd/common/response/class-use/GetAuthorizationCodeResponse.html...
Generating /home/tomcat/.jenkins/jobs/oxD_3.1.5/workspace/target/apidocs/org/xdi/oxd/common/response/class-use/ImplicitFlowResponse.html...
Generating /home/tomcat/.jenkins/jobs/oxD_3.1.5/workspace/target/apidocs/org/xdi/oxd/common/response/class-use/RemoveSiteResponse.html...
Generating /home/tomcat/.jenkins/jobs/oxD_3.1.5/workspace/target/apidocs/org/xdi/oxd/common/response/class-use/RsProtectResponse.html...
Generating /home/tomcat/.jenkins/jobs/oxD_3.1.5/workspace/target/apidocs/org/xdi/oxd/common/response/class-use/GetRpResponse.html...
Generating /home/tomcat/.jenkins/jobs/oxD_3.1.5/workspace/target/apidocs/org/xdi/oxd/common/response/class-use/GetTokensByCodeResponse.html...
Generating /home/tomcat/.jenkins/jobs/oxD_3.1.5/workspace/target/apidocs/org/xdi/oxd/common/response/class-use/SetupClientResponse.html...
Generating /home/tomcat/.jenkins/jobs/oxD_3.1.5/workspace/target/apidocs/org/xdi/oxd/common/response/class-use/RsCheckAccessResponse.html...
Generating /home/tomcat/.jenkins/jobs/oxD_3.1.5/workspace/target/apidocs/org/xdi/oxd/client/class-use/CommandClientPool.html...
Generating /home/tomcat/.jenkins/jobs/oxD_3.1.5/workspace/target/apidocs/org/xdi/oxd/client/class-use/ObjectPool.html...
Generating /home/tomcat/.jenkins/jobs/oxD_3.1.5/workspace/target/apidocs/org/xdi/oxd/client/class-use/HttpClient.html...
Generating /home/tomcat/.jenkins/jobs/oxD_3.1.5/workspace/target/apidocs/org/xdi/oxd/client/class-use/HttpClientInterface.html...
Generating /home/tomcat/.jenkins/jobs/oxD_3.1.5/workspace/target/apidocs/org/xdi/oxd/client/class-use/TransportClient.html...
Generating /home/tomcat/.jenkins/jobs/oxD_3.1.5/workspace/target/apidocs/org/xdi/oxd/client/class-use/CommandClient.html...
Generating /home/tomcat/.jenkins/jobs/oxD_3.1.5/workspace/target/apidocs/org/xdi/oxd/server/model/class-use/Pat.html...
Generating /home/tomcat/.jenkins/jobs/oxD_3.1.5/workspace/target/apidocs/org/xdi/oxd/server/model/class-use/UmaResource.html...
Generating /home/tomcat/.jenkins/jobs/oxD_3.1.5/workspace/target/apidocs/org/xdi/oxd/server/model/class-use/UmaToken.html...
Generating /home/tomcat/.jenkins/jobs/oxD_3.1.5/workspace/target/apidocs/org/xdi/oxd/server/model/class-use/UmaTokenFactory.html...
Generating /home/tomcat/.jenkins/jobs/oxD_3.1.5/workspace/target/apidocs/org/xdi/oxd/server/class-use/Cli.html...
Generating /home/tomcat/.jenkins/jobs/oxD_3.1.5/workspace/target/apidocs/org/xdi/oxd/server/class-use/SocketProcessor.html...
Generating /home/tomcat/.jenkins/jobs/oxD_3.1.5/workspace/target/apidocs/org/xdi/oxd/server/class-use/Configuration.html...
Generating /home/tomcat/.jenkins/jobs/oxD_3.1.5/workspace/target/apidocs/org/xdi/oxd/server/class-use/ShutdownException.html...
Generating /home/tomcat/.jenkins/jobs/oxD_3.1.5/workspace/target/apidocs/org/xdi/oxd/server/class-use/Processor.html...
Generating /home/tomcat/.jenkins/jobs/oxD_3.1.5/workspace/target/apidocs/org/xdi/oxd/server/class-use/Utils.html...
Generating /home/tomcat/.jenkins/jobs/oxD_3.1.5/workspace/target/apidocs/org/xdi/oxd/server/class-use/ServerLauncher.html...
Generating /home/tomcat/.jenkins/jobs/oxD_3.1.5/workspace/target/apidocs/org/xdi/oxd/server/class-use/Convertor.html...
Generating /home/tomcat/.jenkins/jobs/oxD_3.1.5/workspace/target/apidocs/org/xdi/oxd/server/op/class-use/UpdateSiteOperation.html...
Generating /home/tomcat/.jenkins/jobs/oxD_3.1.5/workspace/target/apidocs/org/xdi/oxd/server/op/class-use/GetAuthorizationUrlOperation.html...
Generating /home/tomcat/.jenkins/jobs/oxD_3.1.5/workspace/target/apidocs/org/xdi/oxd/server/op/class-use/IntrospectAccessTokenOperation.html...
Generating /home/tomcat/.jenkins/jobs/oxD_3.1.5/workspace/target/apidocs/org/xdi/oxd/server/op/class-use/RsProtectOperation.html...
Generating /home/tomcat/.jenkins/jobs/oxD_3.1.5/workspace/target/apidocs/org/xdi/oxd/server/op/class-use/CheckIdTokenOperation.html...
Generating /home/tomcat/.jenkins/jobs/oxD_3.1.5/workspace/target/apidocs/org/xdi/oxd/server/op/class-use/RpGetRptOperation.html...
Generating /home/tomcat/.jenkins/jobs/oxD_3.1.5/workspace/target/apidocs/org/xdi/oxd/server/op/class-use/GetRpOperation.html...
Generating /home/tomcat/.jenkins/jobs/oxD_3.1.5/workspace/target/apidocs/org/xdi/oxd/server/op/class-use/Validator.html...
Generating /home/tomcat/.jenkins/jobs/oxD_3.1.5/workspace/target/apidocs/org/xdi/oxd/server/op/class-use/GetClientTokenOperation.html...
Generating /home/tomcat/.jenkins/jobs/oxD_3.1.5/workspace/target/apidocs/org/xdi/oxd/server/op/class-use/RsCheckAccessOperation.html...
Generating /home/tomcat/.jenkins/jobs/oxD_3.1.5/workspace/target/apidocs/org/xdi/oxd/server/op/class-use/RegisterSiteOperation.html...
Generating /home/tomcat/.jenkins/jobs/oxD_3.1.5/workspace/target/apidocs/org/xdi/oxd/server/op/class-use/RemoveSiteOperation.html...
Generating /home/tomcat/.jenkins/jobs/oxD_3.1.5/workspace/target/apidocs/org/xdi/oxd/server/op/class-use/OperationFactory.html...
Generating /home/tomcat/.jenkins/jobs/oxD_3.1.5/workspace/target/apidocs/org/xdi/oxd/server/op/class-use/ImplicitFlowOperation.html...
Generating /home/tomcat/.jenkins/jobs/oxD_3.1.5/workspace/target/apidocs/org/xdi/oxd/server/op/class-use/GetAuthorizationCodeOperation.html...
Generating /home/tomcat/.jenkins/jobs/oxD_3.1.5/workspace/target/apidocs/org/xdi/oxd/server/op/class-use/IntrospectRptOperation.html...
Generating /home/tomcat/.jenkins/jobs/oxD_3.1.5/workspace/target/apidocs/org/xdi/oxd/server/op/class-use/ValidateOperation.html...
Generating /home/tomcat/.jenkins/jobs/oxD_3.1.5/workspace/target/apidocs/org/xdi/oxd/server/op/class-use/GetLogoutUrlOperation.html...
Generating /home/tomcat/.jenkins/jobs/oxD_3.1.5/workspace/target/apidocs/org/xdi/oxd/server/op/class-use/CheckAccessTokenOperation.html...
Generating /home/tomcat/.jenkins/jobs/oxD_3.1.5/workspace/target/apidocs/org/xdi/oxd/server/op/class-use/IOperation.html...
Generating /home/tomcat/.jenkins/jobs/oxD_3.1.5/workspace/target/apidocs/org/xdi/oxd/server/op/class-use/SetupClientOperation.html...
Generating /home/tomcat/.jenkins/jobs/oxD_3.1.5/workspace/target/apidocs/org/xdi/oxd/server/op/class-use/GetTokensByCodeOperation.html...
Generating /home/tomcat/.jenkins/jobs/oxD_3.1.5/workspace/target/apidocs/org/xdi/oxd/server/op/class-use/BaseOperation.html...
Generating /home/tomcat/.jenkins/jobs/oxD_3.1.5/workspace/target/apidocs/org/xdi/oxd/server/op/class-use/GetAccessTokenByRefreshTokenOperation.html...
Generating /home/tomcat/.jenkins/jobs/oxD_3.1.5/workspace/target/apidocs/org/xdi/oxd/server/op/class-use/GetUserInfoOperation.html...
Generating /home/tomcat/.jenkins/jobs/oxD_3.1.5/workspace/target/apidocs/org/xdi/oxd/server/op/class-use/LicenseStatusOperation.html...
Generating /home/tomcat/.jenkins/jobs/oxD_3.1.5/workspace/target/apidocs/org/xdi/oxd/server/op/class-use/RpGetGetClaimsGatheringUrlOperation.html...
Generating /home/tomcat/.jenkins/jobs/oxD_3.1.5/workspace/target/apidocs/org/xdi/oxd/server/op/class-use/AuthorizationCodeFlowOperation.html...
Generating /home/tomcat/.jenkins/jobs/oxD_3.1.5/workspace/target/apidocs/org/xdi/oxd/server/introspection/class-use/CorrectRptIntrospectionService.html...
Generating /home/tomcat/.jenkins/jobs/oxD_3.1.5/workspace/target/apidocs/org/xdi/oxd/server/introspection/class-use/BadRptIntrospectionService.html...
Generating /home/tomcat/.jenkins/jobs/oxD_3.1.5/workspace/target/apidocs/org/xdi/oxd/server/introspection/class-use/BackCompatibleIntrospectionService.html...
Generating /home/tomcat/.jenkins/jobs/oxD_3.1.5/workspace/target/apidocs/org/xdi/oxd/server/introspection/class-use/BadRptIntrospectionResponse.html...
Generating /home/tomcat/.jenkins/jobs/oxD_3.1.5/workspace/target/apidocs/org/xdi/oxd/server/introspection/class-use/ClientFactory.html...
Generating /home/tomcat/.jenkins/jobs/oxD_3.1.5/workspace/target/apidocs/org/xdi/oxd/server/introspection/class-use/BackCompatibleIntrospectionResponse.html...
Generating /home/tomcat/.jenkins/jobs/oxD_3.1.5/workspace/target/apidocs/org/xdi/oxd/server/introspection/class-use/BadUmaPermission.html...
Generating /home/tomcat/.jenkins/jobs/oxD_3.1.5/workspace/target/apidocs/org/xdi/oxd/server/license/class-use/LicenseFile.html...
Generating /home/tomcat/.jenkins/jobs/oxD_3.1.5/workspace/target/apidocs/org/xdi/oxd/server/license/class-use/LicenseFile.MacAddress.html...
Generating /home/tomcat/.jenkins/jobs/oxD_3.1.5/workspace/target/apidocs/org/xdi/oxd/server/license/class-use/LicenseFileUpdateService.html...
Generating /home/tomcat/.jenkins/jobs/oxD_3.1.5/workspace/target/apidocs/org/xdi/oxd/server/license/class-use/LicenseService.html...
Generating /home/tomcat/.jenkins/jobs/oxD_3.1.5/workspace/target/apidocs/org/xdi/oxd/server/license/class-use/MacAddressProvider.html...
Generating /home/tomcat/.jenkins/jobs/oxD_3.1.5/workspace/target/apidocs/org/xdi/oxd/server/persistence/class-use/H2Configuration.html...
Generating /home/tomcat/.jenkins/jobs/oxD_3.1.5/workspace/target/apidocs/org/xdi/oxd/server/persistence/class-use/H2PersistenceProvider.html...
Generating /home/tomcat/.jenkins/jobs/oxD_3.1.5/workspace/target/apidocs/org/xdi/oxd/server/persistence/class-use/SqlPersistenceServiceImpl.html...
Generating /home/tomcat/.jenkins/jobs/oxD_3.1.5/workspace/target/apidocs/org/xdi/oxd/server/persistence/class-use/RedisPersistenceService.html...
Generating /home/tomcat/.jenkins/jobs/oxD_3.1.5/workspace/target/apidocs/org/xdi/oxd/server/persistence/class-use/PersistenceService.html...
Generating /home/tomcat/.jenkins/jobs/oxD_3.1.5/workspace/target/apidocs/org/xdi/oxd/server/persistence/class-use/SqlPersistenceProvider.html...
Generating /home/tomcat/.jenkins/jobs/oxD_3.1.5/workspace/target/apidocs/org/xdi/oxd/server/persistence/class-use/PersistenceServiceImpl.html...
Generating /home/tomcat/.jenkins/jobs/oxD_3.1.5/workspace/target/apidocs/org/xdi/oxd/server/guice/class-use/GuiceModule.html...
Generating /home/tomcat/.jenkins/jobs/oxD_3.1.5/workspace/target/apidocs/org/xdi/oxd/server/service/class-use/StateService.html...
Generating /home/tomcat/.jenkins/jobs/oxD_3.1.5/workspace/target/apidocs/org/xdi/oxd/server/service/class-use/Rp.html...
Generating /home/tomcat/.jenkins/jobs/oxD_3.1.5/workspace/target/apidocs/org/xdi/oxd/server/service/class-use/UmaTokenService.html...
Generating /home/tomcat/.jenkins/jobs/oxD_3.1.5/workspace/target/apidocs/org/xdi/oxd/server/service/class-use/HttpService.html...
Generating /home/tomcat/.jenkins/jobs/oxD_3.1.5/workspace/target/apidocs/org/xdi/oxd/server/service/class-use/RpService.html...
Generating /home/tomcat/.jenkins/jobs/oxD_3.1.5/workspace/target/apidocs/org/xdi/oxd/server/service/class-use/TimeService.html...
Generating /home/tomcat/.jenkins/jobs/oxD_3.1.5/workspace/target/apidocs/org/xdi/oxd/server/service/class-use/MigrationService.html...
Generating /home/tomcat/.jenkins/jobs/oxD_3.1.5/workspace/target/apidocs/org/xdi/oxd/server/service/class-use/IntrospectionService.html...
Generating /home/tomcat/.jenkins/jobs/oxD_3.1.5/workspace/target/apidocs/org/xdi/oxd/server/service/class-use/ConfigurationService.html...
Generating /home/tomcat/.jenkins/jobs/oxD_3.1.5/workspace/target/apidocs/org/xdi/oxd/server/service/class-use/SocketService.html...
Generating /home/tomcat/.jenkins/jobs/oxD_3.1.5/workspace/target/apidocs/org/xdi/oxd/server/service/class-use/DiscoveryService.html...
Generating /home/tomcat/.jenkins/jobs/oxD_3.1.5/workspace/target/apidocs/org/xdi/oxd/server/service/class-use/PublicOpKeyService.html...
Generating /home/tomcat/.jenkins/jobs/oxD_3.1.5/workspace/target/apidocs/org/xdi/oxd/server/service/class-use/ValidationService.html...
Generating /home/tomcat/.jenkins/jobs/oxD_3.1.5/workspace/target/apidocs/org/xdi/oxd/rp/client/class-use/RpClientFactory.html...
Generating /home/tomcat/.jenkins/jobs/oxD_3.1.5/workspace/target/apidocs/org/xdi/oxd/rp/client/class-use/HrefDetails.html...
Generating /home/tomcat/.jenkins/jobs/oxD_3.1.5/workspace/target/apidocs/org/xdi/oxd/rp/client/class-use/RpClientUtils.html...
Generating /home/tomcat/.jenkins/jobs/oxD_3.1.5/workspace/target/apidocs/org/xdi/oxd/rp/client/class-use/RpClient.html...
Generating /home/tomcat/.jenkins/jobs/oxD_3.1.5/workspace/target/apidocs/org/xdi/oxd/rp/client/class-use/RpSocketClient.html...
Generating /home/tomcat/.jenkins/jobs/oxD_3.1.5/workspace/target/apidocs/org/gluu/oxd/class-use/OxdHttpsConfiguration.html...
Generating /home/tomcat/.jenkins/jobs/oxD_3.1.5/workspace/target/apidocs/org/gluu/oxd/class-use/RestResource.html...
Generating /home/tomcat/.jenkins/jobs/oxD_3.1.5/workspace/target/apidocs/org/gluu/oxd/class-use/OxdHttpsApplication.html...
Generating /home/tomcat/.jenkins/jobs/oxD_3.1.5/workspace/target/apidocs/org/gluu/oxd/package-use.html...
Generating /home/tomcat/.jenkins/jobs/oxD_3.1.5/workspace/target/apidocs/org/xdi/oxd/client/package-use.html...
Generating /home/tomcat/.jenkins/jobs/oxD_3.1.5/workspace/target/apidocs/org/xdi/oxd/common/package-use.html...
Generating /home/tomcat/.jenkins/jobs/oxD_3.1.5/workspace/target/apidocs/org/xdi/oxd/common/introspection/package-use.html...
Generating /home/tomcat/.jenkins/jobs/oxD_3.1.5/workspace/target/apidocs/org/xdi/oxd/common/params/package-use.html...
Generating /home/tomcat/.jenkins/jobs/oxD_3.1.5/workspace/target/apidocs/org/xdi/oxd/common/response/package-use.html...
Generating /home/tomcat/.jenkins/jobs/oxD_3.1.5/workspace/target/apidocs/org/xdi/oxd/rp/client/package-use.html...
Generating /home/tomcat/.jenkins/jobs/oxD_3.1.5/workspace/target/apidocs/org/xdi/oxd/server/package-use.html...
Generating /home/tomcat/.jenkins/jobs/oxD_3.1.5/workspace/target/apidocs/org/xdi/oxd/server/guice/package-use.html...
Generating /home/tomcat/.jenkins/jobs/oxD_3.1.5/workspace/target/apidocs/org/xdi/oxd/server/introspection/package-use.html...
Generating /home/tomcat/.jenkins/jobs/oxD_3.1.5/workspace/target/apidocs/org/xdi/oxd/server/license/package-use.html...
Generating /home/tomcat/.jenkins/jobs/oxD_3.1.5/workspace/target/apidocs/org/xdi/oxd/server/model/package-use.html...
Generating /home/tomcat/.jenkins/jobs/oxD_3.1.5/workspace/target/apidocs/org/xdi/oxd/server/op/package-use.html...
Generating /home/tomcat/.jenkins/jobs/oxD_3.1.5/workspace/target/apidocs/org/xdi/oxd/server/persistence/package-use.html...
Generating /home/tomcat/.jenkins/jobs/oxD_3.1.5/workspace/target/apidocs/org/xdi/oxd/server/service/package-use.html...
Building index for all the packages and classes...
Generating /home/tomcat/.jenkins/jobs/oxD_3.1.5/workspace/target/apidocs/overview-tree.html...
Generating /home/tomcat/.jenkins/jobs/oxD_3.1.5/workspace/target/apidocs/index-all.html...
Generating /home/tomcat/.jenkins/jobs/oxD_3.1.5/workspace/target/apidocs/deprecated-list.html...
Building index for all classes...
Generating /home/tomcat/.jenkins/jobs/oxD_3.1.5/workspace/target/apidocs/allclasses-frame.html...
Generating /home/tomcat/.jenkins/jobs/oxD_3.1.5/workspace/target/apidocs/allclasses-noframe.html...
Generating /home/tomcat/.jenkins/jobs/oxD_3.1.5/workspace/target/apidocs/index.html...
Generating /home/tomcat/.jenkins/jobs/oxD_3.1.5/workspace/target/apidocs/overview-summary.html...
Generating /home/tomcat/.jenkins/jobs/oxD_3.1.5/workspace/target/apidocs/help-doc.html...
100 warnings
[WARNING] Javadoc Warnings
[WARNING] /home/tomcat/.jenkins/jobs/oxD_3.1.5/workspace/oxd-https-extension/src/main/java/org/gluu/oxd/OxdHttpsConfiguration.java:3: error: package com.fasterxml.jackson.annotation does not exist
[WARNING] import com.fasterxml.jackson.annotation.JsonIgnoreProperties;
[WARNING] ^
[WARNING] /home/tomcat/.jenkins/jobs/oxD_3.1.5/workspace/oxd-https-extension/src/main/java/org/gluu/oxd/OxdHttpsConfiguration.java:4: error: package com.fasterxml.jackson.annotation does not exist
[WARNING] import com.fasterxml.jackson.annotation.JsonProperty;
[WARNING] ^
[WARNING] /home/tomcat/.jenkins/jobs/oxD_3.1.5/workspace/oxd-https-extension/src/main/java/org/gluu/oxd/OxdHttpsConfiguration.java:5: error: package io.dropwizard does not exist
[WARNING] import io.dropwizard.Configuration;
[WARNING] ^
[WARNING] /home/tomcat/.jenkins/jobs/oxD_3.1.5/workspace/oxd-https-extension/src/main/java/org/gluu/oxd/OxdHttpsConfiguration.java:6: error: package org.hibernate.validator.constraints does not exist
[WARNING] import org.hibernate.validator.constraints.NotEmpty;
[WARNING] ^
[WARNING] /home/tomcat/.jenkins/jobs/oxD_3.1.5/workspace/oxd-https-extension/src/main/java/org/gluu/oxd/OxdHttpsConfiguration.java:9: error: cannot find symbol
[WARNING] public class OxdHttpsConfiguration extends Configuration {
[WARNING] ^
[WARNING] symbol: class Configuration
[WARNING] /home/tomcat/.jenkins/jobs/oxD_3.1.5/workspace/oxd-https-extension/src/main/java/org/gluu/oxd/OxdHttpsConfiguration.java:8: error: cannot find symbol
[WARNING] @JsonIgnoreProperties(ignoreUnknown = true)
[WARNING] ^
[WARNING] symbol: class JsonIgnoreProperties
[WARNING] /home/tomcat/.jenkins/jobs/oxD_3.1.5/workspace/oxd-https-extension/src/main/java/org/gluu/oxd/OxdHttpsApplication.java:3: error: package com.codahale.metrics.health does not exist
[WARNING] import com.codahale.metrics.health.HealthCheck;
[WARNING] ^
[WARNING] /home/tomcat/.jenkins/jobs/oxD_3.1.5/workspace/oxd-https-extension/src/main/java/org/gluu/oxd/OxdHttpsApplication.java:4: error: package io.dropwizard does not exist
[WARNING] import io.dropwizard.Application;
[WARNING] ^
[WARNING] /home/tomcat/.jenkins/jobs/oxD_3.1.5/workspace/oxd-https-extension/src/main/java/org/gluu/oxd/OxdHttpsApplication.java:5: error: package io.dropwizard.configuration does not exist
[WARNING] import io.dropwizard.configuration.EnvironmentVariableSubstitutor;
[WARNING] ^
[WARNING] /home/tomcat/.jenkins/jobs/oxD_3.1.5/workspace/oxd-https-extension/src/main/java/org/gluu/oxd/OxdHttpsApplication.java:6: error: package io.dropwizard.configuration does not exist
[WARNING] import io.dropwizard.configuration.SubstitutingSourceProvider;
[WARNING] ^
[WARNING] /home/tomcat/.jenkins/jobs/oxD_3.1.5/workspace/oxd-https-extension/src/main/java/org/gluu/oxd/OxdHttpsApplication.java:7: error: package io.dropwizard.setup does not exist
[WARNING] import io.dropwizard.setup.Bootstrap;
[WARNING] ^
[WARNING] /home/tomcat/.jenkins/jobs/oxD_3.1.5/workspace/oxd-https-extension/src/main/java/org/gluu/oxd/OxdHttpsApplication.java:8: error: package io.dropwizard.setup does not exist
[WARNING] import io.dropwizard.setup.Environment;
[WARNING] ^
[WARNING] /home/tomcat/.jenkins/jobs/oxD_3.1.5/workspace/oxd-https-extension/src/main/java/org/gluu/oxd/OxdHttpsApplication.java:9: error: package org.glassfish.jersey.server.filter does not exist
[WARNING] import org.glassfish.jersey.server.filter.RolesAllowedDynamicFeature;
[WARNING] ^
[WARNING] /home/tomcat/.jenkins/jobs/oxD_3.1.5/workspace/oxd-https-extension/src/main/java/org/gluu/oxd/OxdHttpsApplication.java:13: error: cannot find symbol
[WARNING] public class OxdHttpsApplication extends Application<OxdHttpsConfiguration> {
[WARNING] ^
[WARNING] symbol: class Application
[WARNING] /home/tomcat/.jenkins/jobs/oxD_3.1.5/workspace/oxd-https-extension/src/main/java/org/gluu/oxd/OxdHttpsApplication.java:27: error: cannot find symbol
[WARNING] public void initialize(Bootstrap<OxdHttpsConfiguration> bootstrap) {
[WARNING] ^
[WARNING] symbol:   class Bootstrap
[WARNING] location: class OxdHttpsApplication
[WARNING] /home/tomcat/.jenkins/jobs/oxD_3.1.5/workspace/oxd-https-extension/src/main/java/org/gluu/oxd/OxdHttpsApplication.java:33: error: cannot find symbol
[WARNING] public void run(OxdHttpsConfiguration configuration, Environment environment) {
[WARNING] ^
[WARNING] symbol:   class Environment
[WARNING] location: class OxdHttpsApplication
[WARNING] /home/tomcat/.jenkins/jobs/oxD_3.1.5/workspace/oxd-https-extension/src/main/java/org/gluu/oxd/OxdHttpsConfiguration.java:11: error: cannot find symbol
[WARNING] @JsonProperty
[WARNING] ^
[WARNING] symbol:   class JsonProperty
[WARNING] location: class OxdHttpsConfiguration
[WARNING] /home/tomcat/.jenkins/jobs/oxD_3.1.5/workspace/oxd-https-extension/src/main/java/org/gluu/oxd/OxdHttpsConfiguration.java:12: error: cannot find symbol
[WARNING] @NotEmpty
[WARNING] ^
[WARNING] symbol:   class NotEmpty
[WARNING] location: class OxdHttpsConfiguration
[WARNING] /home/tomcat/.jenkins/jobs/oxD_3.1.5/workspace/oxd-https-extension/src/main/java/org/gluu/oxd/OxdHttpsConfiguration.java:14: error: cannot find symbol
[WARNING] @JsonProperty
[WARNING] ^
[WARNING] symbol:   class JsonProperty
[WARNING] location: class OxdHttpsConfiguration
[WARNING] /home/tomcat/.jenkins/jobs/oxD_3.1.5/workspace/oxd-https-extension/src/main/java/org/gluu/oxd/OxdHttpsConfiguration.java:15: error: cannot find symbol
[WARNING] @NotEmpty
[WARNING] ^
[WARNING] symbol:   class NotEmpty
[WARNING] location: class OxdHttpsConfiguration
[WARNING] /home/tomcat/.jenkins/jobs/oxD_3.1.5/workspace/oxd-https-extension/src/main/java/org/gluu/oxd/OxdHttpsConfiguration.java:17: error: cannot find symbol
[WARNING] @JsonProperty
[WARNING] ^
[WARNING] symbol:   class JsonProperty
[WARNING] location: class OxdHttpsConfiguration
[WARNING] /home/tomcat/.jenkins/jobs/oxD_3.1.5/workspace/oxd-https-extension/src/main/java/org/gluu/oxd/OxdHttpsConfiguration.java:19: error: cannot find symbol
[WARNING] @JsonProperty
[WARNING] ^
[WARNING] symbol:   class JsonProperty
[WARNING] location: class OxdHttpsConfiguration
[WARNING] /home/tomcat/.jenkins/jobs/oxD_3.1.5/workspace/oxd-https-extension/src/main/java/org/gluu/oxd/OxdHttpsConfiguration.java:20: error: cannot find symbol
[WARNING] @NotEmpty
[WARNING] ^
[WARNING] symbol:   class NotEmpty
[WARNING] location: class OxdHttpsConfiguration
[WARNING] /home/tomcat/.jenkins/jobs/oxD_3.1.5/workspace/oxd-https-extension/src/main/java/org/gluu/oxd/OxdHttpsConfiguration.java:22: error: cannot find symbol
[WARNING] @JsonProperty
[WARNING] ^
[WARNING] symbol:   class JsonProperty
[WARNING] location: class OxdHttpsConfiguration
[WARNING] /home/tomcat/.jenkins/jobs/oxD_3.1.5/workspace/oxd-https-extension/src/main/java/org/gluu/oxd/OxdHttpsConfiguration.java:23: error: cannot find symbol
[WARNING] @NotEmpty
[WARNING] ^
[WARNING] symbol:   class NotEmpty
[WARNING] location: class OxdHttpsConfiguration
[WARNING] /home/tomcat/.jenkins/jobs/oxD_3.1.5/workspace/oxd-https-extension/src/main/java/org/gluu/oxd/OxdHttpsConfiguration.java:25: error: cannot find symbol
[WARNING] @JsonProperty
[WARNING] ^
[WARNING] symbol:   class JsonProperty
[WARNING] location: class OxdHttpsConfiguration
[WARNING] /home/tomcat/.jenkins/jobs/oxD_3.1.5/workspace/oxd-https-extension/src/main/java/org/gluu/oxd/OxdHttpsConfiguration.java:26: error: cannot find symbol
[WARNING] @NotEmpty
[WARNING] ^
[WARNING] symbol:   class NotEmpty
[WARNING] location: class OxdHttpsConfiguration
[WARNING] /home/tomcat/.jenkins/jobs/oxD_3.1.5/workspace/oxd-https-extension/src/main/java/org/gluu/oxd/OxdHttpsConfiguration.java:28: error: cannot find symbol
[WARNING] @JsonProperty
[WARNING] ^
[WARNING] symbol:   class JsonProperty
[WARNING] location: class OxdHttpsConfiguration
[WARNING] /home/tomcat/.jenkins/jobs/oxD_3.1.5/workspace/oxd-https-extension/src/main/java/org/gluu/oxd/OxdHttpsConfiguration.java:29: error: cannot find symbol
[WARNING] @NotEmpty
[WARNING] ^
[WARNING] symbol:   class NotEmpty
[WARNING] location: class OxdHttpsConfiguration
[WARNING] /home/tomcat/.jenkins/jobs/oxD_3.1.5/workspace/oxd-https-extension/src/main/java/org/gluu/oxd/OxdHttpsConfiguration.java:31: error: cannot find symbol
[WARNING] @JsonProperty
[WARNING] ^
[WARNING] symbol:   class JsonProperty
[WARNING] location: class OxdHttpsConfiguration
[WARNING] /home/tomcat/.jenkins/jobs/oxD_3.1.5/workspace/oxd-https-extension/src/main/java/org/gluu/oxd/OxdHttpsConfiguration.java:32: error: cannot find symbol
[WARNING] @NotEmpty
[WARNING] ^
[WARNING] symbol:   class NotEmpty
[WARNING] location: class OxdHttpsConfiguration
[WARNING] /home/tomcat/.jenkins/jobs/oxD_3.1.5/workspace/oxd-https-extension/src/main/java/org/gluu/oxd/OxdHttpsConfiguration.java:34: error: cannot find symbol
[WARNING] @JsonProperty
[WARNING] ^
[WARNING] symbol:   class JsonProperty
[WARNING] location: class OxdHttpsConfiguration
[WARNING] /home/tomcat/.jenkins/jobs/oxD_3.1.5/workspace/oxd-https-extension/src/main/java/org/gluu/oxd/OxdHttpsConfiguration.java:35: error: cannot find symbol
[WARNING] @NotEmpty
[WARNING] ^
[WARNING] symbol:   class NotEmpty
[WARNING] location: class OxdHttpsConfiguration
[WARNING] /home/tomcat/.jenkins/jobs/oxD_3.1.5/workspace/oxd-https-extension/src/main/java/org/gluu/oxd/OxdHttpsConfiguration.java:37: error: cannot find symbol
[WARNING] @JsonProperty
[WARNING] ^
[WARNING] symbol:   class JsonProperty
[WARNING] location: class OxdHttpsConfiguration
[WARNING] /home/tomcat/.jenkins/jobs/oxD_3.1.5/workspace/oxd-https-extension/src/main/java/org/gluu/oxd/OxdHttpsConfiguration.java:38: error: cannot find symbol
[WARNING] @NotEmpty
[WARNING] ^
[WARNING] symbol:   class NotEmpty
[WARNING] location: class OxdHttpsConfiguration
[WARNING] /home/tomcat/.jenkins/jobs/oxD_3.1.5/workspace/oxd-common/src/main/java/org/xdi/oxd/common/CoreUtils.java:237: warning: no description for @throws
[WARNING] * @throws Exception
[WARNING] ^
[WARNING] /home/tomcat/.jenkins/jobs/oxD_3.1.5/workspace/oxd-server/src/main/java/org/xdi/oxd/server/Convertor.java:37: warning: no @param for command
[WARNING] public static <T extends IParams> T asParams(Class<T> clazz, Command command) {
[WARNING] ^
[WARNING] /home/tomcat/.jenkins/jobs/oxD_3.1.5/workspace/oxd-server/src/main/java/org/xdi/oxd/server/op/IOperation.java:23: warning: no @param for params
[WARNING] public CommandResponse execute(T params) throws Exception;
[WARNING] ^
[WARNING] /home/tomcat/.jenkins/jobs/oxD_3.1.5/workspace/oxd-server/src/main/java/org/xdi/oxd/server/op/IOperation.java:23: warning: no @throws for java.lang.Exception
[WARNING] public CommandResponse execute(T params) throws Exception;
[WARNING] ^
[WARNING] /home/tomcat/.jenkins/jobs/oxD_3.1.5/workspace/oxd-server/src/main/java/org/xdi/oxd/server/op/BaseOperation.java:47: warning: no @param for injector
[WARNING] protected BaseOperation(Command command, final Injector injector, Class<T> parameterClass) {
[WARNING] ^
[WARNING] /home/tomcat/.jenkins/jobs/oxD_3.1.5/workspace/oxd-server/src/main/java/org/xdi/oxd/server/op/BaseOperation.java:47: warning: no @param for parameterClass
[WARNING] protected BaseOperation(Command command, final Injector injector, Class<T> parameterClass) {
[WARNING] ^
[WARNING] /home/tomcat/.jenkins/jobs/oxD_3.1.5/workspace/oxd-server/src/main/java/org/xdi/oxd/server/op/GetAccessTokenByRefreshTokenOperation.java:33: warning: no @param for injector
[WARNING] protected GetAccessTokenByRefreshTokenOperation(Command command, final Injector injector) {
[WARNING] ^
[WARNING] /home/tomcat/.jenkins/jobs/oxD_3.1.5/workspace/oxd-server/src/main/java/org/xdi/oxd/server/op/GetAuthorizationCodeOperation.java:37: warning: no @param for injector
[WARNING] protected GetAuthorizationCodeOperation(Command p_command, final Injector injector) {
[WARNING] ^
[WARNING] /home/tomcat/.jenkins/jobs/oxD_3.1.5/workspace/oxd-server/src/main/java/org/xdi/oxd/server/op/GetAuthorizationUrlOperation.java:34: warning: no @param for injector
[WARNING] protected GetAuthorizationUrlOperation(Command command, final Injector injector) {
[WARNING] ^
[WARNING] /home/tomcat/.jenkins/jobs/oxD_3.1.5/workspace/oxd-server/src/main/java/org/xdi/oxd/server/op/GetClientTokenOperation.java:39: warning: no @param for injector
[WARNING] protected GetClientTokenOperation(Command command, final Injector injector) {
[WARNING] ^
[WARNING] /home/tomcat/.jenkins/jobs/oxD_3.1.5/workspace/oxd-server/src/main/java/org/xdi/oxd/server/op/GetLogoutUrlOperation.java:35: warning: no @param for injector
[WARNING] protected GetLogoutUrlOperation(Command command, final Injector injector) {
[WARNING] ^
[WARNING] /home/tomcat/.jenkins/jobs/oxD_3.1.5/workspace/oxd-server/src/main/java/org/xdi/oxd/server/op/GetTokensByCodeOperation.java:37: warning: no @param for injector
[WARNING] protected GetTokensByCodeOperation(Command command, final Injector injector) {
[WARNING] ^
[WARNING] /home/tomcat/.jenkins/jobs/oxD_3.1.5/workspace/oxd-server/src/main/java/org/xdi/oxd/server/op/GetUserInfoOperation.java:25: warning: no @param for injector
[WARNING] protected GetUserInfoOperation(Command command, final Injector injector) {
[WARNING] ^
[WARNING] /home/tomcat/.jenkins/jobs/oxD_3.1.5/workspace/oxd-server/src/main/java/org/xdi/oxd/server/op/RegisterSiteOperation.java:56: warning: no @param for injector
[WARNING] protected RegisterSiteOperation(Command command, final Injector injector) {
[WARNING] ^
[WARNING] /home/tomcat/.jenkins/jobs/oxD_3.1.5/workspace/oxd-server/src/main/java/org/xdi/oxd/server/op/RsCheckAccessOperation.java:41: warning: no @param for injector
[WARNING] protected RsCheckAccessOperation(Command command, final Injector injector) {
[WARNING] ^
[WARNING] /home/tomcat/.jenkins/jobs/oxD_3.1.5/workspace/oxd-server/src/main/java/org/xdi/oxd/server/op/SetupClientOperation.java:34: warning: no @param for injector
[WARNING] protected SetupClientOperation(Command command, final Injector injector) {
[WARNING] ^
[WARNING] /home/tomcat/.jenkins/jobs/oxD_3.1.5/workspace/oxd-server/src/main/java/org/xdi/oxd/server/op/UpdateSiteOperation.java:42: warning: no @param for injector
[WARNING] protected UpdateSiteOperation(Command command, final Injector injector) {
[WARNING] ^
[WARNING] /home/tomcat/.jenkins/jobs/oxD_3.1.5/workspace/oxd-server/src/main/java/org/xdi/oxd/server/op/ValidateOperation.java:26: warning: no @param for injector
[WARNING] protected ValidateOperation(Command command, final Injector injector) {
[WARNING] ^
[WARNING] /home/tomcat/.jenkins/jobs/oxD_3.1.5/workspace/oxd-server/src/main/java/org/xdi/oxd/server/service/SocketService.java:54: warning: no @param for conf
[WARNING] public SocketService(Configuration conf, HttpService httpService, TimeService timeService) {
[WARNING] ^
[WARNING] /home/tomcat/.jenkins/jobs/oxD_3.1.5/workspace/oxd-server/src/main/java/org/xdi/oxd/server/service/SocketService.java:54: warning: no @param for httpService
[WARNING] public SocketService(Configuration conf, HttpService httpService, TimeService timeService) {
[WARNING] ^
[WARNING] /home/tomcat/.jenkins/jobs/oxD_3.1.5/workspace/oxd-server/src/main/java/org/xdi/oxd/server/service/SocketService.java:54: warning: no @param for timeService
[WARNING] public SocketService(Configuration conf, HttpService httpService, TimeService timeService) {
[WARNING] ^
[WARNING] javadoc: warning - Class JsonIgnoreProperties not found.
[WARNING] javadoc: warning - Class JsonIgnoreProperties not found.
[WARNING] javadoc: warning - Class JsonIgnoreProperties not found.
[WARNING] javadoc: warning - Class JsonIgnoreProperties not found.
[WARNING] javadoc: warning - Class JsonIgnoreProperties not found.
[WARNING] javadoc: warning - Class JsonIgnoreProperties not found.
[WARNING] javadoc: warning - Class JsonIgnoreProperties not found.
[WARNING] javadoc: warning - Class JsonIgnoreProperties not found.
[WARNING] javadoc: warning - Class JsonIgnoreProperties not found.
[WARNING] javadoc: warning - Class JsonIgnoreProperties not found.
[WARNING] javadoc: warning - Class JsonIgnoreProperties not found.
[WARNING] javadoc: warning - Class JsonIgnoreProperties not found.
[WARNING] javadoc: warning - Class JsonIgnoreProperties not found.
[WARNING] javadoc: warning - Class JsonIgnoreProperties not found.
[WARNING] javadoc: warning - Class JsonIgnoreProperties not found.
[WARNING] javadoc: warning - Class JsonIgnoreProperties not found.
[WARNING] javadoc: warning - Class JsonIgnoreProperties not found.
[WARNING] javadoc: warning - Class JsonIgnoreProperties not found.
[WARNING] javadoc: warning - Class JsonIgnoreProperties not found.
[WARNING] javadoc: warning - Class JsonIgnoreProperties not found.
[WARNING] javadoc: warning - Class JsonIgnoreProperties not found.
[WARNING] javadoc: warning - Class JsonIgnoreProperties not found.
[WARNING] javadoc: warning - Class JsonIgnoreProperties not found.
[WARNING] javadoc: warning - Class JsonIgnoreProperties not found.
[WARNING] javadoc: warning - Class JsonIgnoreProperties not found.
[WARNING] javadoc: warning - Class JsonIgnoreProperties not found.
[WARNING] javadoc: warning - Class JsonIgnoreProperties not found.
[WARNING] javadoc: warning - Class JsonIgnoreProperties not found.
[WARNING] javadoc: warning - Class JsonIgnoreProperties not found.
[WARNING] javadoc: warning - Class JsonIgnoreProperties not found.
[WARNING] javadoc: warning - Class JsonIgnoreProperties not found.
[WARNING] javadoc: warning - Class JsonIgnoreProperties not found.
[WARNING] javadoc: warning - Class JsonIgnoreProperties not found.
[WARNING] javadoc: warning - Class JsonIgnoreProperties not found.
[WARNING] javadoc: warning - Class JsonIgnoreProperties not found.
[WARNING] javadoc: warning - Class JsonIgnoreProperties not found.
[WARNING] javadoc: warning - Class JsonIgnoreProperties not found.
[WARNING] javadoc: warning - Class JsonIgnoreProperties not found.
[WARNING] javadoc: warning - Class JsonIgnoreProperties not found.
[WARNING] javadoc: warning - Class JsonIgnoreProperties not found.
[WARNING] javadoc: warning - Class JsonIgnoreProperties not found.
[WARNING] javadoc: warning - Class JsonIgnoreProperties not found.
[WARNING] javadoc: warning - Class JsonIgnoreProperties not found.
[WARNING] javadoc: warning - Class JsonIgnoreProperties not found.
[INFO] Building jar: /home/tomcat/.jenkins/jobs/oxD_3.1.5/workspace/target/oxd-3.1.5-SNAPSHOT-javadoc.jar
[INFO]                                                                         
[INFO] ------------------------------------------------------------------------
[INFO] Building oxD 3.1.5-SNAPSHOT
[INFO] ------------------------------------------------------------------------
[INFO] 
[INFO] --- maven-install-plugin:2.3.1:install (default-install) @ oxd ---
[INFO] Installing /home/tomcat/.jenkins/jobs/oxD_3.1.5/workspace/pom.xml to /var/www/html/maven/org/xdi/oxd/3.1.5-SNAPSHOT/oxd-3.1.5-SNAPSHOT.pom
[INFO] Installing /home/tomcat/.jenkins/jobs/oxD_3.1.5/workspace/target/oxd-3.1.5-SNAPSHOT-javadoc.jar to /var/www/html/maven/org/xdi/oxd/3.1.5-SNAPSHOT/oxd-3.1.5-SNAPSHOT-javadoc.jar
[INFO]                                                                         
[INFO] ------------------------------------------------------------------------
[INFO] Building oxD Common 3.1.5-SNAPSHOT
[INFO] ------------------------------------------------------------------------
[INFO] 
[INFO] --- maven-resources-plugin:2.4:resources (default-resources) @ oxd-common ---
[INFO] Using 'UTF-8' encoding to copy filtered resources.
[INFO] skip non existing resourceDirectory /home/tomcat/.jenkins/jobs/oxD_3.1.5/workspace/oxd-common/src/main/resources
[INFO] 
[INFO] --- maven-compiler-plugin:2.3.2:compile (default-compile) @ oxd-common ---
[INFO] Nothing to compile - all classes are up to date
[INFO] 
[INFO] --- maven-resources-plugin:2.4:testResources (default-testResources) @ oxd-common ---
[INFO] Using 'UTF-8' encoding to copy filtered resources.
[INFO] Copying 1 resource
[INFO] 
[INFO] --- maven-compiler-plugin:2.3.2:testCompile (default-testCompile) @ oxd-common ---
[INFO] Compiling 2 source files to /home/tomcat/.jenkins/jobs/oxD_3.1.5/workspace/oxd-common/target/test-classes
[INFO] 
[INFO] --- maven-surefire-plugin:2.12.4:test (default-test) @ oxd-common ---
[INFO] Surefire report directory: /home/tomcat/.jenkins/jobs/oxD_3.1.5/workspace/oxd-common/target/surefire-reports

-------------------------------------------------------
 T E S T S
-------------------------------------------------------
Running TestSuite
Tests run: 1, Failures: 0, Errors: 0, Skipped: 0, Time elapsed: 0.004 sec

Results :

Tests run: 1, Failures: 0, Errors: 0, Skipped: 0

[INFO] 
[INFO] --- maven-jar-plugin:2.4:jar (default-jar) @ oxd-common ---
[INFO] Building jar: /home/tomcat/.jenkins/jobs/oxD_3.1.5/workspace/oxd-common/target/oxd-common.jar
[INFO] 
[INFO] --- maven-jar-plugin:2.4:test-jar (default) @ oxd-common ---
[INFO] Building jar: /home/tomcat/.jenkins/jobs/oxD_3.1.5/workspace/oxd-common/target/oxd-common-tests.jar
[INFO] 
[INFO] >>> maven-source-plugin:2.1.2:jar (attach-sources) > generate-sources @ oxd-common >>>
[INFO] 
[INFO] <<< maven-source-plugin:2.1.2:jar (attach-sources) < generate-sources @ oxd-common <<<
[INFO] 
[INFO] --- maven-source-plugin:2.1.2:jar (attach-sources) @ oxd-common ---
[INFO] Building jar: /home/tomcat/.jenkins/jobs/oxD_3.1.5/workspace/oxd-common/target/oxd-common-sources.jar
[INFO] 
[INFO] --- maven-install-plugin:2.3.1:install (default-install) @ oxd-common ---
[INFO] Installing /home/tomcat/.jenkins/jobs/oxD_3.1.5/workspace/oxd-common/target/oxd-common.jar to /var/www/html/maven/org/xdi/oxd-common/3.1.5-SNAPSHOT/oxd-common-3.1.5-SNAPSHOT.jar
[INFO] Installing /home/tomcat/.jenkins/jobs/oxD_3.1.5/workspace/oxd-common/pom.xml to /var/www/html/maven/org/xdi/oxd-common/3.1.5-SNAPSHOT/oxd-common-3.1.5-SNAPSHOT.pom
[INFO] Installing /home/tomcat/.jenkins/jobs/oxD_3.1.5/workspace/oxd-common/target/oxd-common-tests.jar to /var/www/html/maven/org/xdi/oxd-common/3.1.5-SNAPSHOT/oxd-common-3.1.5-SNAPSHOT-tests.jar
[INFO] Installing /home/tomcat/.jenkins/jobs/oxD_3.1.5/workspace/oxd-common/target/oxd-common-sources.jar to /var/www/html/maven/org/xdi/oxd-common/3.1.5-SNAPSHOT/oxd-common-3.1.5-SNAPSHOT-sources.jar
[INFO]                                                                         
[INFO] ------------------------------------------------------------------------
[INFO] Building oxD Client 3.1.5-SNAPSHOT
[INFO] ------------------------------------------------------------------------
[INFO] 
[INFO] --- maven-resources-plugin:2.4:resources (default-resources) @ oxd-client ---
[INFO] Using 'UTF-8' encoding to copy filtered resources.
[INFO] Copying 1 resource
[INFO] 
[INFO] --- maven-compiler-plugin:2.3.2:compile (default-compile) @ oxd-client ---
[INFO] Nothing to compile - all classes are up to date
[INFO] 
[INFO] --- maven-resources-plugin:2.4:testResources (default-testResources) @ oxd-client ---
[INFO] Using 'UTF-8' encoding to copy filtered resources.
[INFO] Copying 7 resources
[INFO] 
[INFO] --- maven-compiler-plugin:2.3.2:testCompile (default-testCompile) @ oxd-client ---
[INFO] Compiling 31 source files to /home/tomcat/.jenkins/jobs/oxD_3.1.5/workspace/oxd-client/target/test-classes
[INFO] 
[INFO] --- maven-surefire-plugin:2.12.4:test (default-test) @ oxd-client ---
[INFO] Tests are skipped.
[INFO] 
[INFO] --- maven-jar-plugin:2.4:jar (default-jar) @ oxd-client ---
[INFO] Building jar: /home/tomcat/.jenkins/jobs/oxD_3.1.5/workspace/oxd-client/target/oxd-client.jar
[INFO] 
[INFO] --- maven-jar-plugin:2.4:test-jar (default) @ oxd-client ---
[INFO] Building jar: /home/tomcat/.jenkins/jobs/oxD_3.1.5/workspace/oxd-client/target/oxd-client-tests.jar
[INFO] 
[INFO] >>> maven-source-plugin:2.1.2:jar (attach-sources) > generate-sources @ oxd-client >>>
[INFO] 
[INFO] <<< maven-source-plugin:2.1.2:jar (attach-sources) < generate-sources @ oxd-client <<<
[INFO] 
[INFO] --- maven-source-plugin:2.1.2:jar (attach-sources) @ oxd-client ---
[INFO] Building jar: /home/tomcat/.jenkins/jobs/oxD_3.1.5/workspace/oxd-client/target/oxd-client-sources.jar
[INFO] 
[INFO] --- maven-install-plugin:2.3.1:install (default-install) @ oxd-client ---
[INFO] Installing /home/tomcat/.jenkins/jobs/oxD_3.1.5/workspace/oxd-client/target/oxd-client.jar to /var/www/html/maven/org/xdi/oxd-client/3.1.5-SNAPSHOT/oxd-client-3.1.5-SNAPSHOT.jar
[INFO] Installing /home/tomcat/.jenkins/jobs/oxD_3.1.5/workspace/oxd-client/pom.xml to /var/www/html/maven/org/xdi/oxd-client/3.1.5-SNAPSHOT/oxd-client-3.1.5-SNAPSHOT.pom
[INFO] Installing /home/tomcat/.jenkins/jobs/oxD_3.1.5/workspace/oxd-client/target/oxd-client-tests.jar to /var/www/html/maven/org/xdi/oxd-client/3.1.5-SNAPSHOT/oxd-client-3.1.5-SNAPSHOT-tests.jar
[INFO] Installing /home/tomcat/.jenkins/jobs/oxD_3.1.5/workspace/oxd-client/target/oxd-client-sources.jar to /var/www/html/maven/org/xdi/oxd-client/3.1.5-SNAPSHOT/oxd-client-3.1.5-SNAPSHOT-sources.jar
[INFO]                                                                         
[INFO] ------------------------------------------------------------------------
[INFO] Building oxD Server 3.1.5-SNAPSHOT
[INFO] ------------------------------------------------------------------------
[INFO] 
[INFO] --- git-commit-id-plugin:2.1.12:revision (get-the-git-infos) @ oxd-server ---
[INFO] 
[INFO] --- maven-resources-plugin:2.4:resources (default-resources) @ oxd-server ---
[INFO] Using 'UTF-8' encoding to copy filtered resources.
[INFO] Copying 3 resources
[INFO] 
[INFO] --- maven-compiler-plugin:2.3.2:compile (default-compile) @ oxd-server ---
[INFO] Nothing to compile - all classes are up to date
[INFO] 
[INFO] --- maven-resources-plugin:2.4:testResources (default-testResources) @ oxd-server ---
[INFO] Using 'UTF-8' encoding to copy filtered resources.
[INFO] Copying 7 resources
[INFO] 
[INFO] --- maven-compiler-plugin:2.3.2:testCompile (default-testCompile) @ oxd-server ---
[INFO] Compiling 9 source files to /home/tomcat/.jenkins/jobs/oxD_3.1.5/workspace/oxd-server/target/test-classes
[INFO] 
[INFO] --- maven-surefire-plugin:2.12.4:test (default-test) @ oxd-server ---
[INFO] Surefire report directory: /home/tomcat/.jenkins/jobs/oxD_3.1.5/workspace/oxd-server/target/surefire-reports

-------------------------------------------------------
 T E S T S
-------------------------------------------------------
Running TestSuite
Running beforeSuite ...
log4j:ERROR setFile(null,true) call failed.
java.io.FileNotFoundException: /var/log/oxd-server/oxd-server.log (No such file or directory)
	at java.io.FileOutputStream.open0(Native Method)
	at java.io.FileOutputStream.open(FileOutputStream.java:270)
	at java.io.FileOutputStream.<init>(FileOutputStream.java:213)
	at java.io.FileOutputStream.<init>(FileOutputStream.java:133)
	at org.apache.log4j.FileAppender.setFile(FileAppender.java:294)
	at org.apache.log4j.FileAppender.activateOptions(FileAppender.java:165)
	at org.apache.log4j.DailyRollingFileAppender.activateOptions(DailyRollingFileAppender.java:223)
	at org.apache.log4j.config.PropertySetter.activate(PropertySetter.java:307)
	at org.apache.log4j.xml.DOMConfigurator.parseAppender(DOMConfigurator.java:295)
	at org.apache.log4j.xml.DOMConfigurator.findAppenderByName(DOMConfigurator.java:176)
	at org.apache.log4j.xml.DOMConfigurator.findAppenderByReference(DOMConfigurator.java:191)
	at org.apache.log4j.xml.DOMConfigurator.parseChildrenOfLoggerElement(DOMConfigurator.java:523)
	at org.apache.log4j.xml.DOMConfigurator.parseRoot(DOMConfigurator.java:492)
	at org.apache.log4j.xml.DOMConfigurator.parse(DOMConfigurator.java:1001)
	at org.apache.log4j.xml.DOMConfigurator.doConfigure(DOMConfigurator.java:867)
	at org.apache.log4j.xml.DOMConfigurator.doConfigure(DOMConfigurator.java:773)
	at org.apache.log4j.helpers.OptionConverter.selectAndConfigure(OptionConverter.java:483)
	at org.apache.log4j.LogManager.<clinit>(LogManager.java:127)
	at org.slf4j.impl.Log4jLoggerFactory.<init>(Log4jLoggerFactory.java:66)
	at org.slf4j.impl.StaticLoggerBinder.<init>(StaticLoggerBinder.java:72)
	at org.slf4j.impl.StaticLoggerBinder.<clinit>(StaticLoggerBinder.java:45)
	at org.slf4j.LoggerFactory.bind(LoggerFactory.java:150)
	at org.slf4j.LoggerFactory.performInitialization(LoggerFactory.java:124)
	at org.slf4j.LoggerFactory.getILoggerFactory(LoggerFactory.java:412)
	at org.slf4j.LoggerFactory.getLogger(LoggerFactory.java:357)
	at org.slf4j.LoggerFactory.getLogger(LoggerFactory.java:383)
	at org.xdi.oxd.server.ServerLauncher.<clinit>(ServerLauncher.java:41)
	at org.xdi.oxd.server.SetUpTest.beforeSuite(SetUpTest.java:25)
	at sun.reflect.NativeMethodAccessorImpl.invoke0(Native Method)
	at sun.reflect.NativeMethodAccessorImpl.invoke(NativeMethodAccessorImpl.java:62)
	at sun.reflect.DelegatingMethodAccessorImpl.invoke(DelegatingMethodAccessorImpl.java:43)
	at java.lang.reflect.Method.invoke(Method.java:498)
	at org.testng.internal.MethodInvocationHelper.invokeMethod(MethodInvocationHelper.java:80)
	at org.testng.internal.Invoker.invokeConfigurationMethod(Invoker.java:543)
	at org.testng.internal.Invoker.invokeConfigurations(Invoker.java:212)
	at org.testng.internal.Invoker.invokeConfigurations(Invoker.java:138)
	at org.testng.SuiteRunner.privateRun(SuiteRunner.java:277)
	at org.testng.SuiteRunner.run(SuiteRunner.java:240)
	at org.testng.SuiteRunnerWorker.runSuite(SuiteRunnerWorker.java:53)
	at org.testng.SuiteRunnerWorker.run(SuiteRunnerWorker.java:87)
	at org.testng.TestNG.runSuitesSequentially(TestNG.java:1137)
	at org.testng.TestNG.runSuitesLocally(TestNG.java:1062)
	at org.testng.TestNG.run(TestNG.java:974)
	at org.apache.maven.surefire.testng.TestNGExecutor.run(TestNGExecutor.java:178)
	at org.apache.maven.surefire.testng.TestNGXmlTestSuite.execute(TestNGXmlTestSuite.java:92)
	at org.apache.maven.surefire.testng.TestNGProvider.invoke(TestNGProvider.java:96)
	at sun.reflect.NativeMethodAccessorImpl.invoke0(Native Method)
	at sun.reflect.NativeMethodAccessorImpl.invoke(NativeMethodAccessorImpl.java:62)
	at sun.reflect.DelegatingMethodAccessorImpl.invoke(DelegatingMethodAccessorImpl.java:43)
	at java.lang.reflect.Method.invoke(Method.java:498)
	at org.apache.maven.surefire.util.ReflectionUtils.invokeMethodWithArray(ReflectionUtils.java:189)
	at org.apache.maven.surefire.booter.ProviderFactory$ProviderProxy.invoke(ProviderFactory.java:165)
	at org.apache.maven.surefire.booter.ProviderFactory.invokeProvider(ProviderFactory.java:85)
	at org.apache.maven.surefire.booter.ForkedBooter.runSuitesInProcess(ForkedBooter.java:115)
	at org.apache.maven.surefire.booter.ForkedBooter.main(ForkedBooter.java:75)
log4j:ERROR Either File or DatePattern options are not set for appender [FILE].
2018-10-23 15:37:45,991 TRACE [org.xdi.oxd.server.service.ConfigurationService] Try to load configuration from system property: oxd.server.config, value: /home/tomcat/.jenkins/jobs/oxD_3.1.4/workspace/oxd-server/src/test/resources/oxd-conf-test.json
2018-10-23 15:37:46,265 TRACE [org.xdi.oxd.server.service.ConfigurationService] Configuration loaded successfully from system property: oxd.server.config.
2018-10-23 15:37:46,265 TRACE [org.xdi.oxd.server.service.ConfigurationService] Configuration: Configuration{port=8099, timeOutInSeconds=0, registerClientAppType='web', registerClientResponesType='code', serverName='null', localhostOnly=true, useClientAuthenticationForPat=true, trustAllCerts=true, keyStorePath='', keyStorePassword='', cryptProviderKeyStorePath='', cryptProviderKeyStorePassword='', cryptProviderDnName='', licenseId='null', publicKey='null', publicPassword='null', licensePassword='null', supportGoogleLogout=true, stateExpirationInMinutes=5, nonceExpirationInMinutes=5, publicOpKeyCacheExpirationInMinutes=60, protectCommandsWithAccessToken=false, uma2AuthRegisterClaimsGatheringEndpointAsRedirectUriOfClient=true, migrationSourceFolderPath='', storage='h2', storageConfiguration={"dbFileLocation":"./oxd_db"}}
2018-10-23 15:37:46,266 TRACE [org.xdi.oxd.server.service.ConfigurationService] Trying to read oxd-default-site-config.json, path: /home/tomcat/.jenkins/jobs/oxD_3.1.4/workspace/oxd-server/src/test/resources/oxd-default-site-config.json
2018-10-23 15:37:46,344 INFO  [org.xdi.oxd.server.service.ConfigurationService] Default RP configuration loaded successfully: Rp{oxdId='null', opHost='', opDiscoveryPath='null', idToken='null', accessToken='null', authorizationRedirectUri='null', postLogoutRedirectUri='null', applicationType='null', redirectUris=null, frontChannelLogoutUri=null, claimsRedirectUri=null, responseTypes=[code], clientId='null', clientRegistrationAccessToken='null', clientRegistrationClientUri='null', clientIdIssuedAt=null, clientSecretExpiresAt=null, clientName='null', sectorIdentifierUri='null', clientJwksUri='null', setupClient='null', setupOxdId='null', setupClientId='null', scope=[openid, profile, email], uiLocales=[en], claimsLocales=[en], acrValues=[], grantType=null, contacts=[], userId='null', userSecret='null', pat='null', patExpiresIn=0, patCreatedAt=null, patRefreshToken='null', umaProtectedResources=[], rpt='null', rptTokenType='null', rptPct='null', rptExpiresAt=null, rptCreatedAt=null, rptUpgraded=null, tokenEndpointAuthSigningAlg=null, tokenEndpointAuthMethod=null, oxdRpProgrammingLanguage=null}
2018-10-23 15:37:46,345 ERROR [org.xdi.oxd.server.service.ConfigurationService] 'server_name' configuration property is mandatory. Please provide value for it in oxd-conf.json file.
Finished beforeSuite!
Tests run: 24, Failures: 23, Errors: 0, Skipped: 1, Time elapsed: 11.37 sec <<< FAILURE!
register(org.xdi.oxd.client.RegisterSiteTest)  Time elapsed: 0.014 sec  <<< FAILURE!
java.net.ConnectException: Connection refused (Connection refused)
	at java.net.PlainSocketImpl.socketConnect(Native Method)
	at java.net.AbstractPlainSocketImpl.doConnect(AbstractPlainSocketImpl.java:350)
	at java.net.AbstractPlainSocketImpl.connectToAddress(AbstractPlainSocketImpl.java:206)
	at java.net.AbstractPlainSocketImpl.connect(AbstractPlainSocketImpl.java:188)
	at java.net.SocksSocketImpl.connect(SocksSocketImpl.java:392)
	at java.net.Socket.connect(Socket.java:589)
	at java.net.Socket.connect(Socket.java:538)
	at java.net.Socket.<init>(Socket.java:434)
	at java.net.Socket.<init>(Socket.java:211)
	at org.xdi.oxd.client.TransportClient.<init>(TransportClient.java:54)
	at org.xdi.oxd.client.CommandClient.<init>(CommandClient.java:48)
	at org.xdi.oxd.client.RegisterSiteTest.register(RegisterSiteTest.java:37)
	at sun.reflect.NativeMethodAccessorImpl.invoke0(Native Method)
	at sun.reflect.NativeMethodAccessorImpl.invoke(NativeMethodAccessorImpl.java:62)
	at sun.reflect.DelegatingMethodAccessorImpl.invoke(DelegatingMethodAccessorImpl.java:43)
	at java.lang.reflect.Method.invoke(Method.java:498)
	at org.testng.internal.MethodInvocationHelper.invokeMethod(MethodInvocationHelper.java:80)
	at org.testng.internal.Invoker.invokeMethod(Invoker.java:691)
	at org.testng.internal.Invoker.invokeTestMethod(Invoker.java:883)
	at org.testng.internal.Invoker.invokeTestMethods(Invoker.java:1208)
	at org.testng.internal.TestMethodWorker.invokeTestMethods(TestMethodWorker.java:127)
	at org.testng.internal.TestMethodWorker.run(TestMethodWorker.java:111)
	at org.testng.TestRunner.privateRun(TestRunner.java:758)
	at org.testng.TestRunner.run(TestRunner.java:613)
	at org.testng.SuiteRunner.runTest(SuiteRunner.java:334)
	at org.testng.SuiteRunner.runSequentially(SuiteRunner.java:329)
	at org.testng.SuiteRunner.privateRun(SuiteRunner.java:291)
	at org.testng.SuiteRunner.run(SuiteRunner.java:240)
	at org.testng.SuiteRunnerWorker.runSuite(SuiteRunnerWorker.java:53)
	at org.testng.SuiteRunnerWorker.run(SuiteRunnerWorker.java:87)
	at org.testng.TestNG.runSuitesSequentially(TestNG.java:1137)
	at org.testng.TestNG.runSuitesLocally(TestNG.java:1062)
	at org.testng.TestNG.run(TestNG.java:974)
	at org.apache.maven.surefire.testng.TestNGExecutor.run(TestNGExecutor.java:178)
	at org.apache.maven.surefire.testng.TestNGXmlTestSuite.execute(TestNGXmlTestSuite.java:92)
	at org.apache.maven.surefire.testng.TestNGProvider.invoke(TestNGProvider.java:96)
	at sun.reflect.NativeMethodAccessorImpl.invoke0(Native Method)
	at sun.reflect.NativeMethodAccessorImpl.invoke(NativeMethodAccessorImpl.java:62)
	at sun.reflect.DelegatingMethodAccessorImpl.invoke(DelegatingMethodAccessorImpl.java:43)
	at java.lang.reflect.Method.invoke(Method.java:498)
	at org.apache.maven.surefire.util.ReflectionUtils.invokeMethodWithArray(ReflectionUtils.java:189)
	at org.apache.maven.surefire.booter.ProviderFactory$ProviderProxy.invoke(ProviderFactory.java:165)
	at org.apache.maven.surefire.booter.ProviderFactory.invokeProvider(ProviderFactory.java:85)
	at org.apache.maven.surefire.booter.ForkedBooter.runSuitesInProcess(ForkedBooter.java:115)
	at org.apache.maven.surefire.booter.ForkedBooter.main(ForkedBooter.java:75)

removeSiteTest(org.xdi.oxd.client.RemoveSiteTest)  Time elapsed: 0.005 sec  <<< FAILURE!
java.net.ConnectException: Connection refused (Connection refused)
	at java.net.PlainSocketImpl.socketConnect(Native Method)
	at java.net.AbstractPlainSocketImpl.doConnect(AbstractPlainSocketImpl.java:350)
	at java.net.AbstractPlainSocketImpl.connectToAddress(AbstractPlainSocketImpl.java:206)
	at java.net.AbstractPlainSocketImpl.connect(AbstractPlainSocketImpl.java:188)
	at java.net.SocksSocketImpl.connect(SocksSocketImpl.java:392)
	at java.net.Socket.connect(Socket.java:589)
	at java.net.Socket.connect(Socket.java:538)
	at java.net.Socket.<init>(Socket.java:434)
	at java.net.Socket.<init>(Socket.java:211)
	at org.xdi.oxd.client.TransportClient.<init>(TransportClient.java:54)
	at org.xdi.oxd.client.CommandClient.<init>(CommandClient.java:48)
	at org.xdi.oxd.client.RemoveSiteTest.removeSiteTest(RemoveSiteTest.java:26)
	at sun.reflect.NativeMethodAccessorImpl.invoke0(Native Method)
	at sun.reflect.NativeMethodAccessorImpl.invoke(NativeMethodAccessorImpl.java:62)
	at sun.reflect.DelegatingMethodAccessorImpl.invoke(DelegatingMethodAccessorImpl.java:43)
	at java.lang.reflect.Method.invoke(Method.java:498)
	at org.testng.internal.MethodInvocationHelper.invokeMethod(MethodInvocationHelper.java:80)
	at org.testng.internal.Invoker.invokeMethod(Invoker.java:691)
	at org.testng.internal.Invoker.invokeTestMethod(Invoker.java:883)
	at org.testng.internal.Invoker.invokeTestMethods(Invoker.java:1208)
	at org.testng.internal.TestMethodWorker.invokeTestMethods(TestMethodWorker.java:127)
	at org.testng.internal.TestMethodWorker.run(TestMethodWorker.java:111)
	at org.testng.TestRunner.privateRun(TestRunner.java:758)
	at org.testng.TestRunner.run(TestRunner.java:613)
	at org.testng.SuiteRunner.runTest(SuiteRunner.java:334)
	at org.testng.SuiteRunner.runSequentially(SuiteRunner.java:329)
	at org.testng.SuiteRunner.privateRun(SuiteRunner.java:291)
	at org.testng.SuiteRunner.run(SuiteRunner.java:240)
	at org.testng.SuiteRunnerWorker.runSuite(SuiteRunnerWorker.java:53)
	at org.testng.SuiteRunnerWorker.run(SuiteRunnerWorker.java:87)
	at org.testng.TestNG.runSuitesSequentially(TestNG.java:1137)
	at org.testng.TestNG.runSuitesLocally(TestNG.java:1062)
	at org.testng.TestNG.run(TestNG.java:974)
	at org.apache.maven.surefire.testng.TestNGExecutor.run(TestNGExecutor.java:178)
	at org.apache.maven.surefire.testng.TestNGXmlTestSuite.execute(TestNGXmlTestSuite.java:92)
	at org.apache.maven.surefire.testng.TestNGProvider.invoke(TestNGProvider.java:96)
	at sun.reflect.NativeMethodAccessorImpl.invoke0(Native Method)
	at sun.reflect.NativeMethodAccessorImpl.invoke(NativeMethodAccessorImpl.java:62)
	at sun.reflect.DelegatingMethodAccessorImpl.invoke(DelegatingMethodAccessorImpl.java:43)
	at java.lang.reflect.Method.invoke(Method.java:498)
	at org.apache.maven.surefire.util.ReflectionUtils.invokeMethodWithArray(ReflectionUtils.java:189)
	at org.apache.maven.surefire.booter.ProviderFactory$ProviderProxy.invoke(ProviderFactory.java:165)
	at org.apache.maven.surefire.booter.ProviderFactory.invokeProvider(ProviderFactory.java:85)
	at org.apache.maven.surefire.booter.ForkedBooter.runSuitesInProcess(ForkedBooter.java:115)
	at org.apache.maven.surefire.booter.ForkedBooter.main(ForkedBooter.java:75)

test(org.xdi.oxd.client.GetAuthorizationUrlTest)  Time elapsed: 0.001 sec  <<< FAILURE!
java.net.ConnectException: Connection refused (Connection refused)
	at java.net.PlainSocketImpl.socketConnect(Native Method)
	at java.net.AbstractPlainSocketImpl.doConnect(AbstractPlainSocketImpl.java:350)
	at java.net.AbstractPlainSocketImpl.connectToAddress(AbstractPlainSocketImpl.java:206)
	at java.net.AbstractPlainSocketImpl.connect(AbstractPlainSocketImpl.java:188)
	at java.net.SocksSocketImpl.connect(SocksSocketImpl.java:392)
	at java.net.Socket.connect(Socket.java:589)
	at java.net.Socket.connect(Socket.java:538)
	at java.net.Socket.<init>(Socket.java:434)
	at java.net.Socket.<init>(Socket.java:211)
	at org.xdi.oxd.client.TransportClient.<init>(TransportClient.java:54)
	at org.xdi.oxd.client.CommandClient.<init>(CommandClient.java:48)
	at org.xdi.oxd.client.GetAuthorizationUrlTest.test(GetAuthorizationUrlTest.java:28)
	at sun.reflect.NativeMethodAccessorImpl.invoke0(Native Method)
	at sun.reflect.NativeMethodAccessorImpl.invoke(NativeMethodAccessorImpl.java:62)
	at sun.reflect.DelegatingMethodAccessorImpl.invoke(DelegatingMethodAccessorImpl.java:43)
	at java.lang.reflect.Method.invoke(Method.java:498)
	at org.testng.internal.MethodInvocationHelper.invokeMethod(MethodInvocationHelper.java:80)
	at org.testng.internal.Invoker.invokeMethod(Invoker.java:691)
	at org.testng.internal.Invoker.invokeTestMethod(Invoker.java:883)
	at org.testng.internal.Invoker.invokeTestMethods(Invoker.java:1208)
	at org.testng.internal.TestMethodWorker.invokeTestMethods(TestMethodWorker.java:127)
	at org.testng.internal.TestMethodWorker.run(TestMethodWorker.java:111)
	at org.testng.TestRunner.privateRun(TestRunner.java:758)
	at org.testng.TestRunner.run(TestRunner.java:613)
	at org.testng.SuiteRunner.runTest(SuiteRunner.java:334)
	at org.testng.SuiteRunner.runSequentially(SuiteRunner.java:329)
	at org.testng.SuiteRunner.privateRun(SuiteRunner.java:291)
	at org.testng.SuiteRunner.run(SuiteRunner.java:240)
	at org.testng.SuiteRunnerWorker.runSuite(SuiteRunnerWorker.java:53)
	at org.testng.SuiteRunnerWorker.run(SuiteRunnerWorker.java:87)
	at org.testng.TestNG.runSuitesSequentially(TestNG.java:1137)
	at org.testng.TestNG.runSuitesLocally(TestNG.java:1062)
	at org.testng.TestNG.run(TestNG.java:974)
	at org.apache.maven.surefire.testng.TestNGExecutor.run(TestNGExecutor.java:178)
	at org.apache.maven.surefire.testng.TestNGXmlTestSuite.execute(TestNGXmlTestSuite.java:92)
	at org.apache.maven.surefire.testng.TestNGProvider.invoke(TestNGProvider.java:96)
	at sun.reflect.NativeMethodAccessorImpl.invoke0(Native Method)
	at sun.reflect.NativeMethodAccessorImpl.invoke(NativeMethodAccessorImpl.java:62)
	at sun.reflect.DelegatingMethodAccessorImpl.invoke(DelegatingMethodAccessorImpl.java:43)
	at java.lang.reflect.Method.invoke(Method.java:498)
	at org.apache.maven.surefire.util.ReflectionUtils.invokeMethodWithArray(ReflectionUtils.java:189)
	at org.apache.maven.surefire.booter.ProviderFactory$ProviderProxy.invoke(ProviderFactory.java:165)
	at org.apache.maven.surefire.booter.ProviderFactory.invokeProvider(ProviderFactory.java:85)
	at org.apache.maven.surefire.booter.ForkedBooter.runSuitesInProcess(ForkedBooter.java:115)
	at org.apache.maven.surefire.booter.ForkedBooter.main(ForkedBooter.java:75)

test(org.xdi.oxd.client.GetTokensByCodeTest)  Time elapsed: 0.002 sec  <<< FAILURE!
java.net.ConnectException: Connection refused (Connection refused)
	at java.net.PlainSocketImpl.socketConnect(Native Method)
	at java.net.AbstractPlainSocketImpl.doConnect(AbstractPlainSocketImpl.java:350)
	at java.net.AbstractPlainSocketImpl.connectToAddress(AbstractPlainSocketImpl.java:206)
	at java.net.AbstractPlainSocketImpl.connect(AbstractPlainSocketImpl.java:188)
	at java.net.SocksSocketImpl.connect(SocksSocketImpl.java:392)
	at java.net.Socket.connect(Socket.java:589)
	at java.net.Socket.connect(Socket.java:538)
	at java.net.Socket.<init>(Socket.java:434)
	at java.net.Socket.<init>(Socket.java:211)
	at org.xdi.oxd.client.TransportClient.<init>(TransportClient.java:54)
	at org.xdi.oxd.client.CommandClient.<init>(CommandClient.java:48)
	at org.xdi.oxd.client.GetTokensByCodeTest.test(GetTokensByCodeTest.java:36)
	at sun.reflect.NativeMethodAccessorImpl.invoke0(Native Method)
	at sun.reflect.NativeMethodAccessorImpl.invoke(NativeMethodAccessorImpl.java:62)
	at sun.reflect.DelegatingMethodAccessorImpl.invoke(DelegatingMethodAccessorImpl.java:43)
	at java.lang.reflect.Method.invoke(Method.java:498)
	at org.testng.internal.MethodInvocationHelper.invokeMethod(MethodInvocationHelper.java:80)
	at org.testng.internal.Invoker.invokeMethod(Invoker.java:691)
	at org.testng.internal.Invoker.invokeTestMethod(Invoker.java:883)
	at org.testng.internal.Invoker.invokeTestMethods(Invoker.java:1208)
	at org.testng.internal.TestMethodWorker.invokeTestMethods(TestMethodWorker.java:127)
	at org.testng.internal.TestMethodWorker.run(TestMethodWorker.java:111)
	at org.testng.TestRunner.privateRun(TestRunner.java:758)
	at org.testng.TestRunner.run(TestRunner.java:613)
	at org.testng.SuiteRunner.runTest(SuiteRunner.java:334)
	at org.testng.SuiteRunner.runSequentially(SuiteRunner.java:329)
	at org.testng.SuiteRunner.privateRun(SuiteRunner.java:291)
	at org.testng.SuiteRunner.run(SuiteRunner.java:240)
	at org.testng.SuiteRunnerWorker.runSuite(SuiteRunnerWorker.java:53)
	at org.testng.SuiteRunnerWorker.run(SuiteRunnerWorker.java:87)
	at org.testng.TestNG.runSuitesSequentially(TestNG.java:1137)
	at org.testng.TestNG.runSuitesLocally(TestNG.java:1062)
	at org.testng.TestNG.run(TestNG.java:974)
	at org.apache.maven.surefire.testng.TestNGExecutor.run(TestNGExecutor.java:178)
	at org.apache.maven.surefire.testng.TestNGXmlTestSuite.execute(TestNGXmlTestSuite.java:92)
	at org.apache.maven.surefire.testng.TestNGProvider.invoke(TestNGProvider.java:96)
	at sun.reflect.NativeMethodAccessorImpl.invoke0(Native Method)
	at sun.reflect.NativeMethodAccessorImpl.invoke(NativeMethodAccessorImpl.java:62)
	at sun.reflect.DelegatingMethodAccessorImpl.invoke(DelegatingMethodAccessorImpl.java:43)
	at java.lang.reflect.Method.invoke(Method.java:498)
	at org.apache.maven.surefire.util.ReflectionUtils.invokeMethodWithArray(ReflectionUtils.java:189)
	at org.apache.maven.surefire.booter.ProviderFactory$ProviderProxy.invoke(ProviderFactory.java:165)
	at org.apache.maven.surefire.booter.ProviderFactory.invokeProvider(ProviderFactory.java:85)
	at org.apache.maven.surefire.booter.ForkedBooter.runSuitesInProcess(ForkedBooter.java:115)
	at org.apache.maven.surefire.booter.ForkedBooter.main(ForkedBooter.java:75)

test(org.xdi.oxd.client.GetUserInfoTest)  Time elapsed: 0.001 sec  <<< FAILURE!
java.net.ConnectException: Connection refused (Connection refused)
	at java.net.PlainSocketImpl.socketConnect(Native Method)
	at java.net.AbstractPlainSocketImpl.doConnect(AbstractPlainSocketImpl.java:350)
	at java.net.AbstractPlainSocketImpl.connectToAddress(AbstractPlainSocketImpl.java:206)
	at java.net.AbstractPlainSocketImpl.connect(AbstractPlainSocketImpl.java:188)
	at java.net.SocksSocketImpl.connect(SocksSocketImpl.java:392)
	at java.net.Socket.connect(Socket.java:589)
	at java.net.Socket.connect(Socket.java:538)
	at java.net.Socket.<init>(Socket.java:434)
	at java.net.Socket.<init>(Socket.java:211)
	at org.xdi.oxd.client.TransportClient.<init>(TransportClient.java:54)
	at org.xdi.oxd.client.CommandClient.<init>(CommandClient.java:48)
	at org.xdi.oxd.client.GetUserInfoTest.test(GetUserInfoTest.java:31)
	at sun.reflect.NativeMethodAccessorImpl.invoke0(Native Method)
	at sun.reflect.NativeMethodAccessorImpl.invoke(NativeMethodAccessorImpl.java:62)
	at sun.reflect.DelegatingMethodAccessorImpl.invoke(DelegatingMethodAccessorImpl.java:43)
	at java.lang.reflect.Method.invoke(Method.java:498)
	at org.testng.internal.MethodInvocationHelper.invokeMethod(MethodInvocationHelper.java:80)
	at org.testng.internal.Invoker.invokeMethod(Invoker.java:691)
	at org.testng.internal.Invoker.invokeTestMethod(Invoker.java:883)
	at org.testng.internal.Invoker.invokeTestMethods(Invoker.java:1208)
	at org.testng.internal.TestMethodWorker.invokeTestMethods(TestMethodWorker.java:127)
	at org.testng.internal.TestMethodWorker.run(TestMethodWorker.java:111)
	at org.testng.TestRunner.privateRun(TestRunner.java:758)
	at org.testng.TestRunner.run(TestRunner.java:613)
	at org.testng.SuiteRunner.runTest(SuiteRunner.java:334)
	at org.testng.SuiteRunner.runSequentially(SuiteRunner.java:329)
	at org.testng.SuiteRunner.privateRun(SuiteRunner.java:291)
	at org.testng.SuiteRunner.run(SuiteRunner.java:240)
	at org.testng.SuiteRunnerWorker.runSuite(SuiteRunnerWorker.java:53)
	at org.testng.SuiteRunnerWorker.run(SuiteRunnerWorker.java:87)
	at org.testng.TestNG.runSuitesSequentially(TestNG.java:1137)
	at org.testng.TestNG.runSuitesLocally(TestNG.java:1062)
	at org.testng.TestNG.run(TestNG.java:974)
	at org.apache.maven.surefire.testng.TestNGExecutor.run(TestNGExecutor.java:178)
	at org.apache.maven.surefire.testng.TestNGXmlTestSuite.execute(TestNGXmlTestSuite.java:92)
	at org.apache.maven.surefire.testng.TestNGProvider.invoke(TestNGProvider.java:96)
	at sun.reflect.NativeMethodAccessorImpl.invoke0(Native Method)
	at sun.reflect.NativeMethodAccessorImpl.invoke(NativeMethodAccessorImpl.java:62)
	at sun.reflect.DelegatingMethodAccessorImpl.invoke(DelegatingMethodAccessorImpl.java:43)
	at java.lang.reflect.Method.invoke(Method.java:498)
	at org.apache.maven.surefire.util.ReflectionUtils.invokeMethodWithArray(ReflectionUtils.java:189)
	at org.apache.maven.surefire.booter.ProviderFactory$ProviderProxy.invoke(ProviderFactory.java:165)
	at org.apache.maven.surefire.booter.ProviderFactory.invokeProvider(ProviderFactory.java:85)
	at org.apache.maven.surefire.booter.ForkedBooter.runSuitesInProcess(ForkedBooter.java:115)
	at org.apache.maven.surefire.booter.ForkedBooter.main(ForkedBooter.java:75)

test(org.xdi.oxd.client.GetLogoutUrlTest)  Time elapsed: 0.002 sec  <<< FAILURE!
java.net.ConnectException: Connection refused (Connection refused)
	at java.net.PlainSocketImpl.socketConnect(Native Method)
	at java.net.AbstractPlainSocketImpl.doConnect(AbstractPlainSocketImpl.java:350)
	at java.net.AbstractPlainSocketImpl.connectToAddress(AbstractPlainSocketImpl.java:206)
	at java.net.AbstractPlainSocketImpl.connect(AbstractPlainSocketImpl.java:188)
	at java.net.SocksSocketImpl.connect(SocksSocketImpl.java:392)
	at java.net.Socket.connect(Socket.java:589)
	at java.net.Socket.connect(Socket.java:538)
	at java.net.Socket.<init>(Socket.java:434)
	at java.net.Socket.<init>(Socket.java:211)
	at org.xdi.oxd.client.TransportClient.<init>(TransportClient.java:54)
	at org.xdi.oxd.client.CommandClient.<init>(CommandClient.java:48)
	at org.xdi.oxd.client.GetLogoutUrlTest.test(GetLogoutUrlTest.java:32)
	at sun.reflect.NativeMethodAccessorImpl.invoke0(Native Method)
	at sun.reflect.NativeMethodAccessorImpl.invoke(NativeMethodAccessorImpl.java:62)
	at sun.reflect.DelegatingMethodAccessorImpl.invoke(DelegatingMethodAccessorImpl.java:43)
	at java.lang.reflect.Method.invoke(Method.java:498)
	at org.testng.internal.MethodInvocationHelper.invokeMethod(MethodInvocationHelper.java:80)
	at org.testng.internal.Invoker.invokeMethod(Invoker.java:691)
	at org.testng.internal.Invoker.invokeTestMethod(Invoker.java:883)
	at org.testng.internal.Invoker.invokeTestMethods(Invoker.java:1208)
	at org.testng.internal.TestMethodWorker.invokeTestMethods(TestMethodWorker.java:127)
	at org.testng.internal.TestMethodWorker.run(TestMethodWorker.java:111)
	at org.testng.TestRunner.privateRun(TestRunner.java:758)
	at org.testng.TestRunner.run(TestRunner.java:613)
	at org.testng.SuiteRunner.runTest(SuiteRunner.java:334)
	at org.testng.SuiteRunner.runSequentially(SuiteRunner.java:329)
	at org.testng.SuiteRunner.privateRun(SuiteRunner.java:291)
	at org.testng.SuiteRunner.run(SuiteRunner.java:240)
	at org.testng.SuiteRunnerWorker.runSuite(SuiteRunnerWorker.java:53)
	at org.testng.SuiteRunnerWorker.run(SuiteRunnerWorker.java:87)
	at org.testng.TestNG.runSuitesSequentially(TestNG.java:1137)
	at org.testng.TestNG.runSuitesLocally(TestNG.java:1062)
	at org.testng.TestNG.run(TestNG.java:974)
	at org.apache.maven.surefire.testng.TestNGExecutor.run(TestNGExecutor.java:178)
	at org.apache.maven.surefire.testng.TestNGXmlTestSuite.execute(TestNGXmlTestSuite.java:92)
	at org.apache.maven.surefire.testng.TestNGProvider.invoke(TestNGProvider.java:96)
	at sun.reflect.NativeMethodAccessorImpl.invoke0(Native Method)
	at sun.reflect.NativeMethodAccessorImpl.invoke(NativeMethodAccessorImpl.java:62)
	at sun.reflect.DelegatingMethodAccessorImpl.invoke(DelegatingMethodAccessorImpl.java:43)
	at java.lang.reflect.Method.invoke(Method.java:498)
	at org.apache.maven.surefire.util.ReflectionUtils.invokeMethodWithArray(ReflectionUtils.java:189)
	at org.apache.maven.surefire.booter.ProviderFactory$ProviderProxy.invoke(ProviderFactory.java:165)
	at org.apache.maven.surefire.booter.ProviderFactory.invokeProvider(ProviderFactory.java:85)
	at org.apache.maven.surefire.booter.ForkedBooter.runSuitesInProcess(ForkedBooter.java:115)
	at org.apache.maven.surefire.booter.ForkedBooter.main(ForkedBooter.java:75)

test(org.xdi.oxd.client.CheckIdTokenTest)  Time elapsed: 0.001 sec  <<< FAILURE!
java.net.ConnectException: Connection refused (Connection refused)
	at java.net.PlainSocketImpl.socketConnect(Native Method)
	at java.net.AbstractPlainSocketImpl.doConnect(AbstractPlainSocketImpl.java:350)
	at java.net.AbstractPlainSocketImpl.connectToAddress(AbstractPlainSocketImpl.java:206)
	at java.net.AbstractPlainSocketImpl.connect(AbstractPlainSocketImpl.java:188)
	at java.net.SocksSocketImpl.connect(SocksSocketImpl.java:392)
	at java.net.Socket.connect(Socket.java:589)
	at java.net.Socket.connect(Socket.java:538)
	at java.net.Socket.<init>(Socket.java:434)
	at java.net.Socket.<init>(Socket.java:211)
	at org.xdi.oxd.client.TransportClient.<init>(TransportClient.java:54)
	at org.xdi.oxd.client.CommandClient.<init>(CommandClient.java:48)
	at org.xdi.oxd.client.CheckIdTokenTest.test(CheckIdTokenTest.java:33)
	at sun.reflect.NativeMethodAccessorImpl.invoke0(Native Method)
	at sun.reflect.NativeMethodAccessorImpl.invoke(NativeMethodAccessorImpl.java:62)
	at sun.reflect.DelegatingMethodAccessorImpl.invoke(DelegatingMethodAccessorImpl.java:43)
	at java.lang.reflect.Method.invoke(Method.java:498)
	at org.testng.internal.MethodInvocationHelper.invokeMethod(MethodInvocationHelper.java:80)
	at org.testng.internal.Invoker.invokeMethod(Invoker.java:691)
	at org.testng.internal.Invoker.invokeTestMethod(Invoker.java:883)
	at org.testng.internal.Invoker.invokeTestMethods(Invoker.java:1208)
	at org.testng.internal.TestMethodWorker.invokeTestMethods(TestMethodWorker.java:127)
	at org.testng.internal.TestMethodWorker.run(TestMethodWorker.java:111)
	at org.testng.TestRunner.privateRun(TestRunner.java:758)
	at org.testng.TestRunner.run(TestRunner.java:613)
	at org.testng.SuiteRunner.runTest(SuiteRunner.java:334)
	at org.testng.SuiteRunner.runSequentially(SuiteRunner.java:329)
	at org.testng.SuiteRunner.privateRun(SuiteRunner.java:291)
	at org.testng.SuiteRunner.run(SuiteRunner.java:240)
	at org.testng.SuiteRunnerWorker.runSuite(SuiteRunnerWorker.java:53)
	at org.testng.SuiteRunnerWorker.run(SuiteRunnerWorker.java:87)
	at org.testng.TestNG.runSuitesSequentially(TestNG.java:1137)
	at org.testng.TestNG.runSuitesLocally(TestNG.java:1062)
	at org.testng.TestNG.run(TestNG.java:974)
	at org.apache.maven.surefire.testng.TestNGExecutor.run(TestNGExecutor.java:178)
	at org.apache.maven.surefire.testng.TestNGXmlTestSuite.execute(TestNGXmlTestSuite.java:92)
	at org.apache.maven.surefire.testng.TestNGProvider.invoke(TestNGProvider.java:96)
	at sun.reflect.NativeMethodAccessorImpl.invoke0(Native Method)
	at sun.reflect.NativeMethodAccessorImpl.invoke(NativeMethodAccessorImpl.java:62)
	at sun.reflect.DelegatingMethodAccessorImpl.invoke(DelegatingMethodAccessorImpl.java:43)
	at java.lang.reflect.Method.invoke(Method.java:498)
	at org.apache.maven.surefire.util.ReflectionUtils.invokeMethodWithArray(ReflectionUtils.java:189)
	at org.apache.maven.surefire.booter.ProviderFactory$ProviderProxy.invoke(ProviderFactory.java:165)
	at org.apache.maven.surefire.booter.ProviderFactory.invokeProvider(ProviderFactory.java:85)
	at org.apache.maven.surefire.booter.ForkedBooter.runSuitesInProcess(ForkedBooter.java:115)
	at org.apache.maven.surefire.booter.ForkedBooter.main(ForkedBooter.java:75)

test(org.xdi.oxd.client.CheckAccessTokenTest)  Time elapsed: 0.001 sec  <<< FAILURE!
java.net.ConnectException: Connection refused (Connection refused)
	at java.net.PlainSocketImpl.socketConnect(Native Method)
	at java.net.AbstractPlainSocketImpl.doConnect(AbstractPlainSocketImpl.java:350)
	at java.net.AbstractPlainSocketImpl.connectToAddress(AbstractPlainSocketImpl.java:206)
	at java.net.AbstractPlainSocketImpl.connect(AbstractPlainSocketImpl.java:188)
	at java.net.SocksSocketImpl.connect(SocksSocketImpl.java:392)
	at java.net.Socket.connect(Socket.java:589)
	at java.net.Socket.connect(Socket.java:538)
	at java.net.Socket.<init>(Socket.java:434)
	at java.net.Socket.<init>(Socket.java:211)
	at org.xdi.oxd.client.TransportClient.<init>(TransportClient.java:54)
	at org.xdi.oxd.client.CommandClient.<init>(CommandClient.java:48)
	at org.xdi.oxd.client.CheckAccessTokenTest.test(CheckAccessTokenTest.java:30)
	at sun.reflect.NativeMethodAccessorImpl.invoke0(Native Method)
	at sun.reflect.NativeMethodAccessorImpl.invoke(NativeMethodAccessorImpl.java:62)
	at sun.reflect.DelegatingMethodAccessorImpl.invoke(DelegatingMethodAccessorImpl.java:43)
	at java.lang.reflect.Method.invoke(Method.java:498)
	at org.testng.internal.MethodInvocationHelper.invokeMethod(MethodInvocationHelper.java:80)
	at org.testng.internal.Invoker.invokeMethod(Invoker.java:691)
	at org.testng.internal.Invoker.invokeTestMethod(Invoker.java:883)
	at org.testng.internal.Invoker.invokeTestMethods(Invoker.java:1208)
	at org.testng.internal.TestMethodWorker.invokeTestMethods(TestMethodWorker.java:127)
	at org.testng.internal.TestMethodWorker.run(TestMethodWorker.java:111)
	at org.testng.TestRunner.privateRun(TestRunner.java:758)
	at org.testng.TestRunner.run(TestRunner.java:613)
	at org.testng.SuiteRunner.runTest(SuiteRunner.java:334)
	at org.testng.SuiteRunner.runSequentially(SuiteRunner.java:329)
	at org.testng.SuiteRunner.privateRun(SuiteRunner.java:291)
	at org.testng.SuiteRunner.run(SuiteRunner.java:240)
	at org.testng.SuiteRunnerWorker.runSuite(SuiteRunnerWorker.java:53)
	at org.testng.SuiteRunnerWorker.run(SuiteRunnerWorker.java:87)
	at org.testng.TestNG.runSuitesSequentially(TestNG.java:1137)
	at org.testng.TestNG.runSuitesLocally(TestNG.java:1062)
	at org.testng.TestNG.run(TestNG.java:974)
	at org.apache.maven.surefire.testng.TestNGExecutor.run(TestNGExecutor.java:178)
	at org.apache.maven.surefire.testng.TestNGXmlTestSuite.execute(TestNGXmlTestSuite.java:92)
	at org.apache.maven.surefire.testng.TestNGProvider.invoke(TestNGProvider.java:96)
	at sun.reflect.NativeMethodAccessorImpl.invoke0(Native Method)
	at sun.reflect.NativeMethodAccessorImpl.invoke(NativeMethodAccessorImpl.java:62)
	at sun.reflect.DelegatingMethodAccessorImpl.invoke(DelegatingMethodAccessorImpl.java:43)
	at java.lang.reflect.Method.invoke(Method.java:498)
	at org.apache.maven.surefire.util.ReflectionUtils.invokeMethodWithArray(ReflectionUtils.java:189)
	at org.apache.maven.surefire.booter.ProviderFactory$ProviderProxy.invoke(ProviderFactory.java:165)
	at org.apache.maven.surefire.booter.ProviderFactory.invokeProvider(ProviderFactory.java:85)
	at org.apache.maven.surefire.booter.ForkedBooter.runSuitesInProcess(ForkedBooter.java:115)
	at org.apache.maven.surefire.booter.ForkedBooter.main(ForkedBooter.java:75)

test(org.xdi.oxd.client.UmaFullTest)  Time elapsed: 0 sec  <<< FAILURE!
java.net.ConnectException: Connection refused (Connection refused)
	at java.net.PlainSocketImpl.socketConnect(Native Method)
	at java.net.AbstractPlainSocketImpl.doConnect(AbstractPlainSocketImpl.java:350)
	at java.net.AbstractPlainSocketImpl.connectToAddress(AbstractPlainSocketImpl.java:206)
	at java.net.AbstractPlainSocketImpl.connect(AbstractPlainSocketImpl.java:188)
	at java.net.SocksSocketImpl.connect(SocksSocketImpl.java:392)
	at java.net.Socket.connect(Socket.java:589)
	at java.net.Socket.connect(Socket.java:538)
	at java.net.Socket.<init>(Socket.java:434)
	at java.net.Socket.<init>(Socket.java:211)
	at org.xdi.oxd.client.TransportClient.<init>(TransportClient.java:54)
	at org.xdi.oxd.client.CommandClient.<init>(CommandClient.java:48)
	at org.xdi.oxd.client.UmaFullTest.test(UmaFullTest.java:35)
	at sun.reflect.NativeMethodAccessorImpl.invoke0(Native Method)
	at sun.reflect.NativeMethodAccessorImpl.invoke(NativeMethodAccessorImpl.java:62)
	at sun.reflect.DelegatingMethodAccessorImpl.invoke(DelegatingMethodAccessorImpl.java:43)
	at java.lang.reflect.Method.invoke(Method.java:498)
	at org.testng.internal.MethodInvocationHelper.invokeMethod(MethodInvocationHelper.java:80)
	at org.testng.internal.Invoker.invokeMethod(Invoker.java:691)
	at org.testng.internal.Invoker.invokeTestMethod(Invoker.java:883)
	at org.testng.internal.Invoker.invokeTestMethods(Invoker.java:1208)
	at org.testng.internal.TestMethodWorker.invokeTestMethods(TestMethodWorker.java:127)
	at org.testng.internal.TestMethodWorker.run(TestMethodWorker.java:111)
	at org.testng.TestRunner.privateRun(TestRunner.java:758)
	at org.testng.TestRunner.run(TestRunner.java:613)
	at org.testng.SuiteRunner.runTest(SuiteRunner.java:334)
	at org.testng.SuiteRunner.runSequentially(SuiteRunner.java:329)
	at org.testng.SuiteRunner.privateRun(SuiteRunner.java:291)
	at org.testng.SuiteRunner.run(SuiteRunner.java:240)
	at org.testng.SuiteRunnerWorker.runSuite(SuiteRunnerWorker.java:53)
	at org.testng.SuiteRunnerWorker.run(SuiteRunnerWorker.java:87)
	at org.testng.TestNG.runSuitesSequentially(TestNG.java:1137)
	at org.testng.TestNG.runSuitesLocally(TestNG.java:1062)
	at org.testng.TestNG.run(TestNG.java:974)
	at org.apache.maven.surefire.testng.TestNGExecutor.run(TestNGExecutor.java:178)
	at org.apache.maven.surefire.testng.TestNGXmlTestSuite.execute(TestNGXmlTestSuite.java:92)
	at org.apache.maven.surefire.testng.TestNGProvider.invoke(TestNGProvider.java:96)
	at sun.reflect.NativeMethodAccessorImpl.invoke0(Native Method)
	at sun.reflect.NativeMethodAccessorImpl.invoke(NativeMethodAccessorImpl.java:62)
	at sun.reflect.DelegatingMethodAccessorImpl.invoke(DelegatingMethodAccessorImpl.java:43)
	at java.lang.reflect.Method.invoke(Method.java:498)
	at org.apache.maven.surefire.util.ReflectionUtils.invokeMethodWithArray(ReflectionUtils.java:189)
	at org.apache.maven.surefire.booter.ProviderFactory$ProviderProxy.invoke(ProviderFactory.java:165)
	at org.apache.maven.surefire.booter.ProviderFactory.invokeProvider(ProviderFactory.java:85)
	at org.apache.maven.surefire.booter.ForkedBooter.runSuitesInProcess(ForkedBooter.java:115)
	at org.apache.maven.surefire.booter.ForkedBooter.main(ForkedBooter.java:75)

overwriteFalse(org.xdi.oxd.client.RsProtectTest)  Time elapsed: 0 sec  <<< FAILURE!
java.net.ConnectException: Connection refused (Connection refused)
	at java.net.PlainSocketImpl.socketConnect(Native Method)
	at java.net.AbstractPlainSocketImpl.doConnect(AbstractPlainSocketImpl.java:350)
	at java.net.AbstractPlainSocketImpl.connectToAddress(AbstractPlainSocketImpl.java:206)
	at java.net.AbstractPlainSocketImpl.connect(AbstractPlainSocketImpl.java:188)
	at java.net.SocksSocketImpl.connect(SocksSocketImpl.java:392)
	at java.net.Socket.connect(Socket.java:589)
	at java.net.Socket.connect(Socket.java:538)
	at java.net.Socket.<init>(Socket.java:434)
	at java.net.Socket.<init>(Socket.java:211)
	at org.xdi.oxd.client.TransportClient.<init>(TransportClient.java:54)
	at org.xdi.oxd.client.CommandClient.<init>(CommandClient.java:48)
	at org.xdi.oxd.client.RsProtectTest.overwriteFalse(RsProtectTest.java:51)
	at sun.reflect.NativeMethodAccessorImpl.invoke0(Native Method)
	at sun.reflect.NativeMethodAccessorImpl.invoke(NativeMethodAccessorImpl.java:62)
	at sun.reflect.DelegatingMethodAccessorImpl.invoke(DelegatingMethodAccessorImpl.java:43)
	at java.lang.reflect.Method.invoke(Method.java:498)
	at org.testng.internal.MethodInvocationHelper.invokeMethod(MethodInvocationHelper.java:80)
	at org.testng.internal.Invoker.invokeMethod(Invoker.java:691)
	at org.testng.internal.Invoker.invokeTestMethod(Invoker.java:883)
	at org.testng.internal.Invoker.invokeTestMethods(Invoker.java:1208)
	at org.testng.internal.TestMethodWorker.invokeTestMethods(TestMethodWorker.java:127)
	at org.testng.internal.TestMethodWorker.run(TestMethodWorker.java:111)
	at org.testng.TestRunner.privateRun(TestRunner.java:758)
	at org.testng.TestRunner.run(TestRunner.java:613)
	at org.testng.SuiteRunner.runTest(SuiteRunner.java:334)
	at org.testng.SuiteRunner.runSequentially(SuiteRunner.java:329)
	at org.testng.SuiteRunner.privateRun(SuiteRunner.java:291)
	at org.testng.SuiteRunner.run(SuiteRunner.java:240)
	at org.testng.SuiteRunnerWorker.runSuite(SuiteRunnerWorker.java:53)
	at org.testng.SuiteRunnerWorker.run(SuiteRunnerWorker.java:87)
	at org.testng.TestNG.runSuitesSequentially(TestNG.java:1137)
	at org.testng.TestNG.runSuitesLocally(TestNG.java:1062)
	at org.testng.TestNG.run(TestNG.java:974)
	at org.apache.maven.surefire.testng.TestNGExecutor.run(TestNGExecutor.java:178)
	at org.apache.maven.surefire.testng.TestNGXmlTestSuite.execute(TestNGXmlTestSuite.java:92)
	at org.apache.maven.surefire.testng.TestNGProvider.invoke(TestNGProvider.java:96)
	at sun.reflect.NativeMethodAccessorImpl.invoke0(Native Method)
	at sun.reflect.NativeMethodAccessorImpl.invoke(NativeMethodAccessorImpl.java:62)
	at sun.reflect.DelegatingMethodAccessorImpl.invoke(DelegatingMethodAccessorImpl.java:43)
	at java.lang.reflect.Method.invoke(Method.java:498)
	at org.apache.maven.surefire.util.ReflectionUtils.invokeMethodWithArray(ReflectionUtils.java:189)
	at org.apache.maven.surefire.booter.ProviderFactory$ProviderProxy.invoke(ProviderFactory.java:165)
	at org.apache.maven.surefire.booter.ProviderFactory.invokeProvider(ProviderFactory.java:85)
	at org.apache.maven.surefire.booter.ForkedBooter.runSuitesInProcess(ForkedBooter.java:115)
	at org.apache.maven.surefire.booter.ForkedBooter.main(ForkedBooter.java:75)

overwriteTrue(org.xdi.oxd.client.RsProtectTest)  Time elapsed: 0 sec  <<< FAILURE!
java.net.ConnectException: Connection refused (Connection refused)
	at java.net.PlainSocketImpl.socketConnect(Native Method)
	at java.net.AbstractPlainSocketImpl.doConnect(AbstractPlainSocketImpl.java:350)
	at java.net.AbstractPlainSocketImpl.connectToAddress(AbstractPlainSocketImpl.java:206)
	at java.net.AbstractPlainSocketImpl.connect(AbstractPlainSocketImpl.java:188)
	at java.net.SocksSocketImpl.connect(SocksSocketImpl.java:392)
	at java.net.Socket.connect(Socket.java:589)
	at java.net.Socket.connect(Socket.java:538)
	at java.net.Socket.<init>(Socket.java:434)
	at java.net.Socket.<init>(Socket.java:211)
	at org.xdi.oxd.client.TransportClient.<init>(TransportClient.java:54)
	at org.xdi.oxd.client.CommandClient.<init>(CommandClient.java:48)
	at org.xdi.oxd.client.RsProtectTest.overwriteTrue(RsProtectTest.java:75)
	at sun.reflect.NativeMethodAccessorImpl.invoke0(Native Method)
	at sun.reflect.NativeMethodAccessorImpl.invoke(NativeMethodAccessorImpl.java:62)
	at sun.reflect.DelegatingMethodAccessorImpl.invoke(DelegatingMethodAccessorImpl.java:43)
	at java.lang.reflect.Method.invoke(Method.java:498)
	at org.testng.internal.MethodInvocationHelper.invokeMethod(MethodInvocationHelper.java:80)
	at org.testng.internal.Invoker.invokeMethod(Invoker.java:691)
	at org.testng.internal.Invoker.invokeTestMethod(Invoker.java:883)
	at org.testng.internal.Invoker.invokeTestMethods(Invoker.java:1208)
	at org.testng.internal.TestMethodWorker.invokeTestMethods(TestMethodWorker.java:127)
	at org.testng.internal.TestMethodWorker.run(TestMethodWorker.java:111)
	at org.testng.TestRunner.privateRun(TestRunner.java:758)
	at org.testng.TestRunner.run(TestRunner.java:613)
	at org.testng.SuiteRunner.runTest(SuiteRunner.java:334)
	at org.testng.SuiteRunner.runSequentially(SuiteRunner.java:329)
	at org.testng.SuiteRunner.privateRun(SuiteRunner.java:291)
	at org.testng.SuiteRunner.run(SuiteRunner.java:240)
	at org.testng.SuiteRunnerWorker.runSuite(SuiteRunnerWorker.java:53)
	at org.testng.SuiteRunnerWorker.run(SuiteRunnerWorker.java:87)
	at org.testng.TestNG.runSuitesSequentially(TestNG.java:1137)
	at org.testng.TestNG.runSuitesLocally(TestNG.java:1062)
	at org.testng.TestNG.run(TestNG.java:974)
	at org.apache.maven.surefire.testng.TestNGExecutor.run(TestNGExecutor.java:178)
	at org.apache.maven.surefire.testng.TestNGXmlTestSuite.execute(TestNGXmlTestSuite.java:92)
	at org.apache.maven.surefire.testng.TestNGProvider.invoke(TestNGProvider.java:96)
	at sun.reflect.NativeMethodAccessorImpl.invoke0(Native Method)
	at sun.reflect.NativeMethodAccessorImpl.invoke(NativeMethodAccessorImpl.java:62)
	at sun.reflect.DelegatingMethodAccessorImpl.invoke(DelegatingMethodAccessorImpl.java:43)
	at java.lang.reflect.Method.invoke(Method.java:498)
	at org.apache.maven.surefire.util.ReflectionUtils.invokeMethodWithArray(ReflectionUtils.java:189)
	at org.apache.maven.surefire.booter.ProviderFactory$ProviderProxy.invoke(ProviderFactory.java:165)
	at org.apache.maven.surefire.booter.ProviderFactory.invokeProvider(ProviderFactory.java:85)
	at org.apache.maven.surefire.booter.ForkedBooter.runSuitesInProcess(ForkedBooter.java:115)
	at org.apache.maven.surefire.booter.ForkedBooter.main(ForkedBooter.java:75)

protect(org.xdi.oxd.client.RsProtectTest)  Time elapsed: 0 sec  <<< FAILURE!
java.net.ConnectException: Connection refused (Connection refused)
	at java.net.PlainSocketImpl.socketConnect(Native Method)
	at java.net.AbstractPlainSocketImpl.doConnect(AbstractPlainSocketImpl.java:350)
	at java.net.AbstractPlainSocketImpl.connectToAddress(AbstractPlainSocketImpl.java:206)
	at java.net.AbstractPlainSocketImpl.connect(AbstractPlainSocketImpl.java:188)
	at java.net.SocksSocketImpl.connect(SocksSocketImpl.java:392)
	at java.net.Socket.connect(Socket.java:589)
	at java.net.Socket.connect(Socket.java:538)
	at java.net.Socket.<init>(Socket.java:434)
	at java.net.Socket.<init>(Socket.java:211)
	at org.xdi.oxd.client.TransportClient.<init>(TransportClient.java:54)
	at org.xdi.oxd.client.CommandClient.<init>(CommandClient.java:48)
	at org.xdi.oxd.client.RsProtectTest.protect(RsProtectTest.java:35)
	at sun.reflect.NativeMethodAccessorImpl.invoke0(Native Method)
	at sun.reflect.NativeMethodAccessorImpl.invoke(NativeMethodAccessorImpl.java:62)
	at sun.reflect.DelegatingMethodAccessorImpl.invoke(DelegatingMethodAccessorImpl.java:43)
	at java.lang.reflect.Method.invoke(Method.java:498)
	at org.testng.internal.MethodInvocationHelper.invokeMethod(MethodInvocationHelper.java:80)
	at org.testng.internal.Invoker.invokeMethod(Invoker.java:691)
	at org.testng.internal.Invoker.invokeTestMethod(Invoker.java:883)
	at org.testng.internal.Invoker.invokeTestMethods(Invoker.java:1208)
	at org.testng.internal.TestMethodWorker.invokeTestMethods(TestMethodWorker.java:127)
	at org.testng.internal.TestMethodWorker.run(TestMethodWorker.java:111)
	at org.testng.TestRunner.privateRun(TestRunner.java:758)
	at org.testng.TestRunner.run(TestRunner.java:613)
	at org.testng.SuiteRunner.runTest(SuiteRunner.java:334)
	at org.testng.SuiteRunner.runSequentially(SuiteRunner.java:329)
	at org.testng.SuiteRunner.privateRun(SuiteRunner.java:291)
	at org.testng.SuiteRunner.run(SuiteRunner.java:240)
	at org.testng.SuiteRunnerWorker.runSuite(SuiteRunnerWorker.java:53)
	at org.testng.SuiteRunnerWorker.run(SuiteRunnerWorker.java:87)
	at org.testng.TestNG.runSuitesSequentially(TestNG.java:1137)
	at org.testng.TestNG.runSuitesLocally(TestNG.java:1062)
	at org.testng.TestNG.run(TestNG.java:974)
	at org.apache.maven.surefire.testng.TestNGExecutor.run(TestNGExecutor.java:178)
	at org.apache.maven.surefire.testng.TestNGXmlTestSuite.execute(TestNGXmlTestSuite.java:92)
	at org.apache.maven.surefire.testng.TestNGProvider.invoke(TestNGProvider.java:96)
	at sun.reflect.NativeMethodAccessorImpl.invoke0(Native Method)
	at sun.reflect.NativeMethodAccessorImpl.invoke(NativeMethodAccessorImpl.java:62)
	at sun.reflect.DelegatingMethodAccessorImpl.invoke(DelegatingMethodAccessorImpl.java:43)
	at java.lang.reflect.Method.invoke(Method.java:498)
	at org.apache.maven.surefire.util.ReflectionUtils.invokeMethodWithArray(ReflectionUtils.java:189)
	at org.apache.maven.surefire.booter.ProviderFactory$ProviderProxy.invoke(ProviderFactory.java:165)
	at org.apache.maven.surefire.booter.ProviderFactory.invokeProvider(ProviderFactory.java:85)
	at org.apache.maven.surefire.booter.ForkedBooter.runSuitesInProcess(ForkedBooter.java:115)
	at org.apache.maven.surefire.booter.ForkedBooter.main(ForkedBooter.java:75)

protectWithScopeExpression(org.xdi.oxd.client.RsProtectTest)  Time elapsed: 0 sec  <<< FAILURE!
java.net.ConnectException: Connection refused (Connection refused)
	at java.net.PlainSocketImpl.socketConnect(Native Method)
	at java.net.AbstractPlainSocketImpl.doConnect(AbstractPlainSocketImpl.java:350)
	at java.net.AbstractPlainSocketImpl.connectToAddress(AbstractPlainSocketImpl.java:206)
	at java.net.AbstractPlainSocketImpl.connect(AbstractPlainSocketImpl.java:188)
	at java.net.SocksSocketImpl.connect(SocksSocketImpl.java:392)
	at java.net.Socket.connect(Socket.java:589)
	at java.net.Socket.connect(Socket.java:538)
	at java.net.Socket.<init>(Socket.java:434)
	at java.net.Socket.<init>(Socket.java:211)
	at org.xdi.oxd.client.TransportClient.<init>(TransportClient.java:54)
	at org.xdi.oxd.client.CommandClient.<init>(CommandClient.java:48)
	at org.xdi.oxd.client.RsProtectTest.protectWithScopeExpression(RsProtectTest.java:99)
	at sun.reflect.NativeMethodAccessorImpl.invoke0(Native Method)
	at sun.reflect.NativeMethodAccessorImpl.invoke(NativeMethodAccessorImpl.java:62)
	at sun.reflect.DelegatingMethodAccessorImpl.invoke(DelegatingMethodAccessorImpl.java:43)
	at java.lang.reflect.Method.invoke(Method.java:498)
	at org.testng.internal.MethodInvocationHelper.invokeMethod(MethodInvocationHelper.java:80)
	at org.testng.internal.Invoker.invokeMethod(Invoker.java:691)
	at org.testng.internal.Invoker.invokeTestMethod(Invoker.java:883)
	at org.testng.internal.Invoker.invokeTestMethods(Invoker.java:1208)
	at org.testng.internal.TestMethodWorker.invokeTestMethods(TestMethodWorker.java:127)
	at org.testng.internal.TestMethodWorker.run(TestMethodWorker.java:111)
	at org.testng.TestRunner.privateRun(TestRunner.java:758)
	at org.testng.TestRunner.run(TestRunner.java:613)
	at org.testng.SuiteRunner.runTest(SuiteRunner.java:334)
	at org.testng.SuiteRunner.runSequentially(SuiteRunner.java:329)
	at org.testng.SuiteRunner.privateRun(SuiteRunner.java:291)
	at org.testng.SuiteRunner.run(SuiteRunner.java:240)
	at org.testng.SuiteRunnerWorker.runSuite(SuiteRunnerWorker.java:53)
	at org.testng.SuiteRunnerWorker.run(SuiteRunnerWorker.java:87)
	at org.testng.TestNG.runSuitesSequentially(TestNG.java:1137)
	at org.testng.TestNG.runSuitesLocally(TestNG.java:1062)
	at org.testng.TestNG.run(TestNG.java:974)
	at org.apache.maven.surefire.testng.TestNGExecutor.run(TestNGExecutor.java:178)
	at org.apache.maven.surefire.testng.TestNGXmlTestSuite.execute(TestNGXmlTestSuite.java:92)
	at org.apache.maven.surefire.testng.TestNGProvider.invoke(TestNGProvider.java:96)
	at sun.reflect.NativeMethodAccessorImpl.invoke0(Native Method)
	at sun.reflect.NativeMethodAccessorImpl.invoke(NativeMethodAccessorImpl.java:62)
	at sun.reflect.DelegatingMethodAccessorImpl.invoke(DelegatingMethodAccessorImpl.java:43)
	at java.lang.reflect.Method.invoke(Method.java:498)
	at org.apache.maven.surefire.util.ReflectionUtils.invokeMethodWithArray(ReflectionUtils.java:189)
	at org.apache.maven.surefire.booter.ProviderFactory$ProviderProxy.invoke(ProviderFactory.java:165)
	at org.apache.maven.surefire.booter.ProviderFactory.invokeProvider(ProviderFactory.java:85)
	at org.apache.maven.surefire.booter.ForkedBooter.runSuitesInProcess(ForkedBooter.java:115)
	at org.apache.maven.surefire.booter.ForkedBooter.main(ForkedBooter.java:75)

protectWithScopeExpressionSeconds(org.xdi.oxd.client.RsProtectTest)  Time elapsed: 0.001 sec  <<< FAILURE!
java.net.ConnectException: Connection refused (Connection refused)
	at java.net.PlainSocketImpl.socketConnect(Native Method)
	at java.net.AbstractPlainSocketImpl.doConnect(AbstractPlainSocketImpl.java:350)
	at java.net.AbstractPlainSocketImpl.connectToAddress(AbstractPlainSocketImpl.java:206)
	at java.net.AbstractPlainSocketImpl.connect(AbstractPlainSocketImpl.java:188)
	at java.net.SocksSocketImpl.connect(SocksSocketImpl.java:392)
	at java.net.Socket.connect(Socket.java:589)
	at java.net.Socket.connect(Socket.java:538)
	at java.net.Socket.<init>(Socket.java:434)
	at java.net.Socket.<init>(Socket.java:211)
	at org.xdi.oxd.client.TransportClient.<init>(TransportClient.java:54)
	at org.xdi.oxd.client.CommandClient.<init>(CommandClient.java:48)
	at org.xdi.oxd.client.RsProtectTest.protectWithScopeExpressionSeconds(RsProtectTest.java:115)
	at sun.reflect.NativeMethodAccessorImpl.invoke0(Native Method)
	at sun.reflect.NativeMethodAccessorImpl.invoke(NativeMethodAccessorImpl.java:62)
	at sun.reflect.DelegatingMethodAccessorImpl.invoke(DelegatingMethodAccessorImpl.java:43)
	at java.lang.reflect.Method.invoke(Method.java:498)
	at org.testng.internal.MethodInvocationHelper.invokeMethod(MethodInvocationHelper.java:80)
	at org.testng.internal.Invoker.invokeMethod(Invoker.java:691)
	at org.testng.internal.Invoker.invokeTestMethod(Invoker.java:883)
	at org.testng.internal.Invoker.invokeTestMethods(Invoker.java:1208)
	at org.testng.internal.TestMethodWorker.invokeTestMethods(TestMethodWorker.java:127)
	at org.testng.internal.TestMethodWorker.run(TestMethodWorker.java:111)
	at org.testng.TestRunner.privateRun(TestRunner.java:758)
	at org.testng.TestRunner.run(TestRunner.java:613)
	at org.testng.SuiteRunner.runTest(SuiteRunner.java:334)
	at org.testng.SuiteRunner.runSequentially(SuiteRunner.java:329)
	at org.testng.SuiteRunner.privateRun(SuiteRunner.java:291)
	at org.testng.SuiteRunner.run(SuiteRunner.java:240)
	at org.testng.SuiteRunnerWorker.runSuite(SuiteRunnerWorker.java:53)
	at org.testng.SuiteRunnerWorker.run(SuiteRunnerWorker.java:87)
	at org.testng.TestNG.runSuitesSequentially(TestNG.java:1137)
	at org.testng.TestNG.runSuitesLocally(TestNG.java:1062)
	at org.testng.TestNG.run(TestNG.java:974)
	at org.apache.maven.surefire.testng.TestNGExecutor.run(TestNGExecutor.java:178)
	at org.apache.maven.surefire.testng.TestNGXmlTestSuite.execute(TestNGXmlTestSuite.java:92)
	at org.apache.maven.surefire.testng.TestNGProvider.invoke(TestNGProvider.java:96)
	at sun.reflect.NativeMethodAccessorImpl.invoke0(Native Method)
	at sun.reflect.NativeMethodAccessorImpl.invoke(NativeMethodAccessorImpl.java:62)
	at sun.reflect.DelegatingMethodAccessorImpl.invoke(DelegatingMethodAccessorImpl.java:43)
	at java.lang.reflect.Method.invoke(Method.java:498)
	at org.apache.maven.surefire.util.ReflectionUtils.invokeMethodWithArray(ReflectionUtils.java:189)
	at org.apache.maven.surefire.booter.ProviderFactory$ProviderProxy.invoke(ProviderFactory.java:165)
	at org.apache.maven.surefire.booter.ProviderFactory.invokeProvider(ProviderFactory.java:85)
	at org.apache.maven.surefire.booter.ForkedBooter.runSuitesInProcess(ForkedBooter.java:115)
	at org.apache.maven.surefire.booter.ForkedBooter.main(ForkedBooter.java:75)

test(org.xdi.oxd.client.RsCheckAccessTest)  Time elapsed: 0.011 sec  <<< FAILURE!
java.net.ConnectException: Connection refused (Connection refused)
	at java.net.PlainSocketImpl.socketConnect(Native Method)
	at java.net.AbstractPlainSocketImpl.doConnect(AbstractPlainSocketImpl.java:350)
	at java.net.AbstractPlainSocketImpl.connectToAddress(AbstractPlainSocketImpl.java:206)
	at java.net.AbstractPlainSocketImpl.connect(AbstractPlainSocketImpl.java:188)
	at java.net.SocksSocketImpl.connect(SocksSocketImpl.java:392)
	at java.net.Socket.connect(Socket.java:589)
	at java.net.Socket.connect(Socket.java:538)
	at java.net.Socket.<init>(Socket.java:434)
	at java.net.Socket.<init>(Socket.java:211)
	at org.xdi.oxd.client.TransportClient.<init>(TransportClient.java:54)
	at org.xdi.oxd.client.CommandClient.<init>(CommandClient.java:48)
	at org.xdi.oxd.client.RsCheckAccessTest.test(RsCheckAccessTest.java:27)
	at sun.reflect.NativeMethodAccessorImpl.invoke0(Native Method)
	at sun.reflect.NativeMethodAccessorImpl.invoke(NativeMethodAccessorImpl.java:62)
	at sun.reflect.DelegatingMethodAccessorImpl.invoke(DelegatingMethodAccessorImpl.java:43)
	at java.lang.reflect.Method.invoke(Method.java:498)
	at org.testng.internal.MethodInvocationHelper.invokeMethod(MethodInvocationHelper.java:80)
	at org.testng.internal.Invoker.invokeMethod(Invoker.java:691)
	at org.testng.internal.Invoker.invokeTestMethod(Invoker.java:883)
	at org.testng.internal.Invoker.invokeTestMethods(Invoker.java:1208)
	at org.testng.internal.TestMethodWorker.invokeTestMethods(TestMethodWorker.java:127)
	at org.testng.internal.TestMethodWorker.run(TestMethodWorker.java:111)
	at org.testng.TestRunner.privateRun(TestRunner.java:758)
	at org.testng.TestRunner.run(TestRunner.java:613)
	at org.testng.SuiteRunner.runTest(SuiteRunner.java:334)
	at org.testng.SuiteRunner.runSequentially(SuiteRunner.java:329)
	at org.testng.SuiteRunner.privateRun(SuiteRunner.java:291)
	at org.testng.SuiteRunner.run(SuiteRunner.java:240)
	at org.testng.SuiteRunnerWorker.runSuite(SuiteRunnerWorker.java:53)
	at org.testng.SuiteRunnerWorker.run(SuiteRunnerWorker.java:87)
	at org.testng.TestNG.runSuitesSequentially(TestNG.java:1137)
	at org.testng.TestNG.runSuitesLocally(TestNG.java:1062)
	at org.testng.TestNG.run(TestNG.java:974)
	at org.apache.maven.surefire.testng.TestNGExecutor.run(TestNGExecutor.java:178)
	at org.apache.maven.surefire.testng.TestNGXmlTestSuite.execute(TestNGXmlTestSuite.java:92)
	at org.apache.maven.surefire.testng.TestNGProvider.invoke(TestNGProvider.java:96)
	at sun.reflect.NativeMethodAccessorImpl.invoke0(Native Method)
	at sun.reflect.NativeMethodAccessorImpl.invoke(NativeMethodAccessorImpl.java:62)
	at sun.reflect.DelegatingMethodAccessorImpl.invoke(DelegatingMethodAccessorImpl.java:43)
	at java.lang.reflect.Method.invoke(Method.java:498)
	at org.apache.maven.surefire.util.ReflectionUtils.invokeMethodWithArray(ReflectionUtils.java:189)
	at org.apache.maven.surefire.booter.ProviderFactory$ProviderProxy.invoke(ProviderFactory.java:165)
	at org.apache.maven.surefire.booter.ProviderFactory.invokeProvider(ProviderFactory.java:85)
	at org.apache.maven.surefire.booter.ForkedBooter.runSuitesInProcess(ForkedBooter.java:115)
	at org.apache.maven.surefire.booter.ForkedBooter.main(ForkedBooter.java:75)

test(org.xdi.oxd.client.RpGetRptTest)  Time elapsed: 0 sec  <<< FAILURE!
java.net.ConnectException: Connection refused (Connection refused)
	at java.net.PlainSocketImpl.socketConnect(Native Method)
	at java.net.AbstractPlainSocketImpl.doConnect(AbstractPlainSocketImpl.java:350)
	at java.net.AbstractPlainSocketImpl.connectToAddress(AbstractPlainSocketImpl.java:206)
	at java.net.AbstractPlainSocketImpl.connect(AbstractPlainSocketImpl.java:188)
	at java.net.SocksSocketImpl.connect(SocksSocketImpl.java:392)
	at java.net.Socket.connect(Socket.java:589)
	at java.net.Socket.connect(Socket.java:538)
	at java.net.Socket.<init>(Socket.java:434)
	at java.net.Socket.<init>(Socket.java:211)
	at org.xdi.oxd.client.TransportClient.<init>(TransportClient.java:54)
	at org.xdi.oxd.client.CommandClient.<init>(CommandClient.java:48)
	at org.xdi.oxd.client.RpGetRptTest.test(RpGetRptTest.java:30)
	at sun.reflect.NativeMethodAccessorImpl.invoke0(Native Method)
	at sun.reflect.NativeMethodAccessorImpl.invoke(NativeMethodAccessorImpl.java:62)
	at sun.reflect.DelegatingMethodAccessorImpl.invoke(DelegatingMethodAccessorImpl.java:43)
	at java.lang.reflect.Method.invoke(Method.java:498)
	at org.testng.internal.MethodInvocationHelper.invokeMethod(MethodInvocationHelper.java:80)
	at org.testng.internal.Invoker.invokeMethod(Invoker.java:691)
	at org.testng.internal.Invoker.invokeTestMethod(Invoker.java:883)
	at org.testng.internal.Invoker.invokeTestMethods(Invoker.java:1208)
	at org.testng.internal.TestMethodWorker.invokeTestMethods(TestMethodWorker.java:127)
	at org.testng.internal.TestMethodWorker.run(TestMethodWorker.java:111)
	at org.testng.TestRunner.privateRun(TestRunner.java:758)
	at org.testng.TestRunner.run(TestRunner.java:613)
	at org.testng.SuiteRunner.runTest(SuiteRunner.java:334)
	at org.testng.SuiteRunner.runSequentially(SuiteRunner.java:329)
	at org.testng.SuiteRunner.privateRun(SuiteRunner.java:291)
	at org.testng.SuiteRunner.run(SuiteRunner.java:240)
	at org.testng.SuiteRunnerWorker.runSuite(SuiteRunnerWorker.java:53)
	at org.testng.SuiteRunnerWorker.run(SuiteRunnerWorker.java:87)
	at org.testng.TestNG.runSuitesSequentially(TestNG.java:1137)
	at org.testng.TestNG.runSuitesLocally(TestNG.java:1062)
	at org.testng.TestNG.run(TestNG.java:974)
	at org.apache.maven.surefire.testng.TestNGExecutor.run(TestNGExecutor.java:178)
	at org.apache.maven.surefire.testng.TestNGXmlTestSuite.execute(TestNGXmlTestSuite.java:92)
	at org.apache.maven.surefire.testng.TestNGProvider.invoke(TestNGProvider.java:96)
	at sun.reflect.NativeMethodAccessorImpl.invoke0(Native Method)
	at sun.reflect.NativeMethodAccessorImpl.invoke(NativeMethodAccessorImpl.java:62)
	at sun.reflect.DelegatingMethodAccessorImpl.invoke(DelegatingMethodAccessorImpl.java:43)
	at java.lang.reflect.Method.invoke(Method.java:498)
	at org.apache.maven.surefire.util.ReflectionUtils.invokeMethodWithArray(ReflectionUtils.java:189)
	at org.apache.maven.surefire.booter.ProviderFactory$ProviderProxy.invoke(ProviderFactory.java:165)
	at org.apache.maven.surefire.booter.ProviderFactory.invokeProvider(ProviderFactory.java:85)
	at org.apache.maven.surefire.booter.ForkedBooter.runSuitesInProcess(ForkedBooter.java:115)
	at org.apache.maven.surefire.booter.ForkedBooter.main(ForkedBooter.java:75)

test(org.xdi.oxd.client.UmaGetClaimsGatheringUrlTest)  Time elapsed: 0.011 sec  <<< FAILURE!
java.net.ConnectException: Connection refused (Connection refused)
	at java.net.PlainSocketImpl.socketConnect(Native Method)
	at java.net.AbstractPlainSocketImpl.doConnect(AbstractPlainSocketImpl.java:350)
	at java.net.AbstractPlainSocketImpl.connectToAddress(AbstractPlainSocketImpl.java:206)
	at java.net.AbstractPlainSocketImpl.connect(AbstractPlainSocketImpl.java:188)
	at java.net.SocksSocketImpl.connect(SocksSocketImpl.java:392)
	at java.net.Socket.connect(Socket.java:589)
	at java.net.Socket.connect(Socket.java:538)
	at java.net.Socket.<init>(Socket.java:434)
	at java.net.Socket.<init>(Socket.java:211)
	at org.xdi.oxd.client.TransportClient.<init>(TransportClient.java:54)
	at org.xdi.oxd.client.CommandClient.<init>(CommandClient.java:48)
	at org.xdi.oxd.client.UmaGetClaimsGatheringUrlTest.test(UmaGetClaimsGatheringUrlTest.java:30)
	at sun.reflect.NativeMethodAccessorImpl.invoke0(Native Method)
	at sun.reflect.NativeMethodAccessorImpl.invoke(NativeMethodAccessorImpl.java:62)
	at sun.reflect.DelegatingMethodAccessorImpl.invoke(DelegatingMethodAccessorImpl.java:43)
	at java.lang.reflect.Method.invoke(Method.java:498)
	at org.testng.internal.MethodInvocationHelper.invokeMethod(MethodInvocationHelper.java:80)
	at org.testng.internal.Invoker.invokeMethod(Invoker.java:691)
	at org.testng.internal.Invoker.invokeTestMethod(Invoker.java:883)
	at org.testng.internal.Invoker.invokeTestMethods(Invoker.java:1208)
	at org.testng.internal.TestMethodWorker.invokeTestMethods(TestMethodWorker.java:127)
	at org.testng.internal.TestMethodWorker.run(TestMethodWorker.java:111)
	at org.testng.TestRunner.privateRun(TestRunner.java:758)
	at org.testng.TestRunner.run(TestRunner.java:613)
	at org.testng.SuiteRunner.runTest(SuiteRunner.java:334)
	at org.testng.SuiteRunner.runSequentially(SuiteRunner.java:329)
	at org.testng.SuiteRunner.privateRun(SuiteRunner.java:291)
	at org.testng.SuiteRunner.run(SuiteRunner.java:240)
	at org.testng.SuiteRunnerWorker.runSuite(SuiteRunnerWorker.java:53)
	at org.testng.SuiteRunnerWorker.run(SuiteRunnerWorker.java:87)
	at org.testng.TestNG.runSuitesSequentially(TestNG.java:1137)
	at org.testng.TestNG.runSuitesLocally(TestNG.java:1062)
	at org.testng.TestNG.run(TestNG.java:974)
	at org.apache.maven.surefire.testng.TestNGExecutor.run(TestNGExecutor.java:178)
	at org.apache.maven.surefire.testng.TestNGXmlTestSuite.execute(TestNGXmlTestSuite.java:92)
	at org.apache.maven.surefire.testng.TestNGProvider.invoke(TestNGProvider.java:96)
	at sun.reflect.NativeMethodAccessorImpl.invoke0(Native Method)
	at sun.reflect.NativeMethodAccessorImpl.invoke(NativeMethodAccessorImpl.java:62)
	at sun.reflect.DelegatingMethodAccessorImpl.invoke(DelegatingMethodAccessorImpl.java:43)
	at java.lang.reflect.Method.invoke(Method.java:498)
	at org.apache.maven.surefire.util.ReflectionUtils.invokeMethodWithArray(ReflectionUtils.java:189)
	at org.apache.maven.surefire.booter.ProviderFactory$ProviderProxy.invoke(ProviderFactory.java:165)
	at org.apache.maven.surefire.booter.ProviderFactory.invokeProvider(ProviderFactory.java:85)
	at org.apache.maven.surefire.booter.ForkedBooter.runSuitesInProcess(ForkedBooter.java:115)
	at org.apache.maven.surefire.booter.ForkedBooter.main(ForkedBooter.java:75)

test(org.xdi.oxd.client.IntrospectRptTest)  Time elapsed: 0.001 sec  <<< FAILURE!
java.net.ConnectException: Connection refused (Connection refused)
	at java.net.PlainSocketImpl.socketConnect(Native Method)
	at java.net.AbstractPlainSocketImpl.doConnect(AbstractPlainSocketImpl.java:350)
	at java.net.AbstractPlainSocketImpl.connectToAddress(AbstractPlainSocketImpl.java:206)
	at java.net.AbstractPlainSocketImpl.connect(AbstractPlainSocketImpl.java:188)
	at java.net.SocksSocketImpl.connect(SocksSocketImpl.java:392)
	at java.net.Socket.connect(Socket.java:589)
	at java.net.Socket.connect(Socket.java:538)
	at java.net.Socket.<init>(Socket.java:434)
	at java.net.Socket.<init>(Socket.java:211)
	at org.xdi.oxd.client.TransportClient.<init>(TransportClient.java:54)
	at org.xdi.oxd.client.CommandClient.<init>(CommandClient.java:48)
	at org.xdi.oxd.client.IntrospectRptTest.test(IntrospectRptTest.java:27)
	at sun.reflect.NativeMethodAccessorImpl.invoke0(Native Method)
	at sun.reflect.NativeMethodAccessorImpl.invoke(NativeMethodAccessorImpl.java:62)
	at sun.reflect.DelegatingMethodAccessorImpl.invoke(DelegatingMethodAccessorImpl.java:43)
	at java.lang.reflect.Method.invoke(Method.java:498)
	at org.testng.internal.MethodInvocationHelper.invokeMethod(MethodInvocationHelper.java:80)
	at org.testng.internal.Invoker.invokeMethod(Invoker.java:691)
	at org.testng.internal.Invoker.invokeTestMethod(Invoker.java:883)
	at org.testng.internal.Invoker.invokeTestMethods(Invoker.java:1208)
	at org.testng.internal.TestMethodWorker.invokeTestMethods(TestMethodWorker.java:127)
	at org.testng.internal.TestMethodWorker.run(TestMethodWorker.java:111)
	at org.testng.TestRunner.privateRun(TestRunner.java:758)
	at org.testng.TestRunner.run(TestRunner.java:613)
	at org.testng.SuiteRunner.runTest(SuiteRunner.java:334)
	at org.testng.SuiteRunner.runSequentially(SuiteRunner.java:329)
	at org.testng.SuiteRunner.privateRun(SuiteRunner.java:291)
	at org.testng.SuiteRunner.run(SuiteRunner.java:240)
	at org.testng.SuiteRunnerWorker.runSuite(SuiteRunnerWorker.java:53)
	at org.testng.SuiteRunnerWorker.run(SuiteRunnerWorker.java:87)
	at org.testng.TestNG.runSuitesSequentially(TestNG.java:1137)
	at org.testng.TestNG.runSuitesLocally(TestNG.java:1062)
	at org.testng.TestNG.run(TestNG.java:974)
	at org.apache.maven.surefire.testng.TestNGExecutor.run(TestNGExecutor.java:178)
	at org.apache.maven.surefire.testng.TestNGXmlTestSuite.execute(TestNGXmlTestSuite.java:92)
	at org.apache.maven.surefire.testng.TestNGProvider.invoke(TestNGProvider.java:96)
	at sun.reflect.NativeMethodAccessorImpl.invoke0(Native Method)
	at sun.reflect.NativeMethodAccessorImpl.invoke(NativeMethodAccessorImpl.java:62)
	at sun.reflect.DelegatingMethodAccessorImpl.invoke(DelegatingMethodAccessorImpl.java:43)
	at java.lang.reflect.Method.invoke(Method.java:498)
	at org.apache.maven.surefire.util.ReflectionUtils.invokeMethodWithArray(ReflectionUtils.java:189)
	at org.apache.maven.surefire.booter.ProviderFactory$ProviderProxy.invoke(ProviderFactory.java:165)
	at org.apache.maven.surefire.booter.ProviderFactory.invokeProvider(ProviderFactory.java:85)
	at org.apache.maven.surefire.booter.ForkedBooter.runSuitesInProcess(ForkedBooter.java:115)
	at org.apache.maven.surefire.booter.ForkedBooter.main(ForkedBooter.java:75)

setupClient(org.xdi.oxd.client.SetupClientTest)  Time elapsed: 0 sec  <<< FAILURE!
java.net.ConnectException: Connection refused (Connection refused)
	at java.net.PlainSocketImpl.socketConnect(Native Method)
	at java.net.AbstractPlainSocketImpl.doConnect(AbstractPlainSocketImpl.java:350)
	at java.net.AbstractPlainSocketImpl.connectToAddress(AbstractPlainSocketImpl.java:206)
	at java.net.AbstractPlainSocketImpl.connect(AbstractPlainSocketImpl.java:188)
	at java.net.SocksSocketImpl.connect(SocksSocketImpl.java:392)
	at java.net.Socket.connect(Socket.java:589)
	at java.net.Socket.connect(Socket.java:538)
	at java.net.Socket.<init>(Socket.java:434)
	at java.net.Socket.<init>(Socket.java:211)
	at org.xdi.oxd.client.TransportClient.<init>(TransportClient.java:54)
	at org.xdi.oxd.client.CommandClient.<init>(CommandClient.java:48)
	at org.xdi.oxd.client.SetupClientTest.setupClient(SetupClientTest.java:31)
	at sun.reflect.NativeMethodAccessorImpl.invoke0(Native Method)
	at sun.reflect.NativeMethodAccessorImpl.invoke(NativeMethodAccessorImpl.java:62)
	at sun.reflect.DelegatingMethodAccessorImpl.invoke(DelegatingMethodAccessorImpl.java:43)
	at java.lang.reflect.Method.invoke(Method.java:498)
	at org.testng.internal.MethodInvocationHelper.invokeMethod(MethodInvocationHelper.java:80)
	at org.testng.internal.Invoker.invokeMethod(Invoker.java:691)
	at org.testng.internal.Invoker.invokeTestMethod(Invoker.java:883)
	at org.testng.internal.Invoker.invokeTestMethods(Invoker.java:1208)
	at org.testng.internal.TestMethodWorker.invokeTestMethods(TestMethodWorker.java:127)
	at org.testng.internal.TestMethodWorker.run(TestMethodWorker.java:111)
	at org.testng.TestRunner.privateRun(TestRunner.java:758)
	at org.testng.TestRunner.run(TestRunner.java:613)
	at org.testng.SuiteRunner.runTest(SuiteRunner.java:334)
	at org.testng.SuiteRunner.runSequentially(SuiteRunner.java:329)
	at org.testng.SuiteRunner.privateRun(SuiteRunner.java:291)
	at org.testng.SuiteRunner.run(SuiteRunner.java:240)
	at org.testng.SuiteRunnerWorker.runSuite(SuiteRunnerWorker.java:53)
	at org.testng.SuiteRunnerWorker.run(SuiteRunnerWorker.java:87)
	at org.testng.TestNG.runSuitesSequentially(TestNG.java:1137)
	at org.testng.TestNG.runSuitesLocally(TestNG.java:1062)
	at org.testng.TestNG.run(TestNG.java:974)
	at org.apache.maven.surefire.testng.TestNGExecutor.run(TestNGExecutor.java:178)
	at org.apache.maven.surefire.testng.TestNGXmlTestSuite.execute(TestNGXmlTestSuite.java:92)
	at org.apache.maven.surefire.testng.TestNGProvider.invoke(TestNGProvider.java:96)
	at sun.reflect.NativeMethodAccessorImpl.invoke0(Native Method)
	at sun.reflect.NativeMethodAccessorImpl.invoke(NativeMethodAccessorImpl.java:62)
	at sun.reflect.DelegatingMethodAccessorImpl.invoke(DelegatingMethodAccessorImpl.java:43)
	at java.lang.reflect.Method.invoke(Method.java:498)
	at org.apache.maven.surefire.util.ReflectionUtils.invokeMethodWithArray(ReflectionUtils.java:189)
	at org.apache.maven.surefire.booter.ProviderFactory$ProviderProxy.invoke(ProviderFactory.java:165)
	at org.apache.maven.surefire.booter.ProviderFactory.invokeProvider(ProviderFactory.java:85)
	at org.apache.maven.surefire.booter.ForkedBooter.runSuitesInProcess(ForkedBooter.java:115)
	at org.apache.maven.surefire.booter.ForkedBooter.main(ForkedBooter.java:75)

getClientToken(org.xdi.oxd.client.GetClientTokenTest)  Time elapsed: 0.013 sec  <<< FAILURE!
java.net.ConnectException: Connection refused (Connection refused)
	at java.net.PlainSocketImpl.socketConnect(Native Method)
	at java.net.AbstractPlainSocketImpl.doConnect(AbstractPlainSocketImpl.java:350)
	at java.net.AbstractPlainSocketImpl.connectToAddress(AbstractPlainSocketImpl.java:206)
	at java.net.AbstractPlainSocketImpl.connect(AbstractPlainSocketImpl.java:188)
	at java.net.SocksSocketImpl.connect(SocksSocketImpl.java:392)
	at java.net.Socket.connect(Socket.java:589)
	at java.net.Socket.connect(Socket.java:538)
	at java.net.Socket.<init>(Socket.java:434)
	at java.net.Socket.<init>(Socket.java:211)
	at org.xdi.oxd.client.TransportClient.<init>(TransportClient.java:54)
	at org.xdi.oxd.client.CommandClient.<init>(CommandClient.java:48)
	at org.xdi.oxd.client.GetClientTokenTest.getClientToken(GetClientTokenTest.java:29)
	at sun.reflect.NativeMethodAccessorImpl.invoke0(Native Method)
	at sun.reflect.NativeMethodAccessorImpl.invoke(NativeMethodAccessorImpl.java:62)
	at sun.reflect.DelegatingMethodAccessorImpl.invoke(DelegatingMethodAccessorImpl.java:43)
	at java.lang.reflect.Method.invoke(Method.java:498)
	at org.testng.internal.MethodInvocationHelper.invokeMethod(MethodInvocationHelper.java:80)
	at org.testng.internal.Invoker.invokeMethod(Invoker.java:691)
	at org.testng.internal.Invoker.invokeTestMethod(Invoker.java:883)
	at org.testng.internal.Invoker.invokeTestMethods(Invoker.java:1208)
	at org.testng.internal.TestMethodWorker.invokeTestMethods(TestMethodWorker.java:127)
	at org.testng.internal.TestMethodWorker.run(TestMethodWorker.java:111)
	at org.testng.TestRunner.privateRun(TestRunner.java:758)
	at org.testng.TestRunner.run(TestRunner.java:613)
	at org.testng.SuiteRunner.runTest(SuiteRunner.java:334)
	at org.testng.SuiteRunner.runSequentially(SuiteRunner.java:329)
	at org.testng.SuiteRunner.privateRun(SuiteRunner.java:291)
	at org.testng.SuiteRunner.run(SuiteRunner.java:240)
	at org.testng.SuiteRunnerWorker.runSuite(SuiteRunnerWorker.java:53)
	at org.testng.SuiteRunnerWorker.run(SuiteRunnerWorker.java:87)
	at org.testng.TestNG.runSuitesSequentially(TestNG.java:1137)
	at org.testng.TestNG.runSuitesLocally(TestNG.java:1062)
	at org.testng.TestNG.run(TestNG.java:974)
	at org.apache.maven.surefire.testng.TestNGExecutor.run(TestNGExecutor.java:178)
	at org.apache.maven.surefire.testng.TestNGXmlTestSuite.execute(TestNGXmlTestSuite.java:92)
	at org.apache.maven.surefire.testng.TestNGProvider.invoke(TestNGProvider.java:96)
	at sun.reflect.NativeMethodAccessorImpl.invoke0(Native Method)
	at sun.reflect.NativeMethodAccessorImpl.invoke(NativeMethodAccessorImpl.java:62)
	at sun.reflect.DelegatingMethodAccessorImpl.invoke(DelegatingMethodAccessorImpl.java:43)
	at java.lang.reflect.Method.invoke(Method.java:498)
	at org.apache.maven.surefire.util.ReflectionUtils.invokeMethodWithArray(ReflectionUtils.java:189)
	at org.apache.maven.surefire.booter.ProviderFactory$ProviderProxy.invoke(ProviderFactory.java:165)
	at org.apache.maven.surefire.booter.ProviderFactory.invokeProvider(ProviderFactory.java:85)
	at org.apache.maven.surefire.booter.ForkedBooter.runSuitesInProcess(ForkedBooter.java:115)
	at org.apache.maven.surefire.booter.ForkedBooter.main(ForkedBooter.java:75)

introspectAccessToken(org.xdi.oxd.client.IntrospectAccessTokenTest)  Time elapsed: 0 sec  <<< FAILURE!
java.net.ConnectException: Connection refused (Connection refused)
	at java.net.PlainSocketImpl.socketConnect(Native Method)
	at java.net.AbstractPlainSocketImpl.doConnect(AbstractPlainSocketImpl.java:350)
	at java.net.AbstractPlainSocketImpl.connectToAddress(AbstractPlainSocketImpl.java:206)
	at java.net.AbstractPlainSocketImpl.connect(AbstractPlainSocketImpl.java:188)
	at java.net.SocksSocketImpl.connect(SocksSocketImpl.java:392)
	at java.net.Socket.connect(Socket.java:589)
	at java.net.Socket.connect(Socket.java:538)
	at java.net.Socket.<init>(Socket.java:434)
	at java.net.Socket.<init>(Socket.java:211)
	at org.xdi.oxd.client.TransportClient.<init>(TransportClient.java:54)
	at org.xdi.oxd.client.CommandClient.<init>(CommandClient.java:48)
	at org.xdi.oxd.client.IntrospectAccessTokenTest.introspectAccessToken(IntrospectAccessTokenTest.java:30)
	at sun.reflect.NativeMethodAccessorImpl.invoke0(Native Method)
	at sun.reflect.NativeMethodAccessorImpl.invoke(NativeMethodAccessorImpl.java:62)
	at sun.reflect.DelegatingMethodAccessorImpl.invoke(DelegatingMethodAccessorImpl.java:43)
	at java.lang.reflect.Method.invoke(Method.java:498)
	at org.testng.internal.MethodInvocationHelper.invokeMethod(MethodInvocationHelper.java:80)
	at org.testng.internal.Invoker.invokeMethod(Invoker.java:691)
	at org.testng.internal.Invoker.invokeTestMethod(Invoker.java:883)
	at org.testng.internal.Invoker.invokeTestMethods(Invoker.java:1208)
	at org.testng.internal.TestMethodWorker.invokeTestMethods(TestMethodWorker.java:127)
	at org.testng.internal.TestMethodWorker.run(TestMethodWorker.java:111)
	at org.testng.TestRunner.privateRun(TestRunner.java:758)
	at org.testng.TestRunner.run(TestRunner.java:613)
	at org.testng.SuiteRunner.runTest(SuiteRunner.java:334)
	at org.testng.SuiteRunner.runSequentially(SuiteRunner.java:329)
	at org.testng.SuiteRunner.privateRun(SuiteRunner.java:291)
	at org.testng.SuiteRunner.run(SuiteRunner.java:240)
	at org.testng.SuiteRunnerWorker.runSuite(SuiteRunnerWorker.java:53)
	at org.testng.SuiteRunnerWorker.run(SuiteRunnerWorker.java:87)
	at org.testng.TestNG.runSuitesSequentially(TestNG.java:1137)
	at org.testng.TestNG.runSuitesLocally(TestNG.java:1062)
	at org.testng.TestNG.run(TestNG.java:974)
	at org.apache.maven.surefire.testng.TestNGExecutor.run(TestNGExecutor.java:178)
	at org.apache.maven.surefire.testng.TestNGXmlTestSuite.execute(TestNGXmlTestSuite.java:92)
	at org.apache.maven.surefire.testng.TestNGProvider.invoke(TestNGProvider.java:96)
	at sun.reflect.NativeMethodAccessorImpl.invoke0(Native Method)
	at sun.reflect.NativeMethodAccessorImpl.invoke(NativeMethodAccessorImpl.java:62)
	at sun.reflect.DelegatingMethodAccessorImpl.invoke(DelegatingMethodAccessorImpl.java:43)
	at java.lang.reflect.Method.invoke(Method.java:498)
	at org.apache.maven.surefire.util.ReflectionUtils.invokeMethodWithArray(ReflectionUtils.java:189)
	at org.apache.maven.surefire.booter.ProviderFactory$ProviderProxy.invoke(ProviderFactory.java:165)
	at org.apache.maven.surefire.booter.ProviderFactory.invokeProvider(ProviderFactory.java:85)
	at org.apache.maven.surefire.booter.ForkedBooter.runSuitesInProcess(ForkedBooter.java:115)
	at org.apache.maven.surefire.booter.ForkedBooter.main(ForkedBooter.java:75)

afterSuite(org.xdi.oxd.server.SetUpTest)  Time elapsed: 0.021 sec  <<< FAILURE!
java.lang.NullPointerException
	at org.xdi.oxd.server.persistence.PersistenceServiceImpl.destroy(PersistenceServiceImpl.java:61)
	at org.xdi.oxd.server.ServerLauncher.shutdown(ServerLauncher.java:160)
	at org.xdi.oxd.server.SetUpTest.afterSuite(SetUpTest.java:55)
	at sun.reflect.NativeMethodAccessorImpl.invoke0(Native Method)
	at sun.reflect.NativeMethodAccessorImpl.invoke(NativeMethodAccessorImpl.java:62)
	at sun.reflect.DelegatingMethodAccessorImpl.invoke(DelegatingMethodAccessorImpl.java:43)
	at java.lang.reflect.Method.invoke(Method.java:498)
	at org.testng.internal.MethodInvocationHelper.invokeMethod(MethodInvocationHelper.java:80)
	at org.testng.internal.Invoker.invokeConfigurationMethod(Invoker.java:543)
	at org.testng.internal.Invoker.invokeConfigurations(Invoker.java:212)
	at org.testng.internal.Invoker.invokeConfigurations(Invoker.java:138)
	at org.testng.SuiteRunner.privateRun(SuiteRunner.java:308)
	at org.testng.SuiteRunner.run(SuiteRunner.java:240)
	at org.testng.SuiteRunnerWorker.runSuite(SuiteRunnerWorker.java:53)
	at org.testng.SuiteRunnerWorker.run(SuiteRunnerWorker.java:87)
	at org.testng.TestNG.runSuitesSequentially(TestNG.java:1137)
	at org.testng.TestNG.runSuitesLocally(TestNG.java:1062)
	at org.testng.TestNG.run(TestNG.java:974)
	at org.apache.maven.surefire.testng.TestNGExecutor.run(TestNGExecutor.java:178)
	at org.apache.maven.surefire.testng.TestNGXmlTestSuite.execute(TestNGXmlTestSuite.java:92)
	at org.apache.maven.surefire.testng.TestNGProvider.invoke(TestNGProvider.java:96)
	at sun.reflect.NativeMethodAccessorImpl.invoke0(Native Method)
	at sun.reflect.NativeMethodAccessorImpl.invoke(NativeMethodAccessorImpl.java:62)
	at sun.reflect.DelegatingMethodAccessorImpl.invoke(DelegatingMethodAccessorImpl.java:43)
	at java.lang.reflect.Method.invoke(Method.java:498)
	at org.apache.maven.surefire.util.ReflectionUtils.invokeMethodWithArray(ReflectionUtils.java:189)
	at org.apache.maven.surefire.booter.ProviderFactory$ProviderProxy.invoke(ProviderFactory.java:165)
	at org.apache.maven.surefire.booter.ProviderFactory.invokeProvider(ProviderFactory.java:85)
	at org.apache.maven.surefire.booter.ForkedBooter.runSuitesInProcess(ForkedBooter.java:115)
	at org.apache.maven.surefire.booter.ForkedBooter.main(ForkedBooter.java:75)

afterSuite(org.xdi.oxd.server.SetUpTest)  Time elapsed: 0.022 sec  <<< FAILURE!
java.lang.NullPointerException
	at org.xdi.oxd.server.persistence.PersistenceServiceImpl.destroy(PersistenceServiceImpl.java:61)
	at org.xdi.oxd.server.ServerLauncher.shutdown(ServerLauncher.java:160)
	at org.xdi.oxd.server.SetUpTest.afterSuite(SetUpTest.java:55)
	at sun.reflect.NativeMethodAccessorImpl.invoke0(Native Method)
	at sun.reflect.NativeMethodAccessorImpl.invoke(NativeMethodAccessorImpl.java:62)
	at sun.reflect.DelegatingMethodAccessorImpl.invoke(DelegatingMethodAccessorImpl.java:43)
	at java.lang.reflect.Method.invoke(Method.java:498)
	at org.testng.internal.MethodInvocationHelper.invokeMethod(MethodInvocationHelper.java:80)
	at org.testng.internal.Invoker.invokeConfigurationMethod(Invoker.java:543)
	at org.testng.internal.Invoker.invokeConfigurations(Invoker.java:212)
	at org.testng.internal.Invoker.invokeConfigurations(Invoker.java:138)
	at org.testng.SuiteRunner.privateRun(SuiteRunner.java:308)
	at org.testng.SuiteRunner.run(SuiteRunner.java:240)
	at org.testng.SuiteRunnerWorker.runSuite(SuiteRunnerWorker.java:53)
	at org.testng.SuiteRunnerWorker.run(SuiteRunnerWorker.java:87)
	at org.testng.TestNG.runSuitesSequentially(TestNG.java:1137)
	at org.testng.TestNG.runSuitesLocally(TestNG.java:1062)
	at org.testng.TestNG.run(TestNG.java:974)
	at org.apache.maven.surefire.testng.TestNGExecutor.run(TestNGExecutor.java:178)
	at org.apache.maven.surefire.testng.TestNGXmlTestSuite.execute(TestNGXmlTestSuite.java:92)
	at org.apache.maven.surefire.testng.TestNGProvider.invoke(TestNGProvider.java:96)
	at sun.reflect.NativeMethodAccessorImpl.invoke0(Native Method)
	at sun.reflect.NativeMethodAccessorImpl.invoke(NativeMethodAccessorImpl.java:62)
	at sun.reflect.DelegatingMethodAccessorImpl.invoke(DelegatingMethodAccessorImpl.java:43)
	at java.lang.reflect.Method.invoke(Method.java:498)
	at org.apache.maven.surefire.util.ReflectionUtils.invokeMethodWithArray(ReflectionUtils.java:189)
	at org.apache.maven.surefire.booter.ProviderFactory$ProviderProxy.invoke(ProviderFactory.java:165)
	at org.apache.maven.surefire.booter.ProviderFactory.invokeProvider(ProviderFactory.java:85)
	at org.apache.maven.surefire.booter.ForkedBooter.runSuitesInProcess(ForkedBooter.java:115)
	at org.apache.maven.surefire.booter.ForkedBooter.main(ForkedBooter.java:75)


Results :

Failed tests:   register(org.xdi.oxd.client.RegisterSiteTest): Connection refused (Connection refused)
  removeSiteTest(org.xdi.oxd.client.RemoveSiteTest): Connection refused (Connection refused)
  test(org.xdi.oxd.client.GetAuthorizationUrlTest): Connection refused (Connection refused)
  test(org.xdi.oxd.client.GetTokensByCodeTest): Connection refused (Connection refused)
  test(org.xdi.oxd.client.GetUserInfoTest): Connection refused (Connection refused)
  test(org.xdi.oxd.client.GetLogoutUrlTest): Connection refused (Connection refused)
  test(org.xdi.oxd.client.CheckIdTokenTest): Connection refused (Connection refused)
  test(org.xdi.oxd.client.CheckAccessTokenTest): Connection refused (Connection refused)
  test(org.xdi.oxd.client.UmaFullTest): Connection refused (Connection refused)
  overwriteFalse(org.xdi.oxd.client.RsProtectTest): Connection refused (Connection refused)
  overwriteTrue(org.xdi.oxd.client.RsProtectTest): Connection refused (Connection refused)
  protect(org.xdi.oxd.client.RsProtectTest): Connection refused (Connection refused)
  protectWithScopeExpression(org.xdi.oxd.client.RsProtectTest): Connection refused (Connection refused)
  protectWithScopeExpressionSeconds(org.xdi.oxd.client.RsProtectTest): Connection refused (Connection refused)
  test(org.xdi.oxd.client.RsCheckAccessTest): Connection refused (Connection refused)
  test(org.xdi.oxd.client.RpGetRptTest): Connection refused (Connection refused)
  test(org.xdi.oxd.client.UmaGetClaimsGatheringUrlTest): Connection refused (Connection refused)
  test(org.xdi.oxd.client.IntrospectRptTest): Connection refused (Connection refused)
  setupClient(org.xdi.oxd.client.SetupClientTest): Connection refused (Connection refused)
  getClientToken(org.xdi.oxd.client.GetClientTokenTest): Connection refused (Connection refused)
  introspectAccessToken(org.xdi.oxd.client.IntrospectAccessTokenTest): Connection refused (Connection refused)
  afterSuite(org.xdi.oxd.server.SetUpTest)
  afterSuite(org.xdi.oxd.server.SetUpTest)

Tests run: 24, Failures: 23, Errors: 0, Skipped: 1

[INFO] ------------------------------------------------------------------------
[INFO] Reactor Summary:
[INFO] 
[INFO] oxD ................................................ SUCCESS [  0.058 s]
[INFO] oxD Common ......................................... SUCCESS [  3.032 s]
[INFO] oxD Client ......................................... SUCCESS [  1.640 s]
[INFO] oxD Server ......................................... FAILURE [ 12.731 s]
[INFO] oxD RP Client ...................................... SUCCESS [  1.030 s]
[INFO] oxd-https-extension ................................ SUCCESS [  1.801 s]
[INFO] ------------------------------------------------------------------------
[INFO] BUILD FAILURE
[INFO] ------------------------------------------------------------------------
[INFO] Total time: 44.417 s
[INFO] Finished at: 2018-10-23T15:37:56-04:00
[INFO] Final Memory: 123M/828M
[INFO] ------------------------------------------------------------------------
[ERROR] Failed to execute goal org.apache.maven.plugins:maven-surefire-plugin:2.12.4:test (default-test) on project oxd-server: There are test failures.
[ERROR] 
[ERROR] Please refer to /home/tomcat/.jenkins/jobs/oxD_3.1.5/workspace/oxd-server/target/surefire-reports for the individual test results.
[ERROR] -> [Help 1]
[ERROR] 
[ERROR] To see the full stack trace of the errors, re-run Maven with the -e switch.
[ERROR] Re-run Maven using the -X switch to enable full debug logging.
[ERROR] 
[ERROR] For more information about the errors and possible solutions, please read the following articles:
[ERROR] [Help 1] http://cwiki.apache.org/confluence/display/MAVEN/MojoFailureException
[ERROR] 
[ERROR] After correcting the problems, you can resume the build with the command
[ERROR]   mvn <goals> -rf :oxd-server
Build step 'Invoke top-level Maven targets' marked build as failure
[FINDBUGS] Skipping publisher since build result is FAILURE
TestNG Reports Processing: START
Looking for TestNG results report in workspace using pattern: **/testng-results.xml
Saving reports...
Processing '/home/tomcat/.jenkins/jobs/oxD_3.1.5/builds/39/testng/testng-results-1.xml'
Processing '/home/tomcat/.jenkins/jobs/oxD_3.1.5/builds/39/testng/testng-results.xml'
91.304344% of tests failed, which exceeded threshold of 0%. Marking build as UNSTABLE
TestNG Reports Processing: FINISH
Not sending mail to unregistered user noreply@github.com
Sending e-mails to: support@gluu.org yure@gluu.org
Finished: FAILURE