FailedConsole Output

Started by upstream project "gluu-core-bom_master" build number 135
originally caused by:
 Started by upstream project "CE Build 4.X" build number 396
 originally caused by:
  Started by user Yuriy Movchan
Running as SYSTEM
Building on master in workspace /home/jenkins/.jenkins/jobs/oxCore_master/workspace
The recommended git tool is: NONE
No credentials specified
 > git rev-parse --is-inside-work-tree # timeout=10
Fetching changes from the remote Git repository
 > git config remote.origin.url https://github.com/GluuFederation/oxCore # timeout=10
Fetching upstream changes from https://github.com/GluuFederation/oxCore
 > git --version # timeout=10
 > git --version # 'git version 1.8.3.1'
 > git fetch --tags --progress https://github.com/GluuFederation/oxCore +refs/heads/*:refs/remotes/origin/* # timeout=10
 > git rev-parse refs/remotes/origin/master^{commit} # timeout=10
 > git rev-parse refs/remotes/origin/origin/master^{commit} # timeout=10
Checking out Revision 3fb93bbbe12baf795f6d36edf37b7467831c2bd1 (refs/remotes/origin/master)
 > git config core.sparsecheckout # timeout=10
 > git checkout -f 3fb93bbbe12baf795f6d36edf37b7467831c2bd1 # timeout=10
Commit message: "Merge ScriptService into AbstractCustomScriptService"
 > git rev-list --no-walk 3fb93bbbe12baf795f6d36edf37b7467831c2bd1 # timeout=10
[workspace] $ /home/jenkins/.jenkins/tools/hudson.tasks.Maven_MavenInstallation/maven_3.3.9/bin/mvn -DVERSION_NAME=master -DMAVEN_SKIP_TESTS=false -Dmaven.test.skip=false clean compile install
[INFO] Scanning for projects...
[INFO] ------------------------------------------------------------------------
[INFO] Reactor Build Order:
[INFO] 
[INFO] oxCore
[INFO] persistence-annotation
[INFO] oxUtil
[INFO] persistence-filter
[INFO] persistence-model
[INFO] persistence-core
[INFO] persistence-ldap
[INFO] persistence-couchbase
[INFO] Persistence CDI services
[INFO] persistence-hybrid
[INFO] Persistence standalone services
[INFO] persistence-ldapSample
[INFO] Persistence Couchbase sample
[INFO] oxModel
[INFO] Caches support
[INFO] Caches support
[INFO] Configuration factories for standalone applications
[INFO] oxSaml
[INFO] Reusable CDI classes which not depend on specific framework
[INFO] Reusable CDI Script implementation
[INFO] oxService
[INFO] oxJsfUtil
[INFO] Java extensions
[INFO] Weld CDI timer implementation
[INFO] Reusable CDI security extension
[INFO] Reusable CDI exception handler extension
[INFO] Web application specific classes
[INFO] oxRadius
[INFO] Demo CDI services
[INFO]                                                                         
[INFO] ------------------------------------------------------------------------
[INFO] Building oxCore 5.0.0-SNAPSHOT
[INFO] ------------------------------------------------------------------------
[INFO] 
[INFO] --- maven-clean-plugin:2.4.1:clean (default-clean) @ oxcore ---
[INFO] 
[INFO] --- maven-install-plugin:2.3.1:install (default-install) @ oxcore ---
[INFO] Installing /home/jenkins/.jenkins/jobs/oxCore_master/workspace/pom.xml to /var/www/html/maven/org/gluu/oxcore/5.0.0-SNAPSHOT/oxcore-5.0.0-SNAPSHOT.pom
[INFO]                                                                         
[INFO] ------------------------------------------------------------------------
[INFO] Building persistence-annotation 5.0.0-SNAPSHOT
[INFO] ------------------------------------------------------------------------
[INFO] 
[INFO] --- maven-clean-plugin:2.4.1:clean (default-clean) @ oxcore-persistence-annotation ---
[INFO] Deleting /home/jenkins/.jenkins/jobs/oxCore_master/workspace/persistence-annotation/target
[INFO] 
[INFO] --- maven-resources-plugin:2.4:resources (default-resources) @ oxcore-persistence-annotation ---
[INFO] Using 'UTF-8' encoding to copy filtered resources.
[INFO] skip non existing resourceDirectory /home/jenkins/.jenkins/jobs/oxCore_master/workspace/persistence-annotation/src/main/resources
[INFO] 
[INFO] --- maven-compiler-plugin:2.3.2:compile (default-compile) @ oxcore-persistence-annotation ---
[INFO] Compiling 11 source files to /home/jenkins/.jenkins/jobs/oxCore_master/workspace/persistence-annotation/target/classes
[INFO] 
[INFO] --- maven-resources-plugin:2.4:resources (default-resources) @ oxcore-persistence-annotation ---
[INFO] Using 'UTF-8' encoding to copy filtered resources.
[INFO] skip non existing resourceDirectory /home/jenkins/.jenkins/jobs/oxCore_master/workspace/persistence-annotation/src/main/resources
[INFO] 
[INFO] --- maven-compiler-plugin:2.3.2:compile (default-compile) @ oxcore-persistence-annotation ---
[INFO] Nothing to compile - all classes are up to date
[INFO] 
[INFO] --- maven-resources-plugin:2.4:testResources (default-testResources) @ oxcore-persistence-annotation ---
[INFO] Using 'UTF-8' encoding to copy filtered resources.
[INFO] skip non existing resourceDirectory /home/jenkins/.jenkins/jobs/oxCore_master/workspace/persistence-annotation/src/test/resources
[INFO] 
[INFO] --- maven-compiler-plugin:2.3.2:testCompile (default-testCompile) @ oxcore-persistence-annotation ---
[INFO] No sources to compile
[INFO] 
[INFO] --- maven-surefire-plugin:2.7.2:test (default-test) @ oxcore-persistence-annotation ---
[INFO] No tests to run.
[INFO] Surefire report directory: /home/jenkins/.jenkins/jobs/oxCore_master/workspace/persistence-annotation/target/surefire-reports

-------------------------------------------------------
 T E S T S
-------------------------------------------------------
There are no tests to run.

Results :

Tests run: 0, Failures: 0, Errors: 0, Skipped: 0

[INFO] 
[INFO] --- maven-jar-plugin:2.4:jar (default-jar) @ oxcore-persistence-annotation ---
[INFO] Building jar: /home/jenkins/.jenkins/jobs/oxCore_master/workspace/persistence-annotation/target/oxcore-persistence-annotation-5.0.0-SNAPSHOT.jar
[INFO] 
[INFO] --- maven-install-plugin:2.3.1:install (default-install) @ oxcore-persistence-annotation ---
[INFO] Installing /home/jenkins/.jenkins/jobs/oxCore_master/workspace/persistence-annotation/target/oxcore-persistence-annotation-5.0.0-SNAPSHOT.jar to /var/www/html/maven/org/gluu/oxcore-persistence-annotation/5.0.0-SNAPSHOT/oxcore-persistence-annotation-5.0.0-SNAPSHOT.jar
[INFO] Installing /home/jenkins/.jenkins/jobs/oxCore_master/workspace/persistence-annotation/pom.xml to /var/www/html/maven/org/gluu/oxcore-persistence-annotation/5.0.0-SNAPSHOT/oxcore-persistence-annotation-5.0.0-SNAPSHOT.pom
[INFO]                                                                         
[INFO] ------------------------------------------------------------------------
[INFO] Building oxUtil 5.0.0-SNAPSHOT
[INFO] ------------------------------------------------------------------------
[INFO] 
[INFO] --- maven-clean-plugin:2.4.1:clean (default-clean) @ oxcore-util ---
[INFO] Deleting /home/jenkins/.jenkins/jobs/oxCore_master/workspace/oxUtil/target
[INFO] 
[INFO] --- maven-resources-plugin:2.4:resources (default-resources) @ oxcore-util ---
[INFO] Using 'UTF-8' encoding to copy filtered resources.
[INFO] skip non existing resourceDirectory /home/jenkins/.jenkins/jobs/oxCore_master/workspace/oxUtil/src/main/resources
[INFO] 
[INFO] --- maven-compiler-plugin:2.3.2:compile (default-compile) @ oxcore-util ---
[INFO] Compiling 62 source files to /home/jenkins/.jenkins/jobs/oxCore_master/workspace/oxUtil/target/classes
[INFO] 
[INFO] --- maven-resources-plugin:2.4:resources (default-resources) @ oxcore-util ---
[INFO] Using 'UTF-8' encoding to copy filtered resources.
[INFO] skip non existing resourceDirectory /home/jenkins/.jenkins/jobs/oxCore_master/workspace/oxUtil/src/main/resources
[INFO] 
[INFO] --- maven-compiler-plugin:2.3.2:compile (default-compile) @ oxcore-util ---
[INFO] Nothing to compile - all classes are up to date
[INFO] 
[INFO] --- maven-resources-plugin:2.4:testResources (default-testResources) @ oxcore-util ---
[INFO] Using 'UTF-8' encoding to copy filtered resources.
[INFO] skip non existing resourceDirectory /home/jenkins/.jenkins/jobs/oxCore_master/workspace/oxUtil/src/test/resources
[INFO] 
[INFO] --- maven-compiler-plugin:2.3.2:testCompile (default-testCompile) @ oxcore-util ---
[INFO] No sources to compile
[INFO] 
[INFO] --- maven-surefire-plugin:2.7.2:test (default-test) @ oxcore-util ---
[INFO] No tests to run.
[INFO] Surefire report directory: /home/jenkins/.jenkins/jobs/oxCore_master/workspace/oxUtil/target/surefire-reports

-------------------------------------------------------
 T E S T S
-------------------------------------------------------
There are no tests to run.

Results :

Tests run: 0, Failures: 0, Errors: 0, Skipped: 0

[INFO] 
[INFO] --- maven-jar-plugin:2.4:jar (default-jar) @ oxcore-util ---
[INFO] Building jar: /home/jenkins/.jenkins/jobs/oxCore_master/workspace/oxUtil/target/oxcore-util-5.0.0-SNAPSHOT.jar
[INFO] 
[INFO] --- maven-install-plugin:2.3.1:install (default-install) @ oxcore-util ---
[INFO] Installing /home/jenkins/.jenkins/jobs/oxCore_master/workspace/oxUtil/target/oxcore-util-5.0.0-SNAPSHOT.jar to /var/www/html/maven/org/gluu/oxcore-util/5.0.0-SNAPSHOT/oxcore-util-5.0.0-SNAPSHOT.jar
[INFO] Installing /home/jenkins/.jenkins/jobs/oxCore_master/workspace/oxUtil/pom.xml to /var/www/html/maven/org/gluu/oxcore-util/5.0.0-SNAPSHOT/oxcore-util-5.0.0-SNAPSHOT.pom
[INFO] ------------------------------------------------------------------------
[INFO] Reactor Summary:
[INFO] 
[INFO] oxCore ............................................. SUCCESS [  0.568 s]
[INFO] persistence-annotation ............................. SUCCESS [  3.176 s]
[INFO] oxUtil ............................................. FAILURE [  5.340 s]
[INFO] persistence-filter ................................. SKIPPED
[INFO] persistence-model .................................. SKIPPED
[INFO] persistence-core ................................... SKIPPED
[INFO] persistence-ldap ................................... SKIPPED
[INFO] persistence-couchbase .............................. SKIPPED
[INFO] Persistence CDI services ........................... SKIPPED
[INFO] persistence-hybrid ................................. SKIPPED
[INFO] Persistence standalone services .................... SKIPPED
[INFO] persistence-ldapSample ............................. SKIPPED
[INFO] Persistence Couchbase sample ....................... SKIPPED
[INFO] oxModel ............................................ SKIPPED
[INFO] Caches support ..................................... SKIPPED
[INFO] Caches support ..................................... SKIPPED
[INFO] Configuration factories for standalone applications  SKIPPED
[INFO] oxSaml ............................................. SKIPPED
[INFO] Reusable CDI classes which not depend on specific framework SKIPPED
[INFO] Reusable CDI Script implementation ................. SKIPPED
[INFO] oxService .......................................... SKIPPED
[INFO] oxJsfUtil .......................................... SKIPPED
[INFO] Java extensions .................................... SKIPPED
[INFO] Weld CDI timer implementation ...................... SKIPPED
[INFO] Reusable CDI security extension .................... SKIPPED
[INFO] Reusable CDI exception handler extension ........... SKIPPED
[INFO] Web application specific classes ................... SKIPPED
[INFO] oxRadius ........................................... SKIPPED
[INFO] Demo CDI services .................................. SKIPPED
[INFO] ------------------------------------------------------------------------
[INFO] BUILD FAILURE
[INFO] ------------------------------------------------------------------------
[INFO] Total time: 11.518 s
[INFO] Finished at: 2020-09-07T17:42:46+00:00
[INFO] Final Memory: 39M/389M
[INFO] ------------------------------------------------------------------------
[ERROR] Failed to execute goal org.apache.maven.plugins:maven-install-plugin:2.3.1:install (default-install) on project oxcore-util: Failed to install metadata org.gluu:oxcore-util/maven-metadata.xml: Could not read metadata /var/www/html/maven/org/gluu/oxcore-util/maven-metadata-local.xml: input contained no data -> [Help 1]
[ERROR] 
[ERROR] To see the full stack trace of the errors, re-run Maven with the -e switch.
[ERROR] Re-run Maven using the -X switch to enable full debug logging.
[ERROR] 
[ERROR] For more information about the errors and possible solutions, please read the following articles:
[ERROR] [Help 1] http://cwiki.apache.org/confluence/display/MAVEN/MojoExecutionException
[ERROR] 
[ERROR] After correcting the problems, you can resume the build with the command
[ERROR]   mvn <goals> -rf :oxcore-util
Build step 'Invoke top-level Maven targets' marked build as failure
[FINDBUGS] Skipping publisher since build result is FAILURE
TestNG Reports Processing: START
Looking for TestNG results report in workspace using pattern: **/testng-results.xml
testng-results.xml was last modified before this build started. Ignoring it.
testng-results.xml was last modified before this build started. Ignoring it.
testng-results.xml was last modified before this build started. Ignoring it.
testng-results.xml was last modified before this build started. Ignoring it.
testng-results.xml was last modified before this build started. Ignoring it.
Saving reports...
Found matching files but did not find any TestNG results.
Sending e-mails to: support@gluu.org
Finished: FAILURE