FailedConsole Output

Started by user Yuriy Movchan
Running as SYSTEM
Building on master in workspace /home/jenkins/.jenkins/jobs/oxCore_3.1.7/workspace
The recommended git tool is: NONE
No credentials specified
 > git rev-parse --is-inside-work-tree # timeout=10
Fetching changes from the remote Git repository
 > git config remote.origin.url https://github.com/GluuFederation/oxCore # timeout=10
Fetching upstream changes from https://github.com/GluuFederation/oxCore
 > git --version # timeout=10
 > git --version # 'git version 1.8.3.1'
 > git fetch --tags --progress https://github.com/GluuFederation/oxCore +refs/heads/*:refs/remotes/origin/* # timeout=10
 > git rev-parse refs/remotes/origin/version_4.2.3.sp2^{commit} # timeout=10
 > git rev-parse refs/remotes/origin/origin/version_4.2.3.sp2^{commit} # timeout=10
Checking out Revision 1143a583fd701b02c52f02327543171617287348 (refs/remotes/origin/version_4.2.3.sp2)
 > git config core.sparsecheckout # timeout=10
 > git checkout -f 1143a583fd701b02c52f02327543171617287348 # timeout=10
Commit message: "feat: add test to check custom field removal"
First time build. Skipping changelog.
[workspace] $ /home/jenkins/.jenkins/tools/hudson.tasks.Maven_MavenInstallation/maven_3.3.9/bin/mvn -DVERSION_NAME=version_4.2.3.sp2 -DMAVEN_SKIP_TESTS=true -Dmaven.test.skip=true clean compile install findbugs:findbugs checkstyle:checkstyle javadoc:javadoc site
[INFO] Scanning for projects...
[INFO] ------------------------------------------------------------------------
[INFO] Reactor Build Order:
[INFO] 
[INFO] oxCore
[INFO] persistence-annotation
[INFO] oxUtil
[INFO] persistence-filter
[INFO] persistence-model
[INFO] persistence-core
[INFO] persistence-ldap
[INFO] persistence-couchbase
[INFO] Persistence CDI services
[INFO] persistence-hybrid
[INFO] Persistence standalone services
[INFO] persistence-ldapSample
[INFO] Persistence Couchbase sample
[INFO] oxModel
[INFO] Caches support
[INFO] Caches support
[INFO] Configuration factories for standalone applications
[INFO] oxSaml
[INFO] Reusable CDI classes which not depend on specific framework
[INFO] Reusable CDI Script implementation
[INFO] oxService
[INFO] oxJsfUtil
[INFO] Java extensions
[INFO] Weld CDI timer implementation
[INFO] Reusable CDI security extension
[INFO] Reusable CDI exception handler extension
[INFO] Web application specific classes
[INFO] oxRadius
[INFO] Demo CDI services
[INFO]                                                                         
[INFO] ------------------------------------------------------------------------
[INFO] Building oxCore 4.2.3.sp2
[INFO] ------------------------------------------------------------------------
[INFO] 
[INFO] --- maven-clean-plugin:2.4.1:clean (default-clean) @ oxcore ---
[INFO] Deleting /home/jenkins/.jenkins/jobs/oxCore_3.1.7/workspace/target
[INFO] 
[INFO] --- maven-install-plugin:2.3.1:install (default-install) @ oxcore ---
[INFO] Installing /home/jenkins/.jenkins/jobs/oxCore_3.1.7/workspace/pom.xml to /var/www/html/maven/org/gluu/oxcore/4.2.3.sp2/oxcore-4.2.3.sp2.pom
[INFO] 
[INFO] --- findbugs-maven-plugin:3.0.4:findbugs (default-cli) @ oxcore ---
[INFO] 
[INFO] --- maven-checkstyle-plugin:3.0.0:checkstyle (default-cli) @ oxcore ---
[INFO] 
[INFO] >>> maven-javadoc-plugin:3.0.1:javadoc (default-cli) > generate-sources @ oxcore >>>
[INFO] 
[INFO] <<< maven-javadoc-plugin:3.0.1:javadoc (default-cli) < generate-sources @ oxcore <<<
[INFO] 
[INFO] --- maven-javadoc-plugin:3.0.1:javadoc (default-cli) @ oxcore ---
[INFO] 
[INFO] --- maven-site-plugin:2.1.1:site (default-site) @ oxcore ---
[INFO]                                                                         
[INFO] ------------------------------------------------------------------------
[INFO] Building persistence-annotation 4.2.3.sp2
[INFO] ------------------------------------------------------------------------
[INFO] 
[INFO] --- maven-clean-plugin:2.4.1:clean (default-clean) @ oxcore-persistence-annotation ---
[INFO] Deleting /home/jenkins/.jenkins/jobs/oxCore_3.1.7/workspace/persistence-annotation/target
[INFO] 
[INFO] --- maven-resources-plugin:2.4:resources (default-resources) @ oxcore-persistence-annotation ---
[INFO] Using 'UTF-8' encoding to copy filtered resources.
[INFO] skip non existing resourceDirectory /home/jenkins/.jenkins/jobs/oxCore_3.1.7/workspace/persistence-annotation/src/main/resources
[INFO] 
[INFO] --- maven-compiler-plugin:2.3.2:compile (default-compile) @ oxcore-persistence-annotation ---
[INFO] Compiling 11 source files to /home/jenkins/.jenkins/jobs/oxCore_3.1.7/workspace/persistence-annotation/target/classes
[INFO] 
[INFO] --- maven-resources-plugin:2.4:resources (default-resources) @ oxcore-persistence-annotation ---
[INFO] Using 'UTF-8' encoding to copy filtered resources.
[INFO] skip non existing resourceDirectory /home/jenkins/.jenkins/jobs/oxCore_3.1.7/workspace/persistence-annotation/src/main/resources
[INFO] 
[INFO] --- maven-compiler-plugin:2.3.2:compile (default-compile) @ oxcore-persistence-annotation ---
[INFO] Nothing to compile - all classes are up to date
[INFO] 
[INFO] --- maven-resources-plugin:2.4:testResources (default-testResources) @ oxcore-persistence-annotation ---
[INFO] Using 'UTF-8' encoding to copy filtered resources.
[INFO] skip non existing resourceDirectory /home/jenkins/.jenkins/jobs/oxCore_3.1.7/workspace/persistence-annotation/src/test/resources
[INFO] 
[INFO] --- maven-compiler-plugin:2.3.2:testCompile (default-testCompile) @ oxcore-persistence-annotation ---
[INFO] Not compiling test sources
[INFO] 
[INFO] --- maven-surefire-plugin:2.7.2:test (default-test) @ oxcore-persistence-annotation ---
[INFO] Tests are skipped.
[INFO] 
[INFO] --- maven-jar-plugin:2.4:jar (default-jar) @ oxcore-persistence-annotation ---
[INFO] Building jar: /home/jenkins/.jenkins/jobs/oxCore_3.1.7/workspace/persistence-annotation/target/oxcore-persistence-annotation-4.2.3.sp2.jar
[INFO] 
[INFO] --- maven-install-plugin:2.3.1:install (default-install) @ oxcore-persistence-annotation ---
[INFO] Installing /home/jenkins/.jenkins/jobs/oxCore_3.1.7/workspace/persistence-annotation/target/oxcore-persistence-annotation-4.2.3.sp2.jar to /var/www/html/maven/org/gluu/oxcore-persistence-annotation/4.2.3.sp2/oxcore-persistence-annotation-4.2.3.sp2.jar
[INFO] Installing /home/jenkins/.jenkins/jobs/oxCore_3.1.7/workspace/persistence-annotation/pom.xml to /var/www/html/maven/org/gluu/oxcore-persistence-annotation/4.2.3.sp2/oxcore-persistence-annotation-4.2.3.sp2.pom
[INFO] 
[INFO] --- findbugs-maven-plugin:3.0.4:findbugs (default-cli) @ oxcore-persistence-annotation ---
[INFO] Fork Value is true
[INFO] Done FindBugs Analysis....
[INFO] 
[INFO] --- maven-checkstyle-plugin:3.0.0:checkstyle (default-cli) @ oxcore-persistence-annotation ---
[INFO] Starting audit...
[ERROR] /home/jenkins/.jenkins/jobs/oxCore_3.1.7/workspace/persistence-annotation/src/main/java/org/gluu/persist/annotation/ObjectClass.java:23:1: File contains tab characters (this is the first instance). [FileTabCharacter]
Audit done.
[INFO] ------------------------------------------------------------------------
[INFO] Reactor Summary:
[INFO] 
[INFO] oxCore ............................................. SUCCESS [  3.582 s]
[INFO] persistence-annotation ............................. FAILURE [  6.778 s]
[INFO] oxUtil ............................................. SKIPPED
[INFO] persistence-filter ................................. SKIPPED
[INFO] persistence-model .................................. SKIPPED
[INFO] persistence-core ................................... SKIPPED
[INFO] persistence-ldap ................................... SKIPPED
[INFO] persistence-couchbase .............................. SKIPPED
[INFO] Persistence CDI services ........................... SKIPPED
[INFO] persistence-hybrid ................................. SKIPPED
[INFO] Persistence standalone services .................... SKIPPED
[INFO] persistence-ldapSample ............................. SKIPPED
[INFO] Persistence Couchbase sample ....................... SKIPPED
[INFO] oxModel ............................................ SKIPPED
[INFO] Caches support ..................................... SKIPPED
[INFO] Caches support ..................................... SKIPPED
[INFO] Configuration factories for standalone applications  SKIPPED
[INFO] oxSaml ............................................. SKIPPED
[INFO] Reusable CDI classes which not depend on specific framework SKIPPED
[INFO] Reusable CDI Script implementation ................. SKIPPED
[INFO] oxService .......................................... SKIPPED
[INFO] oxJsfUtil .......................................... SKIPPED
[INFO] Java extensions .................................... SKIPPED
[INFO] Weld CDI timer implementation ...................... SKIPPED
[INFO] Reusable CDI security extension .................... SKIPPED
[INFO] Reusable CDI exception handler extension ........... SKIPPED
[INFO] Web application specific classes ................... SKIPPED
[INFO] oxRadius ........................................... SKIPPED
[INFO] Demo CDI services .................................. SKIPPED
[INFO] ------------------------------------------------------------------------
[INFO] BUILD FAILURE
[INFO] ------------------------------------------------------------------------
[INFO] Total time: 12.366 s
[INFO] Finished at: 2021-09-10T15:07:26+00:00
[INFO] Final Memory: 65M/702M
[INFO] ------------------------------------------------------------------------
[ERROR] Failed to execute goal org.apache.maven.plugins:maven-checkstyle-plugin:3.0.0:checkstyle (default-cli) on project oxcore-persistence-annotation: An error has occurred in Checkstyle report generation. Failed during checkstyle execution: There is 1 error reported by Checkstyle 6.18 with checkstyle.xml ruleset. -> [Help 1]
[ERROR] 
[ERROR] To see the full stack trace of the errors, re-run Maven with the -e switch.
[ERROR] Re-run Maven using the -X switch to enable full debug logging.
[ERROR] 
[ERROR] For more information about the errors and possible solutions, please read the following articles:
[ERROR] [Help 1] http://cwiki.apache.org/confluence/display/MAVEN/MojoExecutionException
[ERROR] 
[ERROR] After correcting the problems, you can resume the build with the command
[ERROR]   mvn <goals> -rf :oxcore-persistence-annotation
Build step 'Invoke top-level Maven targets' marked build as failure
[FINDBUGS] Skipping publisher since build result is FAILURE
TestNG Reports Processing: START
Looking for TestNG results report in workspace using pattern: **/testng-results.xml
testng-results.xml was last modified before this build started. Ignoring it.
Saving reports...
Found matching files but did not find any TestNG results.
Not sending mail to unregistered user Yuriy.Movchan@gmail.com
Sending e-mails to: support@gluu.org