FailedConsole Output

Started by user Yuriy Movchan
Running as SYSTEM
Building on master in workspace /home/jenkins/.jenkins/jobs/oxCore_3.1.7/workspace
The recommended git tool is: NONE
No credentials specified
 > git rev-parse --is-inside-work-tree # timeout=10
Fetching changes from the remote Git repository
 > git config remote.origin.url https://github.com/GluuFederation/oxCore # timeout=10
Fetching upstream changes from https://github.com/GluuFederation/oxCore
 > git --version # timeout=10
 > git --version # 'git version 1.8.3.1'
 > git fetch --tags --progress https://github.com/GluuFederation/oxCore +refs/heads/*:refs/remotes/origin/* # timeout=10
 > git rev-parse refs/remotes/origin/version_3.1.7.sp1^{commit} # timeout=10
 > git rev-parse refs/remotes/origin/origin/version_3.1.7.sp1^{commit} # timeout=10
Checking out Revision 5c54622dda7431333154fddd09595814531e5b82 (refs/remotes/origin/version_3.1.7.sp1)
 > git config core.sparsecheckout # timeout=10
 > git checkout -f 5c54622dda7431333154fddd09595814531e5b82 # timeout=10
Commit message: "feat: backport Fix XML doc reading and signature validation"
First time build. Skipping changelog.
[workspace] $ /home/jenkins/.jenkins/tools/hudson.tasks.Maven_MavenInstallation/maven_3.3.9/bin/mvn -DVERSION_NAME=version_3.1.7.sp1 -DMAVEN_SKIP_TESTS=false -Dmaven.test.skip=false clean compile install findbugs:findbugs checkstyle:checkstyle javadoc:javadoc site
[INFO] Scanning for projects...
[INFO] ------------------------------------------------------------------------
[INFO] Reactor Build Order:
[INFO] 
[INFO] oxCore
[INFO] oxLdap-annotations
[INFO] oxUtil
[INFO] oxLdap
[INFO] oxLdapSample
[INFO] oxModel
[INFO] oxSaml
[INFO] oxService
[INFO] oxTomcat
[INFO] oxServer
[INFO] oxGwt
[INFO] oxJsfUtil
[INFO]                                                                         
[INFO] ------------------------------------------------------------------------
[INFO] Building oxCore 3.1.7.sp1
[INFO] ------------------------------------------------------------------------
[INFO] 
[INFO] --- maven-clean-plugin:2.4.1:clean (default-clean) @ oxcore ---
[INFO] Deleting /home/jenkins/.jenkins/jobs/oxCore_3.1.7/workspace/target
[INFO] 
[INFO] --- maven-install-plugin:2.3.1:install (default-install) @ oxcore ---
[INFO] Installing /home/jenkins/.jenkins/jobs/oxCore_3.1.7/workspace/pom.xml to /var/www/html/maven/org/xdi/oxcore/3.1.7.sp1/oxcore-3.1.7.sp1.pom
[INFO] 
[INFO] --- findbugs-maven-plugin:3.0.4:findbugs (default-cli) @ oxcore ---
[INFO] 
[INFO] --- maven-checkstyle-plugin:3.0.0:checkstyle (default-cli) @ oxcore ---
[INFO] 
[INFO] >>> maven-javadoc-plugin:3.0.1:javadoc (default-cli) > generate-sources @ oxcore >>>
[INFO] 
[INFO] <<< maven-javadoc-plugin:3.0.1:javadoc (default-cli) < generate-sources @ oxcore <<<
[INFO] 
[INFO] --- maven-javadoc-plugin:3.0.1:javadoc (default-cli) @ oxcore ---
[INFO] 
[INFO] --- maven-site-plugin:2.1.1:site (default-site) @ oxcore ---
Downloading: http://ox.gluu.org/maven/org/apache/maven/skins/maven-default-skin/maven-metadata.xml
Downloading: http://repo1.maven.org/maven2/org/apache/maven/skins/maven-default-skin/maven-metadata.xml
Downloading: http://repository.jboss.org/nexus/content/groups/public-jboss/org/apache/maven/skins/maven-default-skin/maven-metadata.xml



[WARNING] Could not transfer metadata org.apache.maven.skins:maven-default-skin/maven-metadata.xml from/to central (http://repo1.maven.org/maven2): Failed to transfer file: http://repo1.maven.org/maven2/org/apache/maven/skins/maven-default-skin/maven-metadata.xml. Return code is: 501 , ReasonPhrase:HTTPS Required.
[INFO]                                                                         
[INFO] ------------------------------------------------------------------------
[INFO] Building oxLdap-annotations 3.1.7.sp1
[INFO] ------------------------------------------------------------------------
[INFO] 
[INFO] --- maven-clean-plugin:2.4.1:clean (default-clean) @ oxcore-ldap-annotations ---
[INFO] Deleting /home/jenkins/.jenkins/jobs/oxCore_3.1.7/workspace/oxLdap-annotations/target
[INFO] 
[INFO] --- maven-resources-plugin:2.4:resources (default-resources) @ oxcore-ldap-annotations ---
[INFO] Using 'UTF-8' encoding to copy filtered resources.
[INFO] skip non existing resourceDirectory /home/jenkins/.jenkins/jobs/oxCore_3.1.7/workspace/oxLdap-annotations/src/main/resources
[INFO] 
[INFO] --- maven-compiler-plugin:2.3.2:compile (default-compile) @ oxcore-ldap-annotations ---
[INFO] Compiling 9 source files to /home/jenkins/.jenkins/jobs/oxCore_3.1.7/workspace/oxLdap-annotations/target/classes
[INFO] 
[INFO] --- maven-resources-plugin:2.4:resources (default-resources) @ oxcore-ldap-annotations ---
[INFO] Using 'UTF-8' encoding to copy filtered resources.
[INFO] skip non existing resourceDirectory /home/jenkins/.jenkins/jobs/oxCore_3.1.7/workspace/oxLdap-annotations/src/main/resources
[INFO] 
[INFO] --- maven-compiler-plugin:2.3.2:compile (default-compile) @ oxcore-ldap-annotations ---
[INFO] Nothing to compile - all classes are up to date
[INFO] 
[INFO] --- maven-resources-plugin:2.4:testResources (default-testResources) @ oxcore-ldap-annotations ---
[INFO] Using 'UTF-8' encoding to copy filtered resources.
[INFO] skip non existing resourceDirectory /home/jenkins/.jenkins/jobs/oxCore_3.1.7/workspace/oxLdap-annotations/src/test/resources
[INFO] 
[INFO] --- maven-compiler-plugin:2.3.2:testCompile (default-testCompile) @ oxcore-ldap-annotations ---
[INFO] No sources to compile
[INFO] 
[INFO] --- maven-surefire-plugin:2.7.2:test (default-test) @ oxcore-ldap-annotations ---
[INFO] No tests to run.
[INFO] Surefire report directory: /home/jenkins/.jenkins/jobs/oxCore_3.1.7/workspace/oxLdap-annotations/target/surefire-reports

-------------------------------------------------------
 T E S T S
-------------------------------------------------------
There are no tests to run.

Results :

Tests run: 0, Failures: 0, Errors: 0, Skipped: 0

[INFO] 
[INFO] --- maven-jar-plugin:2.4:jar (default-jar) @ oxcore-ldap-annotations ---
[INFO] Building jar: /home/jenkins/.jenkins/jobs/oxCore_3.1.7/workspace/oxLdap-annotations/target/oxcore-ldap-annotations-3.1.7.sp1.jar
[INFO] 
[INFO] --- maven-install-plugin:2.3.1:install (default-install) @ oxcore-ldap-annotations ---
[INFO] Installing /home/jenkins/.jenkins/jobs/oxCore_3.1.7/workspace/oxLdap-annotations/target/oxcore-ldap-annotations-3.1.7.sp1.jar to /var/www/html/maven/org/xdi/oxcore-ldap-annotations/3.1.7.sp1/oxcore-ldap-annotations-3.1.7.sp1.jar
[INFO] Installing /home/jenkins/.jenkins/jobs/oxCore_3.1.7/workspace/oxLdap-annotations/pom.xml to /var/www/html/maven/org/xdi/oxcore-ldap-annotations/3.1.7.sp1/oxcore-ldap-annotations-3.1.7.sp1.pom
[INFO] 
[INFO] --- findbugs-maven-plugin:3.0.4:findbugs (default-cli) @ oxcore-ldap-annotations ---
[INFO] Fork Value is true
[INFO] Done FindBugs Analysis....
[INFO] 
[INFO] --- maven-checkstyle-plugin:3.0.0:checkstyle (default-cli) @ oxcore-ldap-annotations ---
[INFO] There are 57 errors reported by Checkstyle 6.18 with sun_checks.xml ruleset.
[WARNING] Unable to locate Source XRef to link to - DISABLED
[INFO] 
[INFO] >>> maven-javadoc-plugin:3.0.1:javadoc (default-cli) > generate-sources @ oxcore-ldap-annotations >>>
[INFO] 
[INFO] <<< maven-javadoc-plugin:3.0.1:javadoc (default-cli) < generate-sources @ oxcore-ldap-annotations <<<
[INFO] 
[INFO] --- maven-javadoc-plugin:3.0.1:javadoc (default-cli) @ oxcore-ldap-annotations ---
[INFO] 
Loading source files for package org.gluu.site.ldap.persistence.annotation...
Constructing Javadoc information...
Standard Doclet version 1.8.0_221
Building tree for all the packages and classes...
Generating /home/jenkins/.jenkins/jobs/oxCore_3.1.7/workspace/oxLdap-annotations/target/site/apidocs/org/gluu/site/ldap/persistence/annotation/LdapAttribute.html...
Generating /home/jenkins/.jenkins/jobs/oxCore_3.1.7/workspace/oxLdap-annotations/target/site/apidocs/org/gluu/site/ldap/persistence/annotation/LdapAttributesList.html...
Generating /home/jenkins/.jenkins/jobs/oxCore_3.1.7/workspace/oxLdap-annotations/target/site/apidocs/org/gluu/site/ldap/persistence/annotation/LdapCustomObjectClass.html...
Generating /home/jenkins/.jenkins/jobs/oxCore_3.1.7/workspace/oxLdap-annotations/target/site/apidocs/org/gluu/site/ldap/persistence/annotation/LdapDN.html...
Generating /home/jenkins/.jenkins/jobs/oxCore_3.1.7/workspace/oxLdap-annotations/target/site/apidocs/org/gluu/site/ldap/persistence/annotation/LdapEntry.html...
Generating /home/jenkins/.jenkins/jobs/oxCore_3.1.7/workspace/oxLdap-annotations/target/site/apidocs/org/gluu/site/ldap/persistence/annotation/LdapEnum.html...
Generating /home/jenkins/.jenkins/jobs/oxCore_3.1.7/workspace/oxLdap-annotations/target/site/apidocs/org/gluu/site/ldap/persistence/annotation/LdapJsonObject.html...
Generating /home/jenkins/.jenkins/jobs/oxCore_3.1.7/workspace/oxLdap-annotations/target/site/apidocs/org/gluu/site/ldap/persistence/annotation/LdapObjectClass.html...
Generating /home/jenkins/.jenkins/jobs/oxCore_3.1.7/workspace/oxLdap-annotations/target/site/apidocs/org/gluu/site/ldap/persistence/annotation/LdapSchemaEntry.html...
Generating /home/jenkins/.jenkins/jobs/oxCore_3.1.7/workspace/oxLdap-annotations/target/site/apidocs/org/gluu/site/ldap/persistence/annotation/package-frame.html...
Generating /home/jenkins/.jenkins/jobs/oxCore_3.1.7/workspace/oxLdap-annotations/target/site/apidocs/org/gluu/site/ldap/persistence/annotation/package-summary.html...
Generating /home/jenkins/.jenkins/jobs/oxCore_3.1.7/workspace/oxLdap-annotations/target/site/apidocs/org/gluu/site/ldap/persistence/annotation/package-tree.html...
Generating /home/jenkins/.jenkins/jobs/oxCore_3.1.7/workspace/oxLdap-annotations/target/site/apidocs/constant-values.html...
Generating /home/jenkins/.jenkins/jobs/oxCore_3.1.7/workspace/oxLdap-annotations/target/site/apidocs/org/gluu/site/ldap/persistence/annotation/class-use/LdapSchemaEntry.html...
Generating /home/jenkins/.jenkins/jobs/oxCore_3.1.7/workspace/oxLdap-annotations/target/site/apidocs/org/gluu/site/ldap/persistence/annotation/class-use/LdapObjectClass.html...
Generating /home/jenkins/.jenkins/jobs/oxCore_3.1.7/workspace/oxLdap-annotations/target/site/apidocs/org/gluu/site/ldap/persistence/annotation/class-use/LdapJsonObject.html...
Generating /home/jenkins/.jenkins/jobs/oxCore_3.1.7/workspace/oxLdap-annotations/target/site/apidocs/org/gluu/site/ldap/persistence/annotation/class-use/LdapEnum.html...
Generating /home/jenkins/.jenkins/jobs/oxCore_3.1.7/workspace/oxLdap-annotations/target/site/apidocs/org/gluu/site/ldap/persistence/annotation/class-use/LdapEntry.html...
Generating /home/jenkins/.jenkins/jobs/oxCore_3.1.7/workspace/oxLdap-annotations/target/site/apidocs/org/gluu/site/ldap/persistence/annotation/class-use/LdapDN.html...
Generating /home/jenkins/.jenkins/jobs/oxCore_3.1.7/workspace/oxLdap-annotations/target/site/apidocs/org/gluu/site/ldap/persistence/annotation/class-use/LdapCustomObjectClass.html...
Generating /home/jenkins/.jenkins/jobs/oxCore_3.1.7/workspace/oxLdap-annotations/target/site/apidocs/org/gluu/site/ldap/persistence/annotation/class-use/LdapAttributesList.html...
Generating /home/jenkins/.jenkins/jobs/oxCore_3.1.7/workspace/oxLdap-annotations/target/site/apidocs/org/gluu/site/ldap/persistence/annotation/class-use/LdapAttribute.html...
Generating /home/jenkins/.jenkins/jobs/oxCore_3.1.7/workspace/oxLdap-annotations/target/site/apidocs/org/gluu/site/ldap/persistence/annotation/package-use.html...
Building index for all the packages and classes...
Generating /home/jenkins/.jenkins/jobs/oxCore_3.1.7/workspace/oxLdap-annotations/target/site/apidocs/overview-tree.html...
Generating /home/jenkins/.jenkins/jobs/oxCore_3.1.7/workspace/oxLdap-annotations/target/site/apidocs/index-all.html...
Generating /home/jenkins/.jenkins/jobs/oxCore_3.1.7/workspace/oxLdap-annotations/target/site/apidocs/deprecated-list.html...
Building index for all classes...
Generating /home/jenkins/.jenkins/jobs/oxCore_3.1.7/workspace/oxLdap-annotations/target/site/apidocs/allclasses-frame.html...
Generating /home/jenkins/.jenkins/jobs/oxCore_3.1.7/workspace/oxLdap-annotations/target/site/apidocs/allclasses-noframe.html...
Generating /home/jenkins/.jenkins/jobs/oxCore_3.1.7/workspace/oxLdap-annotations/target/site/apidocs/index.html...
Generating /home/jenkins/.jenkins/jobs/oxCore_3.1.7/workspace/oxLdap-annotations/target/site/apidocs/help-doc.html...
10 warnings
[WARNING] Javadoc Warnings
[WARNING] /home/jenkins/.jenkins/jobs/oxCore_3.1.7/workspace/oxLdap-annotations/src/main/java/org/gluu/site/ldap/persistence/annotation/LdapAttribute.java:32: warning: no @return
[WARNING] boolean ignoreDuringRead() default false;
[WARNING] ^
[WARNING] /home/jenkins/.jenkins/jobs/oxCore_3.1.7/workspace/oxLdap-annotations/src/main/java/org/gluu/site/ldap/persistence/annotation/LdapAttribute.java:38: warning: no @return
[WARNING] boolean ignoreDuringUpdate() default false;
[WARNING] ^
[WARNING] /home/jenkins/.jenkins/jobs/oxCore_3.1.7/workspace/oxLdap-annotations/src/main/java/org/gluu/site/ldap/persistence/annotation/LdapAttribute.java:26: warning: no @return
[WARNING] String name() default "";
[WARNING] ^
[WARNING] /home/jenkins/.jenkins/jobs/oxCore_3.1.7/workspace/oxLdap-annotations/src/main/java/org/gluu/site/ldap/persistence/annotation/LdapAttribute.java:44: warning: no @return
[WARNING] boolean updateOnly() default false;
[WARNING] ^
[WARNING] /home/jenkins/.jenkins/jobs/oxCore_3.1.7/workspace/oxLdap-annotations/src/main/java/org/gluu/site/ldap/persistence/annotation/LdapAttributesList.java:26: warning: no @return
[WARNING] String name();
[WARNING] ^
[WARNING] /home/jenkins/.jenkins/jobs/oxCore_3.1.7/workspace/oxLdap-annotations/src/main/java/org/gluu/site/ldap/persistence/annotation/LdapAttributesList.java:31: warning: no @return
[WARNING] String value();
[WARNING] ^
[WARNING] /home/jenkins/.jenkins/jobs/oxCore_3.1.7/workspace/oxLdap-annotations/src/main/java/org/gluu/site/ldap/persistence/annotation/LdapAttributesList.java:37: warning: no @return
[WARNING] LdapAttribute[] attributesConfiguration() default {};
[WARNING] ^
[WARNING] /home/jenkins/.jenkins/jobs/oxCore_3.1.7/workspace/oxLdap-annotations/src/main/java/org/gluu/site/ldap/persistence/annotation/LdapAttributesList.java:42: warning: no @return
[WARNING] boolean sortByName() default false;
[WARNING] ^
[WARNING] /home/jenkins/.jenkins/jobs/oxCore_3.1.7/workspace/oxLdap-annotations/src/main/java/org/gluu/site/ldap/persistence/annotation/LdapEntry.java:26: warning: no @return
[WARNING] boolean schemaDefinition() default false;
[WARNING] ^
[WARNING] /home/jenkins/.jenkins/jobs/oxCore_3.1.7/workspace/oxLdap-annotations/src/main/java/org/gluu/site/ldap/persistence/annotation/LdapEntry.java:31: warning: no @return
[WARNING] String[] sortBy() default {};
[WARNING] ^
[INFO] 
[INFO] --- maven-site-plugin:2.1.1:site (default-site) @ oxcore-ldap-annotations ---
[INFO]                                                                         
[INFO] ------------------------------------------------------------------------
[INFO] Building oxUtil 3.1.7.sp1
[INFO] ------------------------------------------------------------------------
[INFO] 
[INFO] --- maven-clean-plugin:2.4.1:clean (default-clean) @ oxcore-util ---
[INFO] Deleting /home/jenkins/.jenkins/jobs/oxCore_3.1.7/workspace/oxUtil/target
[INFO] 
[INFO] --- maven-resources-plugin:2.4:resources (default-resources) @ oxcore-util ---
[INFO] Using 'UTF-8' encoding to copy filtered resources.
[INFO] skip non existing resourceDirectory /home/jenkins/.jenkins/jobs/oxCore_3.1.7/workspace/oxUtil/src/main/resources
[INFO] 
[INFO] --- maven-compiler-plugin:2.3.2:compile (default-compile) @ oxcore-util ---
[INFO] Compiling 61 source files to /home/jenkins/.jenkins/jobs/oxCore_3.1.7/workspace/oxUtil/target/classes
Processing annotations
Annotations processed
Processing annotations
No elements to process
[INFO] 
[INFO] --- maven-resources-plugin:2.4:resources (default-resources) @ oxcore-util ---
[INFO] Using 'UTF-8' encoding to copy filtered resources.
[INFO] skip non existing resourceDirectory /home/jenkins/.jenkins/jobs/oxCore_3.1.7/workspace/oxUtil/src/main/resources
[INFO] 
[INFO] --- maven-compiler-plugin:2.3.2:compile (default-compile) @ oxcore-util ---
[INFO] Nothing to compile - all classes are up to date
[INFO] 
[INFO] --- maven-resources-plugin:2.4:testResources (default-testResources) @ oxcore-util ---
[INFO] Using 'UTF-8' encoding to copy filtered resources.
[INFO] skip non existing resourceDirectory /home/jenkins/.jenkins/jobs/oxCore_3.1.7/workspace/oxUtil/src/test/resources
[INFO] 
[INFO] --- maven-compiler-plugin:2.3.2:testCompile (default-testCompile) @ oxcore-util ---
[INFO] No sources to compile
[INFO] 
[INFO] --- maven-surefire-plugin:2.7.2:test (default-test) @ oxcore-util ---
[INFO] No tests to run.
[INFO] Surefire report directory: /home/jenkins/.jenkins/jobs/oxCore_3.1.7/workspace/oxUtil/target/surefire-reports

-------------------------------------------------------
 T E S T S
-------------------------------------------------------
There are no tests to run.

Results :

Tests run: 0, Failures: 0, Errors: 0, Skipped: 0

[INFO] 
[INFO] --- maven-jar-plugin:2.4:jar (default-jar) @ oxcore-util ---
[INFO] Building jar: /home/jenkins/.jenkins/jobs/oxCore_3.1.7/workspace/oxUtil/target/oxcore-util-3.1.7.sp1.jar
[INFO] 
[INFO] --- maven-install-plugin:2.3.1:install (default-install) @ oxcore-util ---
[INFO] Installing /home/jenkins/.jenkins/jobs/oxCore_3.1.7/workspace/oxUtil/target/oxcore-util-3.1.7.sp1.jar to /var/www/html/maven/org/xdi/oxcore-util/3.1.7.sp1/oxcore-util-3.1.7.sp1.jar
[INFO] Installing /home/jenkins/.jenkins/jobs/oxCore_3.1.7/workspace/oxUtil/pom.xml to /var/www/html/maven/org/xdi/oxcore-util/3.1.7.sp1/oxcore-util-3.1.7.sp1.pom
[INFO] 
[INFO] --- findbugs-maven-plugin:3.0.4:findbugs (default-cli) @ oxcore-util ---
[INFO] Fork Value is true
     [java] Warnings generated: 19
[INFO] Done FindBugs Analysis....
[INFO] 
[INFO] --- maven-checkstyle-plugin:3.0.0:checkstyle (default-cli) @ oxcore-util ---
[INFO] There are 2911 errors reported by Checkstyle 6.18 with sun_checks.xml ruleset.
[WARNING] Unable to locate Source XRef to link to - DISABLED
[INFO] 
[INFO] >>> maven-javadoc-plugin:3.0.1:javadoc (default-cli) > generate-sources @ oxcore-util >>>
[INFO] 
[INFO] <<< maven-javadoc-plugin:3.0.1:javadoc (default-cli) < generate-sources @ oxcore-util <<<
[INFO] 
[INFO] --- maven-javadoc-plugin:3.0.1:javadoc (default-cli) @ oxcore-util ---
[INFO] 
Loading source files for package org.gluu.log...
Loading source files for package org.xdi.context...
Loading source files for package org.xdi.log...
Loading source files for package org.xdi.model...
Loading source files for package org.xdi.model.config...
Loading source files for package org.xdi.model.ldap...
Loading source files for package org.xdi.net...
Loading source files for package org.xdi.util...
Loading source files for package org.xdi.util.exception...
Loading source files for package org.xdi.util.image...
Loading source files for package org.xdi.util.init...
Loading source files for package org.xdi.util.io...
Loading source files for package org.xdi.util.process...
Loading source files for package org.xdi.util.properties...
Loading source files for package org.xdi.util.repository...
Loading source files for package org.xdi.util.security...
Loading source files for package org.xdi.xml...
Loading source files for package org.xdi.zip...
Constructing Javadoc information...
Standard Doclet version 1.8.0_221
Building tree for all the packages and classes...
Generating /home/jenkins/.jenkins/jobs/oxCore_3.1.7/workspace/oxUtil/target/site/apidocs/org/gluu/log/MacAddressLogIdConverter.html...
Generating /home/jenkins/.jenkins/jobs/oxCore_3.1.7/workspace/oxUtil/target/site/apidocs/org/xdi/context/J2EContext.html...
Generating /home/jenkins/.jenkins/jobs/oxCore_3.1.7/workspace/oxUtil/target/site/apidocs/org/xdi/context/WebContext.html...
Generating /home/jenkins/.jenkins/jobs/oxCore_3.1.7/workspace/oxUtil/target/site/apidocs/org/xdi/log/LoggingHelper.html...
Generating /home/jenkins/.jenkins/jobs/oxCore_3.1.7/workspace/oxUtil/target/site/apidocs/org/xdi/model/AuthenticationMode.html...
Generating /home/jenkins/.jenkins/jobs/oxCore_3.1.7/workspace/oxUtil/target/site/apidocs/org/xdi/model/AuthenticationScriptUsageType.html...
Generating /home/jenkins/.jenkins/jobs/oxCore_3.1.7/workspace/oxUtil/target/site/apidocs/org/xdi/model/GluuImage.html...
Generating /home/jenkins/.jenkins/jobs/oxCore_3.1.7/workspace/oxUtil/target/site/apidocs/org/xdi/model/GluuIMAPData.html...
Generating /home/jenkins/.jenkins/jobs/oxCore_3.1.7/workspace/oxUtil/target/site/apidocs/org/xdi/model/ImapPassword.html...
Generating /home/jenkins/.jenkins/jobs/oxCore_3.1.7/workspace/oxUtil/target/site/apidocs/org/xdi/model/ProgrammingLanguage.html...
Generating /home/jenkins/.jenkins/jobs/oxCore_3.1.7/workspace/oxUtil/target/site/apidocs/org/xdi/model/ScriptLocationType.html...
Generating /home/jenkins/.jenkins/jobs/oxCore_3.1.7/workspace/oxUtil/target/site/apidocs/org/xdi/model/SelectableEntity.html...
Generating /home/jenkins/.jenkins/jobs/oxCore_3.1.7/workspace/oxUtil/target/site/apidocs/org/xdi/model/SimpleCustomProperty.html...
Generating /home/jenkins/.jenkins/jobs/oxCore_3.1.7/workspace/oxUtil/target/site/apidocs/org/xdi/model/SimpleExtendedCustomProperty.html...
Generating /home/jenkins/.jenkins/jobs/oxCore_3.1.7/workspace/oxUtil/target/site/apidocs/org/xdi/model/SimpleProperty.html...
Generating /home/jenkins/.jenkins/jobs/oxCore_3.1.7/workspace/oxUtil/target/site/apidocs/org/xdi/model/SmtpConfiguration.html...
Generating /home/jenkins/.jenkins/jobs/oxCore_3.1.7/workspace/oxUtil/target/site/apidocs/org/xdi/model/TrustContact.html...
Generating /home/jenkins/.jenkins/jobs/oxCore_3.1.7/workspace/oxUtil/target/site/apidocs/org/xdi/model/config/CustomAuthenticationConfiguration.html...
Generating /home/jenkins/.jenkins/jobs/oxCore_3.1.7/workspace/oxUtil/target/site/apidocs/org/xdi/model/ldap/GluuLdapConfiguration.html...
Generating /home/jenkins/.jenkins/jobs/oxCore_3.1.7/workspace/oxUtil/target/site/apidocs/org/xdi/net/InetAddressUtility.html...
Generating /home/jenkins/.jenkins/jobs/oxCore_3.1.7/workspace/oxUtil/target/site/apidocs/org/xdi/net/SslDefaultHttpClient.html...
Generating /home/jenkins/.jenkins/jobs/oxCore_3.1.7/workspace/oxUtil/target/site/apidocs/org/xdi/net/TrustAllTrustManager.html...
Generating /home/jenkins/.jenkins/jobs/oxCore_3.1.7/workspace/oxUtil/target/site/apidocs/org/xdi/util/ArrayHelper.html...
Generating /home/jenkins/.jenkins/jobs/oxCore_3.1.7/workspace/oxUtil/target/site/apidocs/org/xdi/util/AssertionHelper.html...
Generating /home/jenkins/.jenkins/jobs/oxCore_3.1.7/workspace/oxUtil/target/site/apidocs/org/xdi/util/EasySSLProtocolSocketFactory.html...
Generating /home/jenkins/.jenkins/jobs/oxCore_3.1.7/workspace/oxUtil/target/site/apidocs/org/xdi/util/EasyX509TrustManager.html...
Generating /home/jenkins/.jenkins/jobs/oxCore_3.1.7/workspace/oxUtil/target/site/apidocs/org/xdi/util/FileUtil.html...
Generating /home/jenkins/.jenkins/jobs/oxCore_3.1.7/workspace/oxUtil/target/site/apidocs/org/xdi/util/InterfaceRegistry.html...
Generating /home/jenkins/.jenkins/jobs/oxCore_3.1.7/workspace/oxUtil/target/site/apidocs/org/xdi/util/INumGenerator.html...
Generating /home/jenkins/.jenkins/jobs/oxCore_3.1.7/workspace/oxUtil/target/site/apidocs/org/xdi/util/LDAPConstants.html...
Generating /home/jenkins/.jenkins/jobs/oxCore_3.1.7/workspace/oxUtil/target/site/apidocs/org/xdi/util/Pair.html...
Generating /home/jenkins/.jenkins/jobs/oxCore_3.1.7/workspace/oxUtil/target/site/apidocs/org/xdi/util/SelectableEntityHelper.html...
Generating /home/jenkins/.jenkins/jobs/oxCore_3.1.7/workspace/oxUtil/target/site/apidocs/org/xdi/util/StringHelper.html...
Generating /home/jenkins/.jenkins/jobs/oxCore_3.1.7/workspace/oxUtil/target/site/apidocs/org/xdi/util/Triple.html...
Generating /home/jenkins/.jenkins/jobs/oxCore_3.1.7/workspace/oxUtil/target/site/apidocs/org/xdi/util/Util.html...
Generating /home/jenkins/.jenkins/jobs/oxCore_3.1.7/workspace/oxUtil/target/site/apidocs/org/xdi/util/exception/ConfigurationException.html...
Generating /home/jenkins/.jenkins/jobs/oxCore_3.1.7/workspace/oxUtil/target/site/apidocs/org/xdi/util/exception/InvalidAttributeException.html...
Generating /home/jenkins/.jenkins/jobs/oxCore_3.1.7/workspace/oxUtil/target/site/apidocs/org/xdi/util/exception/InvalidConfigurationException.html...
Generating /home/jenkins/.jenkins/jobs/oxCore_3.1.7/workspace/oxUtil/target/site/apidocs/org/xdi/util/exception/InvalidSchemaUpdateException.html...
Generating /home/jenkins/.jenkins/jobs/oxCore_3.1.7/workspace/oxUtil/target/site/apidocs/org/xdi/util/image/ImageTransformationUtility.html...
Generating /home/jenkins/.jenkins/jobs/oxCore_3.1.7/workspace/oxUtil/target/site/apidocs/org/xdi/util/init/Initializable.html...
Generating /home/jenkins/.jenkins/jobs/oxCore_3.1.7/workspace/oxUtil/target/site/apidocs/org/xdi/util/io/ByteDataInputStream.html...
Generating /home/jenkins/.jenkins/jobs/oxCore_3.1.7/workspace/oxUtil/target/site/apidocs/org/xdi/util/io/DownloadWrapper.html...
Generating /home/jenkins/.jenkins/jobs/oxCore_3.1.7/workspace/oxUtil/target/site/apidocs/org/xdi/util/io/ExcludeFilterInputStream.html...
Generating /home/jenkins/.jenkins/jobs/oxCore_3.1.7/workspace/oxUtil/target/site/apidocs/org/xdi/util/io/FileDownloader.html...
Generating /home/jenkins/.jenkins/jobs/oxCore_3.1.7/workspace/oxUtil/target/site/apidocs/org/xdi/util/io/FileDownloader.ContentDisposition.html...
Generating /home/jenkins/.jenkins/jobs/oxCore_3.1.7/workspace/oxUtil/target/site/apidocs/org/xdi/util/io/FileHelper.html...
Generating /home/jenkins/.jenkins/jobs/oxCore_3.1.7/workspace/oxUtil/target/site/apidocs/org/xdi/util/io/FileUploadWrapper.html...
Generating /home/jenkins/.jenkins/jobs/oxCore_3.1.7/workspace/oxUtil/target/site/apidocs/org/xdi/util/io/HTTPFileDownloader.html...
Generating /home/jenkins/.jenkins/jobs/oxCore_3.1.7/workspace/oxUtil/target/site/apidocs/org/xdi/util/io/ReverseLineReader.html...
Generating /home/jenkins/.jenkins/jobs/oxCore_3.1.7/workspace/oxUtil/target/site/apidocs/org/xdi/util/process/ProcessHelper.html...
Generating /home/jenkins/.jenkins/jobs/oxCore_3.1.7/workspace/oxUtil/target/site/apidocs/org/xdi/util/properties/FileConfiguration.html...
Generating /home/jenkins/.jenkins/jobs/oxCore_3.1.7/workspace/oxUtil/target/site/apidocs/org/xdi/util/repository/RepositoryUtility.html...
Generating /home/jenkins/.jenkins/jobs/oxCore_3.1.7/workspace/oxUtil/target/site/apidocs/org/xdi/util/security/BCrypt.html...
Generating /home/jenkins/.jenkins/jobs/oxCore_3.1.7/workspace/oxUtil/target/site/apidocs/org/xdi/util/security/CertificateHelper.html...
Generating /home/jenkins/.jenkins/jobs/oxCore_3.1.7/workspace/oxUtil/target/site/apidocs/org/xdi/util/security/PropertiesDecrypter.html...
Generating /home/jenkins/.jenkins/jobs/oxCore_3.1.7/workspace/oxUtil/target/site/apidocs/org/xdi/util/security/StringDecrypter.html...
Generating /home/jenkins/.jenkins/jobs/oxCore_3.1.7/workspace/oxUtil/target/site/apidocs/org/xdi/util/security/StringEncrypter.html...
Generating /home/jenkins/.jenkins/jobs/oxCore_3.1.7/workspace/oxUtil/target/site/apidocs/org/xdi/util/security/StringEncrypter.EncryptionException.html...
Generating /home/jenkins/.jenkins/jobs/oxCore_3.1.7/workspace/oxUtil/target/site/apidocs/org/xdi/xml/GluuErrorHandler.html...
Generating /home/jenkins/.jenkins/jobs/oxCore_3.1.7/workspace/oxUtil/target/site/apidocs/org/xdi/xml/SimpleNamespaceContext.html...
Generating /home/jenkins/.jenkins/jobs/oxCore_3.1.7/workspace/oxUtil/target/site/apidocs/org/xdi/xml/XMLValidator.html...
Generating /home/jenkins/.jenkins/jobs/oxCore_3.1.7/workspace/oxUtil/target/site/apidocs/org/xdi/zip/CompressionHelper.html...
Generating /home/jenkins/.jenkins/jobs/oxCore_3.1.7/workspace/oxUtil/target/site/apidocs/overview-frame.html...
Generating /home/jenkins/.jenkins/jobs/oxCore_3.1.7/workspace/oxUtil/target/site/apidocs/org/gluu/log/package-frame.html...
Generating /home/jenkins/.jenkins/jobs/oxCore_3.1.7/workspace/oxUtil/target/site/apidocs/org/gluu/log/package-summary.html...
Generating /home/jenkins/.jenkins/jobs/oxCore_3.1.7/workspace/oxUtil/target/site/apidocs/org/gluu/log/package-tree.html...
Generating /home/jenkins/.jenkins/jobs/oxCore_3.1.7/workspace/oxUtil/target/site/apidocs/org/xdi/context/package-frame.html...
Generating /home/jenkins/.jenkins/jobs/oxCore_3.1.7/workspace/oxUtil/target/site/apidocs/org/xdi/context/package-summary.html...
Generating /home/jenkins/.jenkins/jobs/oxCore_3.1.7/workspace/oxUtil/target/site/apidocs/org/xdi/context/package-tree.html...
Generating /home/jenkins/.jenkins/jobs/oxCore_3.1.7/workspace/oxUtil/target/site/apidocs/org/xdi/log/package-frame.html...
Generating /home/jenkins/.jenkins/jobs/oxCore_3.1.7/workspace/oxUtil/target/site/apidocs/org/xdi/log/package-summary.html...
Generating /home/jenkins/.jenkins/jobs/oxCore_3.1.7/workspace/oxUtil/target/site/apidocs/org/xdi/log/package-tree.html...
Generating /home/jenkins/.jenkins/jobs/oxCore_3.1.7/workspace/oxUtil/target/site/apidocs/org/xdi/model/package-frame.html...
Generating /home/jenkins/.jenkins/jobs/oxCore_3.1.7/workspace/oxUtil/target/site/apidocs/org/xdi/model/package-summary.html...
Generating /home/jenkins/.jenkins/jobs/oxCore_3.1.7/workspace/oxUtil/target/site/apidocs/org/xdi/model/package-tree.html...
Generating /home/jenkins/.jenkins/jobs/oxCore_3.1.7/workspace/oxUtil/target/site/apidocs/org/xdi/model/config/package-frame.html...
Generating /home/jenkins/.jenkins/jobs/oxCore_3.1.7/workspace/oxUtil/target/site/apidocs/org/xdi/model/config/package-summary.html...
Generating /home/jenkins/.jenkins/jobs/oxCore_3.1.7/workspace/oxUtil/target/site/apidocs/org/xdi/model/config/package-tree.html...
Generating /home/jenkins/.jenkins/jobs/oxCore_3.1.7/workspace/oxUtil/target/site/apidocs/org/xdi/model/ldap/package-frame.html...
Generating /home/jenkins/.jenkins/jobs/oxCore_3.1.7/workspace/oxUtil/target/site/apidocs/org/xdi/model/ldap/package-summary.html...
Generating /home/jenkins/.jenkins/jobs/oxCore_3.1.7/workspace/oxUtil/target/site/apidocs/org/xdi/model/ldap/package-tree.html...
Generating /home/jenkins/.jenkins/jobs/oxCore_3.1.7/workspace/oxUtil/target/site/apidocs/org/xdi/net/package-frame.html...
Generating /home/jenkins/.jenkins/jobs/oxCore_3.1.7/workspace/oxUtil/target/site/apidocs/org/xdi/net/package-summary.html...
Generating /home/jenkins/.jenkins/jobs/oxCore_3.1.7/workspace/oxUtil/target/site/apidocs/org/xdi/net/package-tree.html...
Generating /home/jenkins/.jenkins/jobs/oxCore_3.1.7/workspace/oxUtil/target/site/apidocs/org/xdi/util/package-frame.html...
Generating /home/jenkins/.jenkins/jobs/oxCore_3.1.7/workspace/oxUtil/target/site/apidocs/org/xdi/util/package-summary.html...
Generating /home/jenkins/.jenkins/jobs/oxCore_3.1.7/workspace/oxUtil/target/site/apidocs/org/xdi/util/package-tree.html...
Generating /home/jenkins/.jenkins/jobs/oxCore_3.1.7/workspace/oxUtil/target/site/apidocs/org/xdi/util/exception/package-frame.html...
Generating /home/jenkins/.jenkins/jobs/oxCore_3.1.7/workspace/oxUtil/target/site/apidocs/org/xdi/util/exception/package-summary.html...
Generating /home/jenkins/.jenkins/jobs/oxCore_3.1.7/workspace/oxUtil/target/site/apidocs/org/xdi/util/exception/package-tree.html...
Generating /home/jenkins/.jenkins/jobs/oxCore_3.1.7/workspace/oxUtil/target/site/apidocs/org/xdi/util/image/package-frame.html...
Generating /home/jenkins/.jenkins/jobs/oxCore_3.1.7/workspace/oxUtil/target/site/apidocs/org/xdi/util/image/package-summary.html...
Generating /home/jenkins/.jenkins/jobs/oxCore_3.1.7/workspace/oxUtil/target/site/apidocs/org/xdi/util/image/package-tree.html...
Generating /home/jenkins/.jenkins/jobs/oxCore_3.1.7/workspace/oxUtil/target/site/apidocs/org/xdi/util/init/package-frame.html...
Generating /home/jenkins/.jenkins/jobs/oxCore_3.1.7/workspace/oxUtil/target/site/apidocs/org/xdi/util/init/package-summary.html...
Generating /home/jenkins/.jenkins/jobs/oxCore_3.1.7/workspace/oxUtil/target/site/apidocs/org/xdi/util/init/package-tree.html...
Generating /home/jenkins/.jenkins/jobs/oxCore_3.1.7/workspace/oxUtil/target/site/apidocs/org/xdi/util/io/package-frame.html...
Generating /home/jenkins/.jenkins/jobs/oxCore_3.1.7/workspace/oxUtil/target/site/apidocs/org/xdi/util/io/package-summary.html...
Generating /home/jenkins/.jenkins/jobs/oxCore_3.1.7/workspace/oxUtil/target/site/apidocs/org/xdi/util/io/package-tree.html...
Generating /home/jenkins/.jenkins/jobs/oxCore_3.1.7/workspace/oxUtil/target/site/apidocs/org/xdi/util/process/package-frame.html...
Generating /home/jenkins/.jenkins/jobs/oxCore_3.1.7/workspace/oxUtil/target/site/apidocs/org/xdi/util/process/package-summary.html...
Generating /home/jenkins/.jenkins/jobs/oxCore_3.1.7/workspace/oxUtil/target/site/apidocs/org/xdi/util/process/package-tree.html...
Generating /home/jenkins/.jenkins/jobs/oxCore_3.1.7/workspace/oxUtil/target/site/apidocs/org/xdi/util/properties/package-frame.html...
Generating /home/jenkins/.jenkins/jobs/oxCore_3.1.7/workspace/oxUtil/target/site/apidocs/org/xdi/util/properties/package-summary.html...
Generating /home/jenkins/.jenkins/jobs/oxCore_3.1.7/workspace/oxUtil/target/site/apidocs/org/xdi/util/properties/package-tree.html...
Generating /home/jenkins/.jenkins/jobs/oxCore_3.1.7/workspace/oxUtil/target/site/apidocs/org/xdi/util/repository/package-frame.html...
Generating /home/jenkins/.jenkins/jobs/oxCore_3.1.7/workspace/oxUtil/target/site/apidocs/org/xdi/util/repository/package-summary.html...
Generating /home/jenkins/.jenkins/jobs/oxCore_3.1.7/workspace/oxUtil/target/site/apidocs/org/xdi/util/repository/package-tree.html...
Generating /home/jenkins/.jenkins/jobs/oxCore_3.1.7/workspace/oxUtil/target/site/apidocs/org/xdi/util/security/package-frame.html...
Generating /home/jenkins/.jenkins/jobs/oxCore_3.1.7/workspace/oxUtil/target/site/apidocs/org/xdi/util/security/package-summary.html...
Generating /home/jenkins/.jenkins/jobs/oxCore_3.1.7/workspace/oxUtil/target/site/apidocs/org/xdi/util/security/package-tree.html...
Generating /home/jenkins/.jenkins/jobs/oxCore_3.1.7/workspace/oxUtil/target/site/apidocs/org/xdi/xml/package-frame.html...
Generating /home/jenkins/.jenkins/jobs/oxCore_3.1.7/workspace/oxUtil/target/site/apidocs/org/xdi/xml/package-summary.html...
Generating /home/jenkins/.jenkins/jobs/oxCore_3.1.7/workspace/oxUtil/target/site/apidocs/org/xdi/xml/package-tree.html...
Generating /home/jenkins/.jenkins/jobs/oxCore_3.1.7/workspace/oxUtil/target/site/apidocs/org/xdi/zip/package-frame.html...
Generating /home/jenkins/.jenkins/jobs/oxCore_3.1.7/workspace/oxUtil/target/site/apidocs/org/xdi/zip/package-summary.html...
Generating /home/jenkins/.jenkins/jobs/oxCore_3.1.7/workspace/oxUtil/target/site/apidocs/org/xdi/zip/package-tree.html...
Generating /home/jenkins/.jenkins/jobs/oxCore_3.1.7/workspace/oxUtil/target/site/apidocs/constant-values.html...
Generating /home/jenkins/.jenkins/jobs/oxCore_3.1.7/workspace/oxUtil/target/site/apidocs/serialized-form.html...
Generating /home/jenkins/.jenkins/jobs/oxCore_3.1.7/workspace/oxUtil/target/site/apidocs/org/gluu/log/class-use/MacAddressLogIdConverter.html...
Generating /home/jenkins/.jenkins/jobs/oxCore_3.1.7/workspace/oxUtil/target/site/apidocs/org/xdi/context/class-use/WebContext.html...
Generating /home/jenkins/.jenkins/jobs/oxCore_3.1.7/workspace/oxUtil/target/site/apidocs/org/xdi/context/class-use/J2EContext.html...
Generating /home/jenkins/.jenkins/jobs/oxCore_3.1.7/workspace/oxUtil/target/site/apidocs/org/xdi/log/class-use/LoggingHelper.html...
Generating /home/jenkins/.jenkins/jobs/oxCore_3.1.7/workspace/oxUtil/target/site/apidocs/org/xdi/model/class-use/TrustContact.html...
Generating /home/jenkins/.jenkins/jobs/oxCore_3.1.7/workspace/oxUtil/target/site/apidocs/org/xdi/model/class-use/SmtpConfiguration.html...
Generating /home/jenkins/.jenkins/jobs/oxCore_3.1.7/workspace/oxUtil/target/site/apidocs/org/xdi/model/class-use/SimpleProperty.html...
Generating /home/jenkins/.jenkins/jobs/oxCore_3.1.7/workspace/oxUtil/target/site/apidocs/org/xdi/model/class-use/SimpleExtendedCustomProperty.html...
Generating /home/jenkins/.jenkins/jobs/oxCore_3.1.7/workspace/oxUtil/target/site/apidocs/org/xdi/model/class-use/SimpleCustomProperty.html...
Generating /home/jenkins/.jenkins/jobs/oxCore_3.1.7/workspace/oxUtil/target/site/apidocs/org/xdi/model/class-use/SelectableEntity.html...
Generating /home/jenkins/.jenkins/jobs/oxCore_3.1.7/workspace/oxUtil/target/site/apidocs/org/xdi/model/class-use/ScriptLocationType.html...
Generating /home/jenkins/.jenkins/jobs/oxCore_3.1.7/workspace/oxUtil/target/site/apidocs/org/xdi/model/class-use/ProgrammingLanguage.html...
Generating /home/jenkins/.jenkins/jobs/oxCore_3.1.7/workspace/oxUtil/target/site/apidocs/org/xdi/model/class-use/ImapPassword.html...
Generating /home/jenkins/.jenkins/jobs/oxCore_3.1.7/workspace/oxUtil/target/site/apidocs/org/xdi/model/class-use/GluuImage.html...
Generating /home/jenkins/.jenkins/jobs/oxCore_3.1.7/workspace/oxUtil/target/site/apidocs/org/xdi/model/class-use/GluuIMAPData.html...
Generating /home/jenkins/.jenkins/jobs/oxCore_3.1.7/workspace/oxUtil/target/site/apidocs/org/xdi/model/class-use/AuthenticationScriptUsageType.html...
Generating /home/jenkins/.jenkins/jobs/oxCore_3.1.7/workspace/oxUtil/target/site/apidocs/org/xdi/model/class-use/AuthenticationMode.html...
Generating /home/jenkins/.jenkins/jobs/oxCore_3.1.7/workspace/oxUtil/target/site/apidocs/org/xdi/model/config/class-use/CustomAuthenticationConfiguration.html...
Generating /home/jenkins/.jenkins/jobs/oxCore_3.1.7/workspace/oxUtil/target/site/apidocs/org/xdi/model/ldap/class-use/GluuLdapConfiguration.html...
Generating /home/jenkins/.jenkins/jobs/oxCore_3.1.7/workspace/oxUtil/target/site/apidocs/org/xdi/net/class-use/TrustAllTrustManager.html...
Generating /home/jenkins/.jenkins/jobs/oxCore_3.1.7/workspace/oxUtil/target/site/apidocs/org/xdi/net/class-use/SslDefaultHttpClient.html...
Generating /home/jenkins/.jenkins/jobs/oxCore_3.1.7/workspace/oxUtil/target/site/apidocs/org/xdi/net/class-use/InetAddressUtility.html...
Generating /home/jenkins/.jenkins/jobs/oxCore_3.1.7/workspace/oxUtil/target/site/apidocs/org/xdi/util/class-use/Util.html...
Generating /home/jenkins/.jenkins/jobs/oxCore_3.1.7/workspace/oxUtil/target/site/apidocs/org/xdi/util/class-use/Triple.html...
Generating /home/jenkins/.jenkins/jobs/oxCore_3.1.7/workspace/oxUtil/target/site/apidocs/org/xdi/util/class-use/StringHelper.html...
Generating /home/jenkins/.jenkins/jobs/oxCore_3.1.7/workspace/oxUtil/target/site/apidocs/org/xdi/util/class-use/SelectableEntityHelper.html...
Generating /home/jenkins/.jenkins/jobs/oxCore_3.1.7/workspace/oxUtil/target/site/apidocs/org/xdi/util/class-use/Pair.html...
Generating /home/jenkins/.jenkins/jobs/oxCore_3.1.7/workspace/oxUtil/target/site/apidocs/org/xdi/util/class-use/LDAPConstants.html...
Generating /home/jenkins/.jenkins/jobs/oxCore_3.1.7/workspace/oxUtil/target/site/apidocs/org/xdi/util/class-use/InterfaceRegistry.html...
Generating /home/jenkins/.jenkins/jobs/oxCore_3.1.7/workspace/oxUtil/target/site/apidocs/org/xdi/util/class-use/INumGenerator.html...
Generating /home/jenkins/.jenkins/jobs/oxCore_3.1.7/workspace/oxUtil/target/site/apidocs/org/xdi/util/class-use/FileUtil.html...
Generating /home/jenkins/.jenkins/jobs/oxCore_3.1.7/workspace/oxUtil/target/site/apidocs/org/xdi/util/class-use/EasyX509TrustManager.html...
Generating /home/jenkins/.jenkins/jobs/oxCore_3.1.7/workspace/oxUtil/target/site/apidocs/org/xdi/util/class-use/EasySSLProtocolSocketFactory.html...
Generating /home/jenkins/.jenkins/jobs/oxCore_3.1.7/workspace/oxUtil/target/site/apidocs/org/xdi/util/class-use/AssertionHelper.html...
Generating /home/jenkins/.jenkins/jobs/oxCore_3.1.7/workspace/oxUtil/target/site/apidocs/org/xdi/util/class-use/ArrayHelper.html...
Generating /home/jenkins/.jenkins/jobs/oxCore_3.1.7/workspace/oxUtil/target/site/apidocs/org/xdi/util/exception/class-use/InvalidSchemaUpdateException.html...
Generating /home/jenkins/.jenkins/jobs/oxCore_3.1.7/workspace/oxUtil/target/site/apidocs/org/xdi/util/exception/class-use/InvalidConfigurationException.html...
Generating /home/jenkins/.jenkins/jobs/oxCore_3.1.7/workspace/oxUtil/target/site/apidocs/org/xdi/util/exception/class-use/InvalidAttributeException.html...
Generating /home/jenkins/.jenkins/jobs/oxCore_3.1.7/workspace/oxUtil/target/site/apidocs/org/xdi/util/exception/class-use/ConfigurationException.html...
Generating /home/jenkins/.jenkins/jobs/oxCore_3.1.7/workspace/oxUtil/target/site/apidocs/org/xdi/util/image/class-use/ImageTransformationUtility.html...
Generating /home/jenkins/.jenkins/jobs/oxCore_3.1.7/workspace/oxUtil/target/site/apidocs/org/xdi/util/init/class-use/Initializable.html...
Generating /home/jenkins/.jenkins/jobs/oxCore_3.1.7/workspace/oxUtil/target/site/apidocs/org/xdi/util/io/class-use/ReverseLineReader.html...
Generating /home/jenkins/.jenkins/jobs/oxCore_3.1.7/workspace/oxUtil/target/site/apidocs/org/xdi/util/io/class-use/HTTPFileDownloader.html...
Generating /home/jenkins/.jenkins/jobs/oxCore_3.1.7/workspace/oxUtil/target/site/apidocs/org/xdi/util/io/class-use/FileUploadWrapper.html...
Generating /home/jenkins/.jenkins/jobs/oxCore_3.1.7/workspace/oxUtil/target/site/apidocs/org/xdi/util/io/class-use/FileHelper.html...
Generating /home/jenkins/.jenkins/jobs/oxCore_3.1.7/workspace/oxUtil/target/site/apidocs/org/xdi/util/io/class-use/FileDownloader.html...
Generating /home/jenkins/.jenkins/jobs/oxCore_3.1.7/workspace/oxUtil/target/site/apidocs/org/xdi/util/io/class-use/FileDownloader.ContentDisposition.html...
Generating /home/jenkins/.jenkins/jobs/oxCore_3.1.7/workspace/oxUtil/target/site/apidocs/org/xdi/util/io/class-use/ExcludeFilterInputStream.html...
Generating /home/jenkins/.jenkins/jobs/oxCore_3.1.7/workspace/oxUtil/target/site/apidocs/org/xdi/util/io/class-use/DownloadWrapper.html...
Generating /home/jenkins/.jenkins/jobs/oxCore_3.1.7/workspace/oxUtil/target/site/apidocs/org/xdi/util/io/class-use/ByteDataInputStream.html...
Generating /home/jenkins/.jenkins/jobs/oxCore_3.1.7/workspace/oxUtil/target/site/apidocs/org/xdi/util/process/class-use/ProcessHelper.html...
Generating /home/jenkins/.jenkins/jobs/oxCore_3.1.7/workspace/oxUtil/target/site/apidocs/org/xdi/util/properties/class-use/FileConfiguration.html...
Generating /home/jenkins/.jenkins/jobs/oxCore_3.1.7/workspace/oxUtil/target/site/apidocs/org/xdi/util/repository/class-use/RepositoryUtility.html...
Generating /home/jenkins/.jenkins/jobs/oxCore_3.1.7/workspace/oxUtil/target/site/apidocs/org/xdi/util/security/class-use/StringEncrypter.html...
Generating /home/jenkins/.jenkins/jobs/oxCore_3.1.7/workspace/oxUtil/target/site/apidocs/org/xdi/util/security/class-use/StringEncrypter.EncryptionException.html...
Generating /home/jenkins/.jenkins/jobs/oxCore_3.1.7/workspace/oxUtil/target/site/apidocs/org/xdi/util/security/class-use/StringDecrypter.html...
Generating /home/jenkins/.jenkins/jobs/oxCore_3.1.7/workspace/oxUtil/target/site/apidocs/org/xdi/util/security/class-use/PropertiesDecrypter.html...
Generating /home/jenkins/.jenkins/jobs/oxCore_3.1.7/workspace/oxUtil/target/site/apidocs/org/xdi/util/security/class-use/CertificateHelper.html...
Generating /home/jenkins/.jenkins/jobs/oxCore_3.1.7/workspace/oxUtil/target/site/apidocs/org/xdi/util/security/class-use/BCrypt.html...
Generating /home/jenkins/.jenkins/jobs/oxCore_3.1.7/workspace/oxUtil/target/site/apidocs/org/xdi/xml/class-use/XMLValidator.html...
Generating /home/jenkins/.jenkins/jobs/oxCore_3.1.7/workspace/oxUtil/target/site/apidocs/org/xdi/xml/class-use/SimpleNamespaceContext.html...
Generating /home/jenkins/.jenkins/jobs/oxCore_3.1.7/workspace/oxUtil/target/site/apidocs/org/xdi/xml/class-use/GluuErrorHandler.html...
Generating /home/jenkins/.jenkins/jobs/oxCore_3.1.7/workspace/oxUtil/target/site/apidocs/org/xdi/zip/class-use/CompressionHelper.html...
Generating /home/jenkins/.jenkins/jobs/oxCore_3.1.7/workspace/oxUtil/target/site/apidocs/org/gluu/log/package-use.html...
Generating /home/jenkins/.jenkins/jobs/oxCore_3.1.7/workspace/oxUtil/target/site/apidocs/org/xdi/context/package-use.html...
Generating /home/jenkins/.jenkins/jobs/oxCore_3.1.7/workspace/oxUtil/target/site/apidocs/org/xdi/log/package-use.html...
Generating /home/jenkins/.jenkins/jobs/oxCore_3.1.7/workspace/oxUtil/target/site/apidocs/org/xdi/model/package-use.html...
Generating /home/jenkins/.jenkins/jobs/oxCore_3.1.7/workspace/oxUtil/target/site/apidocs/org/xdi/model/config/package-use.html...
Generating /home/jenkins/.jenkins/jobs/oxCore_3.1.7/workspace/oxUtil/target/site/apidocs/org/xdi/model/ldap/package-use.html...
Generating /home/jenkins/.jenkins/jobs/oxCore_3.1.7/workspace/oxUtil/target/site/apidocs/org/xdi/net/package-use.html...
Generating /home/jenkins/.jenkins/jobs/oxCore_3.1.7/workspace/oxUtil/target/site/apidocs/org/xdi/util/package-use.html...
Generating /home/jenkins/.jenkins/jobs/oxCore_3.1.7/workspace/oxUtil/target/site/apidocs/org/xdi/util/exception/package-use.html...
Generating /home/jenkins/.jenkins/jobs/oxCore_3.1.7/workspace/oxUtil/target/site/apidocs/org/xdi/util/image/package-use.html...
Generating /home/jenkins/.jenkins/jobs/oxCore_3.1.7/workspace/oxUtil/target/site/apidocs/org/xdi/util/init/package-use.html...
Generating /home/jenkins/.jenkins/jobs/oxCore_3.1.7/workspace/oxUtil/target/site/apidocs/org/xdi/util/io/package-use.html...
Generating /home/jenkins/.jenkins/jobs/oxCore_3.1.7/workspace/oxUtil/target/site/apidocs/org/xdi/util/process/package-use.html...
Generating /home/jenkins/.jenkins/jobs/oxCore_3.1.7/workspace/oxUtil/target/site/apidocs/org/xdi/util/properties/package-use.html...
Generating /home/jenkins/.jenkins/jobs/oxCore_3.1.7/workspace/oxUtil/target/site/apidocs/org/xdi/util/repository/package-use.html...
Generating /home/jenkins/.jenkins/jobs/oxCore_3.1.7/workspace/oxUtil/target/site/apidocs/org/xdi/util/security/package-use.html...
Generating /home/jenkins/.jenkins/jobs/oxCore_3.1.7/workspace/oxUtil/target/site/apidocs/org/xdi/xml/package-use.html...
Generating /home/jenkins/.jenkins/jobs/oxCore_3.1.7/workspace/oxUtil/target/site/apidocs/org/xdi/zip/package-use.html...
Building index for all the packages and classes...
Generating /home/jenkins/.jenkins/jobs/oxCore_3.1.7/workspace/oxUtil/target/site/apidocs/overview-tree.html...
Generating /home/jenkins/.jenkins/jobs/oxCore_3.1.7/workspace/oxUtil/target/site/apidocs/index-all.html...
Generating /home/jenkins/.jenkins/jobs/oxCore_3.1.7/workspace/oxUtil/target/site/apidocs/deprecated-list.html...
Building index for all classes...
Generating /home/jenkins/.jenkins/jobs/oxCore_3.1.7/workspace/oxUtil/target/site/apidocs/allclasses-frame.html...
Generating /home/jenkins/.jenkins/jobs/oxCore_3.1.7/workspace/oxUtil/target/site/apidocs/allclasses-noframe.html...
Generating /home/jenkins/.jenkins/jobs/oxCore_3.1.7/workspace/oxUtil/target/site/apidocs/index.html...
Generating /home/jenkins/.jenkins/jobs/oxCore_3.1.7/workspace/oxUtil/target/site/apidocs/overview-summary.html...
Generating /home/jenkins/.jenkins/jobs/oxCore_3.1.7/workspace/oxUtil/target/site/apidocs/help-doc.html...
17 errors
73 warnings
[INFO] ------------------------------------------------------------------------
[INFO] Reactor Summary:
[INFO] 
[INFO] oxCore ............................................. SUCCESS [  7.843 s]
[INFO] oxLdap-annotations ................................. SUCCESS [ 16.848 s]
[INFO] oxUtil ............................................. FAILURE [ 43.174 s]
[INFO] oxLdap ............................................. SKIPPED
[INFO] oxLdapSample ....................................... SKIPPED
[INFO] oxModel ............................................ SKIPPED
[INFO] oxSaml ............................................. SKIPPED
[INFO] oxService .......................................... SKIPPED
[INFO] oxTomcat ........................................... SKIPPED
[INFO] oxServer ........................................... SKIPPED
[INFO] oxGwt .............................................. SKIPPED
[INFO] oxJsfUtil .......................................... SKIPPED
[INFO] ------------------------------------------------------------------------
[INFO] BUILD FAILURE
[INFO] ------------------------------------------------------------------------
[INFO] Total time: 01:10 min
[INFO] Finished at: 2021-05-11T07:09:42+00:00
[INFO] Final Memory: 63M/678M
[INFO] ------------------------------------------------------------------------
[ERROR] Failed to execute goal org.apache.maven.plugins:maven-javadoc-plugin:3.0.1:javadoc (default-cli) on project oxcore-util: An error has occurred in Javadoc report generation:
[ERROR] Exit code: 1 - warning: unknown enum constant ThreadingBehavior.IMMUTABLE
[ERROR] reason: class file for org.apache.http.annotation.ThreadingBehavior not found
[ERROR] warning: unknown enum constant ThreadingBehavior.IMMUTABLE
[ERROR] warning: unknown enum constant ThreadingBehavior.SAFE
[ERROR] warning: unknown enum constant ThreadingBehavior.SAFE_CONDITIONAL
[ERROR] warning: unknown enum constant ThreadingBehavior.SAFE_CONDITIONAL
[ERROR] warning: unknown enum constant ThreadingBehavior.SAFE_CONDITIONAL
[ERROR] warning: unknown enum constant ThreadingBehavior.SAFE_CONDITIONAL
[ERROR] warning: unknown enum constant ThreadingBehavior.SAFE
[ERROR] /home/jenkins/.jenkins/jobs/oxCore_3.1.7/workspace/oxUtil/src/main/java/org/xdi/context/WebContext.java:23: warning: no description for @param
[ERROR] * @param name
[ERROR] ^
[ERROR] /home/jenkins/.jenkins/jobs/oxCore_3.1.7/workspace/oxUtil/src/main/java/org/xdi/context/WebContext.java:38: warning: no description for @param
[ERROR] * @param name
[ERROR] ^
[ERROR] /home/jenkins/.jenkins/jobs/oxCore_3.1.7/workspace/oxUtil/src/main/java/org/xdi/context/WebContext.java:46: warning: no description for @param
[ERROR] * @param name
[ERROR] ^
[ERROR] /home/jenkins/.jenkins/jobs/oxCore_3.1.7/workspace/oxUtil/src/main/java/org/xdi/context/WebContext.java:47: warning: no description for @param
[ERROR] * @param value
[ERROR] ^
[ERROR] /home/jenkins/.jenkins/jobs/oxCore_3.1.7/workspace/oxUtil/src/main/java/org/xdi/context/WebContext.java:54: warning: no description for @param
[ERROR] * @param name
[ERROR] ^
[ERROR] /home/jenkins/.jenkins/jobs/oxCore_3.1.7/workspace/oxUtil/src/main/java/org/xdi/context/WebContext.java:62: warning: no description for @param
[ERROR] * @param name
[ERROR] ^
[ERROR] /home/jenkins/.jenkins/jobs/oxCore_3.1.7/workspace/oxUtil/src/main/java/org/xdi/context/WebContext.java:63: warning: no description for @param
[ERROR] * @param value
[ERROR] ^
[ERROR] /home/jenkins/.jenkins/jobs/oxCore_3.1.7/workspace/oxUtil/src/main/java/org/xdi/context/WebContext.java:70: warning: no description for @param
[ERROR] * @param name
[ERROR] ^
[ERROR] /home/jenkins/.jenkins/jobs/oxCore_3.1.7/workspace/oxUtil/src/main/java/org/xdi/context/WebContext.java:85: warning: no description for @param
[ERROR] * @param content
[ERROR] ^
[ERROR] /home/jenkins/.jenkins/jobs/oxCore_3.1.7/workspace/oxUtil/src/main/java/org/xdi/context/WebContext.java:87: warning: no @throws for java.io.IOException
[ERROR] public void writeResponseContent(String content) throws IOException;
[ERROR] ^
[ERROR] /home/jenkins/.jenkins/jobs/oxCore_3.1.7/workspace/oxUtil/src/main/java/org/xdi/context/WebContext.java:92: warning: no description for @param
[ERROR] * @param name
[ERROR] ^
[ERROR] /home/jenkins/.jenkins/jobs/oxCore_3.1.7/workspace/oxUtil/src/main/java/org/xdi/context/WebContext.java:93: warning: no description for @param
[ERROR] * @param value
[ERROR] ^
[ERROR] /home/jenkins/.jenkins/jobs/oxCore_3.1.7/workspace/oxUtil/src/main/java/org/xdi/context/J2EContext.java:28: warning: no description for @param
[ERROR] * @param request
[ERROR] ^
[ERROR] /home/jenkins/.jenkins/jobs/oxCore_3.1.7/workspace/oxUtil/src/main/java/org/xdi/context/J2EContext.java:29: warning: no description for @param
[ERROR] * @param response
[ERROR] ^
[ERROR] /home/jenkins/.jenkins/jobs/oxCore_3.1.7/workspace/oxUtil/src/main/java/org/xdi/net/InetAddressUtility.java:31: warning: no @param for ipAddress
[ERROR] public static boolean isIpAddress(String ipAddress) {
[ERROR] ^
[ERROR] /home/jenkins/.jenkins/jobs/oxCore_3.1.7/workspace/oxUtil/src/main/java/org/xdi/net/InetAddressUtility.java:31: warning: no @return
[ERROR] public static boolean isIpAddress(String ipAddress) {
[ERROR] ^
[ERROR] /home/jenkins/.jenkins/jobs/oxCore_3.1.7/workspace/oxUtil/src/main/java/org/xdi/util/EasySSLProtocolSocketFactory.java:177: warning: no @param for socket
[ERROR] public Socket createSocket(Socket socket, String host, int port, boolean autoClose) throws IOException, UnknownHostException {
[ERROR] ^
[ERROR] /home/jenkins/.jenkins/jobs/oxCore_3.1.7/workspace/oxUtil/src/main/java/org/xdi/util/EasySSLProtocolSocketFactory.java:177: warning: no @param for host
[ERROR] public Socket createSocket(Socket socket, String host, int port, boolean autoClose) throws IOException, UnknownHostException {
[ERROR] ^
[ERROR] /home/jenkins/.jenkins/jobs/oxCore_3.1.7/workspace/oxUtil/src/main/java/org/xdi/util/EasySSLProtocolSocketFactory.java:177: warning: no @param for port
[ERROR] public Socket createSocket(Socket socket, String host, int port, boolean autoClose) throws IOException, UnknownHostException {
[ERROR] ^
[ERROR] /home/jenkins/.jenkins/jobs/oxCore_3.1.7/workspace/oxUtil/src/main/java/org/xdi/util/EasySSLProtocolSocketFactory.java:177: warning: no @param for autoClose
[ERROR] public Socket createSocket(Socket socket, String host, int port, boolean autoClose) throws IOException, UnknownHostException {
[ERROR] ^
[ERROR] /home/jenkins/.jenkins/jobs/oxCore_3.1.7/workspace/oxUtil/src/main/java/org/xdi/util/EasySSLProtocolSocketFactory.java:177: warning: no @return
[ERROR] public Socket createSocket(Socket socket, String host, int port, boolean autoClose) throws IOException, UnknownHostException {
[ERROR] ^
[ERROR] /home/jenkins/.jenkins/jobs/oxCore_3.1.7/workspace/oxUtil/src/main/java/org/xdi/util/EasySSLProtocolSocketFactory.java:177: warning: no @throws for java.io.IOException
[ERROR] public Socket createSocket(Socket socket, String host, int port, boolean autoClose) throws IOException, UnknownHostException {
[ERROR] ^
[ERROR] /home/jenkins/.jenkins/jobs/oxCore_3.1.7/workspace/oxUtil/src/main/java/org/xdi/util/EasySSLProtocolSocketFactory.java:177: warning: no @throws for java.net.UnknownHostException
[ERROR] public Socket createSocket(Socket socket, String host, int port, boolean autoClose) throws IOException, UnknownHostException {
[ERROR] ^
[ERROR] /home/jenkins/.jenkins/jobs/oxCore_3.1.7/workspace/oxUtil/src/main/java/org/xdi/util/EasySSLProtocolSocketFactory.java:54: error: unexpected end tag: </p>
[ERROR] * </p>
[ERROR] ^
[ERROR] /home/jenkins/.jenkins/jobs/oxCore_3.1.7/workspace/oxUtil/src/main/java/org/xdi/util/EasySSLProtocolSocketFactory.java:68: error: unexpected end tag: </p>
[ERROR] * </p>
[ERROR] ^
[ERROR] /home/jenkins/.jenkins/jobs/oxCore_3.1.7/workspace/oxUtil/src/main/java/org/xdi/util/EasySSLProtocolSocketFactory.java:70: error: invalid uri: "mailto:oleg -at- ural.ru"
[ERROR] * @author <a href="mailto:oleg -at- ural.ru">Oleg Kalnichevski</a>
[ERROR] ^
[ERROR] /home/jenkins/.jenkins/jobs/oxCore_3.1.7/workspace/oxUtil/src/main/java/org/xdi/util/EasyX509TrustManager.java:57: warning: no @param for keystore
[ERROR] public EasyX509TrustManager(KeyStore keystore) throws NoSuchAlgorithmException, KeyStoreException {
[ERROR] ^
[ERROR] /home/jenkins/.jenkins/jobs/oxCore_3.1.7/workspace/oxUtil/src/main/java/org/xdi/util/EasyX509TrustManager.java:57: warning: no @throws for java.security.NoSuchAlgorithmException
[ERROR] public EasyX509TrustManager(KeyStore keystore) throws NoSuchAlgorithmException, KeyStoreException {
[ERROR] ^
[ERROR] /home/jenkins/.jenkins/jobs/oxCore_3.1.7/workspace/oxUtil/src/main/java/org/xdi/util/EasyX509TrustManager.java:57: warning: no @throws for java.security.KeyStoreException
[ERROR] public EasyX509TrustManager(KeyStore keystore) throws NoSuchAlgorithmException, KeyStoreException {
[ERROR] ^
[ERROR] /home/jenkins/.jenkins/jobs/oxCore_3.1.7/workspace/oxUtil/src/main/java/org/xdi/util/FileUtil.java:33: warning: no description for @param
[ERROR] * @param filePath
[ERROR] ^
[ERROR] /home/jenkins/.jenkins/jobs/oxCore_3.1.7/workspace/oxUtil/src/main/java/org/xdi/util/FileUtil.java:34: warning: no description for @param
[ERROR] * @param position
[ERROR] ^
[ERROR] /home/jenkins/.jenkins/jobs/oxCore_3.1.7/workspace/oxUtil/src/main/java/org/xdi/util/FileUtil.java:35: warning: no description for @param
[ERROR] * @param data
[ERROR] ^
[ERROR] /home/jenkins/.jenkins/jobs/oxCore_3.1.7/workspace/oxUtil/src/main/java/org/xdi/util/FileUtil.java:36: warning: no description for @return
[ERROR] * @return
[ERROR] ^
[ERROR] /home/jenkins/.jenkins/jobs/oxCore_3.1.7/workspace/oxUtil/src/main/java/org/xdi/util/FileUtil.java:67: warning: no description for @param
[ERROR] * @param filePath
[ERROR] ^
[ERROR] /home/jenkins/.jenkins/jobs/oxCore_3.1.7/workspace/oxUtil/src/main/java/org/xdi/util/FileUtil.java:68: warning: no description for @param
[ERROR] * @param position
[ERROR] ^
[ERROR] /home/jenkins/.jenkins/jobs/oxCore_3.1.7/workspace/oxUtil/src/main/java/org/xdi/util/FileUtil.java:69: warning: no description for @param
[ERROR] * @param data
[ERROR] ^
[ERROR] /home/jenkins/.jenkins/jobs/oxCore_3.1.7/workspace/oxUtil/src/main/java/org/xdi/util/FileUtil.java:70: warning: no description for @return
[ERROR] * @return
[ERROR] ^
[ERROR] /home/jenkins/.jenkins/jobs/oxCore_3.1.7/workspace/oxUtil/src/main/java/org/xdi/util/FileUtil.java:91: warning: no description for @param
[ERROR] * @param filePath
[ERROR] ^
[ERROR] /home/jenkins/.jenkins/jobs/oxCore_3.1.7/workspace/oxUtil/src/main/java/org/xdi/util/FileUtil.java:92: warning: no description for @param
[ERROR] * @param searchStr
[ERROR] ^
[ERROR] /home/jenkins/.jenkins/jobs/oxCore_3.1.7/workspace/oxUtil/src/main/java/org/xdi/util/FileUtil.java:93: warning: no description for @return
[ERROR] * @return
[ERROR] ^
[ERROR] /home/jenkins/.jenkins/jobs/oxCore_3.1.7/workspace/oxUtil/src/main/java/org/xdi/util/FileUtil.java:144: warning: no description for @param
[ERROR] * @param url
[ERROR] ^
[ERROR] /home/jenkins/.jenkins/jobs/oxCore_3.1.7/workspace/oxUtil/src/main/java/org/xdi/util/FileUtil.java:145: warning: no description for @return
[ERROR] * @return
[ERROR] ^
[ERROR] /home/jenkins/.jenkins/jobs/oxCore_3.1.7/workspace/oxUtil/src/main/java/org/xdi/util/FileUtil.java:174: warning: no description for @param
[ERROR] * @param filePath
[ERROR] ^
[ERROR] /home/jenkins/.jenkins/jobs/oxCore_3.1.7/workspace/oxUtil/src/main/java/org/xdi/util/FileUtil.java:175: warning: no description for @return
[ERROR] * @return
[ERROR] ^
[ERROR] /home/jenkins/.jenkins/jobs/oxCore_3.1.7/workspace/oxUtil/src/main/java/org/xdi/util/InterfaceRegistry.java:43: warning: no @param for <T>
[ERROR] public static synchronized <T> T get(Class p_interface) {
[ERROR] ^
[ERROR] /home/jenkins/.jenkins/jobs/oxCore_3.1.7/workspace/oxUtil/src/main/java/org/xdi/util/Util.java:37: error: unknown tag: T
[ERROR] * @return An ArrayList<T> of the same values *
[ERROR] ^
[ERROR] /home/jenkins/.jenkins/jobs/oxCore_3.1.7/workspace/oxUtil/src/main/java/org/xdi/util/Util.java:48: error: unknown tag: String
[ERROR] * Convert a list of unknown type to a List<String> in a type-safe way
[ERROR] ^
[ERROR] /home/jenkins/.jenkins/jobs/oxCore_3.1.7/workspace/oxUtil/src/main/java/org/xdi/util/Util.java:52: error: unknown tag: String
[ERROR] * @return List<String> of the items in list
[ERROR] ^
[ERROR] /home/jenkins/.jenkins/jobs/oxCore_3.1.7/workspace/oxUtil/src/main/java/org/xdi/util/Util.java:63: error: unknown tag: String
[ERROR] * Convert a single String to a List<String>
[ERROR] ^
[ERROR] /home/jenkins/.jenkins/jobs/oxCore_3.1.7/workspace/oxUtil/src/main/java/org/xdi/util/Util.java:76: error: unknown tag: String
[ERROR] * Convert a String array to an List<String>
[ERROR] ^
[ERROR] /home/jenkins/.jenkins/jobs/oxCore_3.1.7/workspace/oxUtil/src/main/java/org/xdi/util/Util.java:80: error: unknown tag: String
[ERROR] * @return List<String> of the items in the array
[ERROR] ^
[ERROR] /home/jenkins/.jenkins/jobs/oxCore_3.1.7/workspace/oxUtil/src/main/java/org/xdi/util/Util.java:105: warning: no description for @throws
[ERROR] * @throws IOException
[ERROR] ^
[ERROR] /home/jenkins/.jenkins/jobs/oxCore_3.1.7/workspace/oxUtil/src/main/java/org/xdi/util/Util.java:117: warning: no description for @throws
[ERROR] * @throws IOException
[ERROR] ^
[ERROR] /home/jenkins/.jenkins/jobs/oxCore_3.1.7/workspace/oxUtil/src/main/java/org/xdi/util/Util.java:164: warning: no description for @param
[ERROR] * @param dn
[ERROR] ^
[ERROR] /home/jenkins/.jenkins/jobs/oxCore_3.1.7/workspace/oxUtil/src/main/java/org/xdi/util/process/ProcessHelper.java:97: warning: no description for @param
[ERROR] * @param streamHandler
[ERROR] ^
[ERROR] /home/jenkins/.jenkins/jobs/oxCore_3.1.7/workspace/oxUtil/src/main/java/org/xdi/util/process/ProcessHelper.java:102: warning: no @param for commandLine
[ERROR] public static PrintResultHandler executeProgram(CommandLine commandLine, long printJobTimeout, boolean printInBackground,
[ERROR] ^
[ERROR] /home/jenkins/.jenkins/jobs/oxCore_3.1.7/workspace/oxUtil/src/main/java/org/xdi/util/process/ProcessHelper.java:102: warning: no @param for successExitValue
[ERROR] public static PrintResultHandler executeProgram(CommandLine commandLine, long printJobTimeout, boolean printInBackground,
[ERROR] ^
[ERROR] /home/jenkins/.jenkins/jobs/oxCore_3.1.7/workspace/oxUtil/src/main/java/org/xdi/util/process/ProcessHelper.java:114: warning: no description for @param
[ERROR] * @param streamHandler
[ERROR] ^
[ERROR] /home/jenkins/.jenkins/jobs/oxCore_3.1.7/workspace/oxUtil/src/main/java/org/xdi/util/process/ProcessHelper.java:119: warning: no @param for commandLine
[ERROR] public static PrintResultHandler executeProgram(CommandLine commandLine, String workingDirectory, long printJobTimeout,
[ERROR] ^
[ERROR] /home/jenkins/.jenkins/jobs/oxCore_3.1.7/workspace/oxUtil/src/main/java/org/xdi/util/process/ProcessHelper.java:119: warning: no @param for workingDirectory
[ERROR] public static PrintResultHandler executeProgram(CommandLine commandLine, String workingDirectory, long printJobTimeout,
[ERROR] ^
[ERROR] /home/jenkins/.jenkins/jobs/oxCore_3.1.7/workspace/oxUtil/src/main/java/org/xdi/util/process/ProcessHelper.java:119: warning: no @param for successExitValue
[ERROR] public static PrintResultHandler executeProgram(CommandLine commandLine, String workingDirectory, long printJobTimeout,
[ERROR] ^
[ERROR] /home/jenkins/.jenkins/jobs/oxCore_3.1.7/workspace/oxUtil/src/main/java/org/xdi/util/security/BCrypt.java:26: error: self-closing element not allowed
[ERROR] * String pw_hash = BCrypt.hashpw(plain_password, BCrypt.gensalt()); <br />
[ERROR] ^
[ERROR] /home/jenkins/.jenkins/jobs/oxCore_3.1.7/workspace/oxUtil/src/main/java/org/xdi/util/security/BCrypt.java:33: error: self-closing element not allowed
[ERROR] * if (BCrypt.checkpw(candidate_password, stored_hash))<br />
[ERROR] ^
[ERROR] /home/jenkins/.jenkins/jobs/oxCore_3.1.7/workspace/oxUtil/src/main/java/org/xdi/util/security/BCrypt.java:34: error: self-closing element not allowed
[ERROR] * &nbsp;&nbsp;&nbsp;&nbsp;System.out.println("It matches");<br />
[ERROR] ^
[ERROR] /home/jenkins/.jenkins/jobs/oxCore_3.1.7/workspace/oxUtil/src/main/java/org/xdi/util/security/BCrypt.java:35: error: self-closing element not allowed
[ERROR] * else<br />
[ERROR] ^
[ERROR] /home/jenkins/.jenkins/jobs/oxCore_3.1.7/workspace/oxUtil/src/main/java/org/xdi/util/security/BCrypt.java:36: error: self-closing element not allowed
[ERROR] * &nbsp;&nbsp;&nbsp;&nbsp;System.out.println("It does not match");<br />
[ERROR] ^
[ERROR] /home/jenkins/.jenkins/jobs/oxCore_3.1.7/workspace/oxUtil/src/main/java/org/xdi/util/security/BCrypt.java:43: error: self-closing element not allowed
[ERROR] * String strong_salt = BCrypt.gensalt(10)<br />
[ERROR] ^
[ERROR] /home/jenkins/.jenkins/jobs/oxCore_3.1.7/workspace/oxUtil/src/main/java/org/xdi/util/security/BCrypt.java:44: error: self-closing element not allowed
[ERROR] * String stronger_salt = BCrypt.gensalt(12)<br />
[ERROR] ^
[ERROR] /home/jenkins/.jenkins/jobs/oxCore_3.1.7/workspace/oxUtil/src/main/java/org/xdi/util/security/StringEncrypter.java:223: warning: no description for @throws
[ERROR] * @throws EncryptionException
[ERROR] ^
[ERROR] /home/jenkins/.jenkins/jobs/oxCore_3.1.7/workspace/oxUtil/src/main/java/org/xdi/util/security/StringEncrypter.java:240: warning: no description for @throws
[ERROR] * @throws EncryptionException
[ERROR] ^
[ERROR] /home/jenkins/.jenkins/jobs/oxCore_3.1.7/workspace/oxUtil/src/main/java/org/xdi/util/security/StringEncrypter.java:242: warning: no @param for encryptionKey
[ERROR] public String decrypt(final String encryptedString, String encryptionKey) throws EncryptionException {
[ERROR] ^
[ERROR] /home/jenkins/.jenkins/jobs/oxCore_3.1.7/workspace/oxUtil/src/main/java/org/xdi/util/security/StringEncrypter.java:292: warning: no description for @throws
[ERROR] * @throws EncryptionException
[ERROR] ^
[ERROR] /home/jenkins/.jenkins/jobs/oxCore_3.1.7/workspace/oxUtil/src/main/java/org/xdi/util/security/StringEncrypter.java:309: warning: no description for @throws
[ERROR] * @throws EncryptionException
[ERROR] ^
[ERROR] /home/jenkins/.jenkins/jobs/oxCore_3.1.7/workspace/oxUtil/src/main/java/org/xdi/util/security/StringEncrypter.java:311: warning: no @param for encryptionKey
[ERROR] public String encrypt(final String unencryptedString, String encryptionKey) throws EncryptionException {
[ERROR] ^
[ERROR] /home/jenkins/.jenkins/jobs/oxCore_3.1.7/workspace/oxUtil/src/main/java/org/xdi/util/security/StringEncrypter.java:139: error: @param name not found
[ERROR] * @param encryptionKey
[ERROR] ^
[ERROR] /home/jenkins/.jenkins/jobs/oxCore_3.1.7/workspace/oxUtil/src/main/java/org/xdi/util/security/StringEncrypter.java:141: warning: no description for @throws
[ERROR] * @throws EncryptionException
[ERROR] ^
[ERROR] /home/jenkins/.jenkins/jobs/oxCore_3.1.7/workspace/oxUtil/src/main/java/org/xdi/util/security/StringEncrypter.java:161: warning: no description for @throws
[ERROR] * @throws EncryptionException
[ERROR] ^
[ERROR] /home/jenkins/.jenkins/jobs/oxCore_3.1.7/workspace/oxUtil/src/main/java/org/xdi/xml/XMLValidator.java:26: warning: no description for @param
[ERROR] * @param stream
[ERROR] ^
[ERROR] /home/jenkins/.jenkins/jobs/oxCore_3.1.7/workspace/oxUtil/src/main/java/org/xdi/xml/XMLValidator.java:27: warning: no description for @param
[ERROR] * @param validationSchema
[ERROR] ^
[ERROR] /home/jenkins/.jenkins/jobs/oxCore_3.1.7/workspace/oxUtil/src/main/java/org/xdi/xml/XMLValidator.java:28: warning: no description for @throws
[ERROR] * @throws IOException
[ERROR] ^
[ERROR] /home/jenkins/.jenkins/jobs/oxCore_3.1.7/workspace/oxUtil/src/main/java/org/xdi/xml/XMLValidator.java:29: warning: no description for @throws
[ERROR] * @throws SAXException
[ERROR] ^
[ERROR] /home/jenkins/.jenkins/jobs/oxCore_3.1.7/workspace/oxUtil/src/main/java/org/xdi/xml/XMLValidator.java:30: warning: no description for @throws
[ERROR] * @throws ParserConfigurationException
[ERROR] ^
[ERROR] 
[ERROR] Command line was: /opt/java/jdk1.8.0_221/jre/../bin/javadoc @options @packages
[ERROR] 
[ERROR] Refer to the generated Javadoc files in '/home/jenkins/.jenkins/jobs/oxCore_3.1.7/workspace/oxUtil/target/site/apidocs' dir.
[ERROR] -> [Help 1]
[ERROR] 
[ERROR] To see the full stack trace of the errors, re-run Maven with the -e switch.
[ERROR] Re-run Maven using the -X switch to enable full debug logging.
[ERROR] 
[ERROR] For more information about the errors and possible solutions, please read the following articles:
[ERROR] [Help 1] http://cwiki.apache.org/confluence/display/MAVEN/MojoExecutionException
[ERROR] 
[ERROR] After correcting the problems, you can resume the build with the command
[ERROR]   mvn <goals> -rf :oxcore-util
Build step 'Invoke top-level Maven targets' marked build as failure
[FINDBUGS] Skipping publisher since build result is FAILURE
TestNG Reports Processing: START
Looking for TestNG results report in workspace using pattern: **/testng-results.xml
Did not find any matching files.
Not sending mail to unregistered user Yuriy.Movchan@gmail.com
Sending e-mails to: support@gluu.org
Finished: FAILURE