FailedConsole Output

Skipping 42 KB.. Full Log
ckage-tree.html...
Generating /home/jenkins/.jenkins/jobs/oxCore_3.1.7/workspace/oxUtil/target/site/apidocs/org/xdi/util/package-frame.html...
Generating /home/jenkins/.jenkins/jobs/oxCore_3.1.7/workspace/oxUtil/target/site/apidocs/org/xdi/util/package-summary.html...
Generating /home/jenkins/.jenkins/jobs/oxCore_3.1.7/workspace/oxUtil/target/site/apidocs/org/xdi/util/package-tree.html...
Generating /home/jenkins/.jenkins/jobs/oxCore_3.1.7/workspace/oxUtil/target/site/apidocs/org/xdi/util/exception/package-frame.html...
Generating /home/jenkins/.jenkins/jobs/oxCore_3.1.7/workspace/oxUtil/target/site/apidocs/org/xdi/util/exception/package-summary.html...
Generating /home/jenkins/.jenkins/jobs/oxCore_3.1.7/workspace/oxUtil/target/site/apidocs/org/xdi/util/exception/package-tree.html...
Generating /home/jenkins/.jenkins/jobs/oxCore_3.1.7/workspace/oxUtil/target/site/apidocs/org/xdi/util/image/package-frame.html...
Generating /home/jenkins/.jenkins/jobs/oxCore_3.1.7/workspace/oxUtil/target/site/apidocs/org/xdi/util/image/package-summary.html...
Generating /home/jenkins/.jenkins/jobs/oxCore_3.1.7/workspace/oxUtil/target/site/apidocs/org/xdi/util/image/package-tree.html...
Generating /home/jenkins/.jenkins/jobs/oxCore_3.1.7/workspace/oxUtil/target/site/apidocs/org/xdi/util/init/package-frame.html...
Generating /home/jenkins/.jenkins/jobs/oxCore_3.1.7/workspace/oxUtil/target/site/apidocs/org/xdi/util/init/package-summary.html...
Generating /home/jenkins/.jenkins/jobs/oxCore_3.1.7/workspace/oxUtil/target/site/apidocs/org/xdi/util/init/package-tree.html...
Generating /home/jenkins/.jenkins/jobs/oxCore_3.1.7/workspace/oxUtil/target/site/apidocs/org/xdi/util/io/package-frame.html...
Generating /home/jenkins/.jenkins/jobs/oxCore_3.1.7/workspace/oxUtil/target/site/apidocs/org/xdi/util/io/package-summary.html...
Generating /home/jenkins/.jenkins/jobs/oxCore_3.1.7/workspace/oxUtil/target/site/apidocs/org/xdi/util/io/package-tree.html...
Generating /home/jenkins/.jenkins/jobs/oxCore_3.1.7/workspace/oxUtil/target/site/apidocs/org/xdi/util/process/package-frame.html...
Generating /home/jenkins/.jenkins/jobs/oxCore_3.1.7/workspace/oxUtil/target/site/apidocs/org/xdi/util/process/package-summary.html...
Generating /home/jenkins/.jenkins/jobs/oxCore_3.1.7/workspace/oxUtil/target/site/apidocs/org/xdi/util/process/package-tree.html...
Generating /home/jenkins/.jenkins/jobs/oxCore_3.1.7/workspace/oxUtil/target/site/apidocs/org/xdi/util/properties/package-frame.html...
Generating /home/jenkins/.jenkins/jobs/oxCore_3.1.7/workspace/oxUtil/target/site/apidocs/org/xdi/util/properties/package-summary.html...
Generating /home/jenkins/.jenkins/jobs/oxCore_3.1.7/workspace/oxUtil/target/site/apidocs/org/xdi/util/properties/package-tree.html...
Generating /home/jenkins/.jenkins/jobs/oxCore_3.1.7/workspace/oxUtil/target/site/apidocs/org/xdi/util/repository/package-frame.html...
Generating /home/jenkins/.jenkins/jobs/oxCore_3.1.7/workspace/oxUtil/target/site/apidocs/org/xdi/util/repository/package-summary.html...
Generating /home/jenkins/.jenkins/jobs/oxCore_3.1.7/workspace/oxUtil/target/site/apidocs/org/xdi/util/repository/package-tree.html...
Generating /home/jenkins/.jenkins/jobs/oxCore_3.1.7/workspace/oxUtil/target/site/apidocs/org/xdi/util/security/package-frame.html...
Generating /home/jenkins/.jenkins/jobs/oxCore_3.1.7/workspace/oxUtil/target/site/apidocs/org/xdi/util/security/package-summary.html...
Generating /home/jenkins/.jenkins/jobs/oxCore_3.1.7/workspace/oxUtil/target/site/apidocs/org/xdi/util/security/package-tree.html...
Generating /home/jenkins/.jenkins/jobs/oxCore_3.1.7/workspace/oxUtil/target/site/apidocs/org/xdi/xml/package-frame.html...
Generating /home/jenkins/.jenkins/jobs/oxCore_3.1.7/workspace/oxUtil/target/site/apidocs/org/xdi/xml/package-summary.html...
Generating /home/jenkins/.jenkins/jobs/oxCore_3.1.7/workspace/oxUtil/target/site/apidocs/org/xdi/xml/package-tree.html...
Generating /home/jenkins/.jenkins/jobs/oxCore_3.1.7/workspace/oxUtil/target/site/apidocs/org/xdi/zip/package-frame.html...
Generating /home/jenkins/.jenkins/jobs/oxCore_3.1.7/workspace/oxUtil/target/site/apidocs/org/xdi/zip/package-summary.html...
Generating /home/jenkins/.jenkins/jobs/oxCore_3.1.7/workspace/oxUtil/target/site/apidocs/org/xdi/zip/package-tree.html...
Generating /home/jenkins/.jenkins/jobs/oxCore_3.1.7/workspace/oxUtil/target/site/apidocs/constant-values.html...
Generating /home/jenkins/.jenkins/jobs/oxCore_3.1.7/workspace/oxUtil/target/site/apidocs/serialized-form.html...
Generating /home/jenkins/.jenkins/jobs/oxCore_3.1.7/workspace/oxUtil/target/site/apidocs/org/gluu/log/class-use/MacAddressLogIdConverter.html...
Generating /home/jenkins/.jenkins/jobs/oxCore_3.1.7/workspace/oxUtil/target/site/apidocs/org/xdi/context/class-use/WebContext.html...
Generating /home/jenkins/.jenkins/jobs/oxCore_3.1.7/workspace/oxUtil/target/site/apidocs/org/xdi/context/class-use/J2EContext.html...
Generating /home/jenkins/.jenkins/jobs/oxCore_3.1.7/workspace/oxUtil/target/site/apidocs/org/xdi/log/class-use/LoggingHelper.html...
Generating /home/jenkins/.jenkins/jobs/oxCore_3.1.7/workspace/oxUtil/target/site/apidocs/org/xdi/model/class-use/TrustContact.html...
Generating /home/jenkins/.jenkins/jobs/oxCore_3.1.7/workspace/oxUtil/target/site/apidocs/org/xdi/model/class-use/SmtpConfiguration.html...
Generating /home/jenkins/.jenkins/jobs/oxCore_3.1.7/workspace/oxUtil/target/site/apidocs/org/xdi/model/class-use/SimpleProperty.html...
Generating /home/jenkins/.jenkins/jobs/oxCore_3.1.7/workspace/oxUtil/target/site/apidocs/org/xdi/model/class-use/SimpleExtendedCustomProperty.html...
Generating /home/jenkins/.jenkins/jobs/oxCore_3.1.7/workspace/oxUtil/target/site/apidocs/org/xdi/model/class-use/SimpleCustomProperty.html...
Generating /home/jenkins/.jenkins/jobs/oxCore_3.1.7/workspace/oxUtil/target/site/apidocs/org/xdi/model/class-use/SelectableEntity.html...
Generating /home/jenkins/.jenkins/jobs/oxCore_3.1.7/workspace/oxUtil/target/site/apidocs/org/xdi/model/class-use/ScriptLocationType.html...
Generating /home/jenkins/.jenkins/jobs/oxCore_3.1.7/workspace/oxUtil/target/site/apidocs/org/xdi/model/class-use/ProgrammingLanguage.html...
Generating /home/jenkins/.jenkins/jobs/oxCore_3.1.7/workspace/oxUtil/target/site/apidocs/org/xdi/model/class-use/ImapPassword.html...
Generating /home/jenkins/.jenkins/jobs/oxCore_3.1.7/workspace/oxUtil/target/site/apidocs/org/xdi/model/class-use/GluuImage.html...
Generating /home/jenkins/.jenkins/jobs/oxCore_3.1.7/workspace/oxUtil/target/site/apidocs/org/xdi/model/class-use/GluuIMAPData.html...
Generating /home/jenkins/.jenkins/jobs/oxCore_3.1.7/workspace/oxUtil/target/site/apidocs/org/xdi/model/class-use/AuthenticationScriptUsageType.html...
Generating /home/jenkins/.jenkins/jobs/oxCore_3.1.7/workspace/oxUtil/target/site/apidocs/org/xdi/model/class-use/AuthenticationMode.html...
Generating /home/jenkins/.jenkins/jobs/oxCore_3.1.7/workspace/oxUtil/target/site/apidocs/org/xdi/model/config/class-use/CustomAuthenticationConfiguration.html...
Generating /home/jenkins/.jenkins/jobs/oxCore_3.1.7/workspace/oxUtil/target/site/apidocs/org/xdi/model/ldap/class-use/GluuLdapConfiguration.html...
Generating /home/jenkins/.jenkins/jobs/oxCore_3.1.7/workspace/oxUtil/target/site/apidocs/org/xdi/net/class-use/TrustAllTrustManager.html...
Generating /home/jenkins/.jenkins/jobs/oxCore_3.1.7/workspace/oxUtil/target/site/apidocs/org/xdi/net/class-use/SslDefaultHttpClient.html...
Generating /home/jenkins/.jenkins/jobs/oxCore_3.1.7/workspace/oxUtil/target/site/apidocs/org/xdi/net/class-use/InetAddressUtility.html...
Generating /home/jenkins/.jenkins/jobs/oxCore_3.1.7/workspace/oxUtil/target/site/apidocs/org/xdi/util/class-use/Util.html...
Generating /home/jenkins/.jenkins/jobs/oxCore_3.1.7/workspace/oxUtil/target/site/apidocs/org/xdi/util/class-use/Triple.html...
Generating /home/jenkins/.jenkins/jobs/oxCore_3.1.7/workspace/oxUtil/target/site/apidocs/org/xdi/util/class-use/StringHelper.html...
Generating /home/jenkins/.jenkins/jobs/oxCore_3.1.7/workspace/oxUtil/target/site/apidocs/org/xdi/util/class-use/SelectableEntityHelper.html...
Generating /home/jenkins/.jenkins/jobs/oxCore_3.1.7/workspace/oxUtil/target/site/apidocs/org/xdi/util/class-use/Pair.html...
Generating /home/jenkins/.jenkins/jobs/oxCore_3.1.7/workspace/oxUtil/target/site/apidocs/org/xdi/util/class-use/LDAPConstants.html...
Generating /home/jenkins/.jenkins/jobs/oxCore_3.1.7/workspace/oxUtil/target/site/apidocs/org/xdi/util/class-use/InterfaceRegistry.html...
Generating /home/jenkins/.jenkins/jobs/oxCore_3.1.7/workspace/oxUtil/target/site/apidocs/org/xdi/util/class-use/INumGenerator.html...
Generating /home/jenkins/.jenkins/jobs/oxCore_3.1.7/workspace/oxUtil/target/site/apidocs/org/xdi/util/class-use/FileUtil.html...
Generating /home/jenkins/.jenkins/jobs/oxCore_3.1.7/workspace/oxUtil/target/site/apidocs/org/xdi/util/class-use/EasyX509TrustManager.html...
Generating /home/jenkins/.jenkins/jobs/oxCore_3.1.7/workspace/oxUtil/target/site/apidocs/org/xdi/util/class-use/EasySSLProtocolSocketFactory.html...
Generating /home/jenkins/.jenkins/jobs/oxCore_3.1.7/workspace/oxUtil/target/site/apidocs/org/xdi/util/class-use/AssertionHelper.html...
Generating /home/jenkins/.jenkins/jobs/oxCore_3.1.7/workspace/oxUtil/target/site/apidocs/org/xdi/util/class-use/ArrayHelper.html...
Generating /home/jenkins/.jenkins/jobs/oxCore_3.1.7/workspace/oxUtil/target/site/apidocs/org/xdi/util/exception/class-use/InvalidSchemaUpdateException.html...
Generating /home/jenkins/.jenkins/jobs/oxCore_3.1.7/workspace/oxUtil/target/site/apidocs/org/xdi/util/exception/class-use/InvalidConfigurationException.html...
Generating /home/jenkins/.jenkins/jobs/oxCore_3.1.7/workspace/oxUtil/target/site/apidocs/org/xdi/util/exception/class-use/InvalidAttributeException.html...
Generating /home/jenkins/.jenkins/jobs/oxCore_3.1.7/workspace/oxUtil/target/site/apidocs/org/xdi/util/exception/class-use/ConfigurationException.html...
Generating /home/jenkins/.jenkins/jobs/oxCore_3.1.7/workspace/oxUtil/target/site/apidocs/org/xdi/util/image/class-use/ImageTransformationUtility.html...
Generating /home/jenkins/.jenkins/jobs/oxCore_3.1.7/workspace/oxUtil/target/site/apidocs/org/xdi/util/init/class-use/Initializable.html...
Generating /home/jenkins/.jenkins/jobs/oxCore_3.1.7/workspace/oxUtil/target/site/apidocs/org/xdi/util/io/class-use/ReverseLineReader.html...
Generating /home/jenkins/.jenkins/jobs/oxCore_3.1.7/workspace/oxUtil/target/site/apidocs/org/xdi/util/io/class-use/HTTPFileDownloader.html...
Generating /home/jenkins/.jenkins/jobs/oxCore_3.1.7/workspace/oxUtil/target/site/apidocs/org/xdi/util/io/class-use/FileUploadWrapper.html...
Generating /home/jenkins/.jenkins/jobs/oxCore_3.1.7/workspace/oxUtil/target/site/apidocs/org/xdi/util/io/class-use/FileHelper.html...
Generating /home/jenkins/.jenkins/jobs/oxCore_3.1.7/workspace/oxUtil/target/site/apidocs/org/xdi/util/io/class-use/FileDownloader.html...
Generating /home/jenkins/.jenkins/jobs/oxCore_3.1.7/workspace/oxUtil/target/site/apidocs/org/xdi/util/io/class-use/FileDownloader.ContentDisposition.html...
Generating /home/jenkins/.jenkins/jobs/oxCore_3.1.7/workspace/oxUtil/target/site/apidocs/org/xdi/util/io/class-use/ExcludeFilterInputStream.html...
Generating /home/jenkins/.jenkins/jobs/oxCore_3.1.7/workspace/oxUtil/target/site/apidocs/org/xdi/util/io/class-use/DownloadWrapper.html...
Generating /home/jenkins/.jenkins/jobs/oxCore_3.1.7/workspace/oxUtil/target/site/apidocs/org/xdi/util/io/class-use/ByteDataInputStream.html...
Generating /home/jenkins/.jenkins/jobs/oxCore_3.1.7/workspace/oxUtil/target/site/apidocs/org/xdi/util/process/class-use/ProcessHelper.html...
Generating /home/jenkins/.jenkins/jobs/oxCore_3.1.7/workspace/oxUtil/target/site/apidocs/org/xdi/util/properties/class-use/FileConfiguration.html...
Generating /home/jenkins/.jenkins/jobs/oxCore_3.1.7/workspace/oxUtil/target/site/apidocs/org/xdi/util/repository/class-use/RepositoryUtility.html...
Generating /home/jenkins/.jenkins/jobs/oxCore_3.1.7/workspace/oxUtil/target/site/apidocs/org/xdi/util/security/class-use/StringEncrypter.html...
Generating /home/jenkins/.jenkins/jobs/oxCore_3.1.7/workspace/oxUtil/target/site/apidocs/org/xdi/util/security/class-use/StringEncrypter.EncryptionException.html...
Generating /home/jenkins/.jenkins/jobs/oxCore_3.1.7/workspace/oxUtil/target/site/apidocs/org/xdi/util/security/class-use/StringDecrypter.html...
Generating /home/jenkins/.jenkins/jobs/oxCore_3.1.7/workspace/oxUtil/target/site/apidocs/org/xdi/util/security/class-use/PropertiesDecrypter.html...
Generating /home/jenkins/.jenkins/jobs/oxCore_3.1.7/workspace/oxUtil/target/site/apidocs/org/xdi/util/security/class-use/CertificateHelper.html...
Generating /home/jenkins/.jenkins/jobs/oxCore_3.1.7/workspace/oxUtil/target/site/apidocs/org/xdi/util/security/class-use/BCrypt.html...
Generating /home/jenkins/.jenkins/jobs/oxCore_3.1.7/workspace/oxUtil/target/site/apidocs/org/xdi/xml/class-use/XMLValidator.html...
Generating /home/jenkins/.jenkins/jobs/oxCore_3.1.7/workspace/oxUtil/target/site/apidocs/org/xdi/xml/class-use/SimpleNamespaceContext.html...
Generating /home/jenkins/.jenkins/jobs/oxCore_3.1.7/workspace/oxUtil/target/site/apidocs/org/xdi/xml/class-use/GluuErrorHandler.html...
Generating /home/jenkins/.jenkins/jobs/oxCore_3.1.7/workspace/oxUtil/target/site/apidocs/org/xdi/zip/class-use/CompressionHelper.html...
Generating /home/jenkins/.jenkins/jobs/oxCore_3.1.7/workspace/oxUtil/target/site/apidocs/org/gluu/log/package-use.html...
Generating /home/jenkins/.jenkins/jobs/oxCore_3.1.7/workspace/oxUtil/target/site/apidocs/org/xdi/context/package-use.html...
Generating /home/jenkins/.jenkins/jobs/oxCore_3.1.7/workspace/oxUtil/target/site/apidocs/org/xdi/log/package-use.html...
Generating /home/jenkins/.jenkins/jobs/oxCore_3.1.7/workspace/oxUtil/target/site/apidocs/org/xdi/model/package-use.html...
Generating /home/jenkins/.jenkins/jobs/oxCore_3.1.7/workspace/oxUtil/target/site/apidocs/org/xdi/model/config/package-use.html...
Generating /home/jenkins/.jenkins/jobs/oxCore_3.1.7/workspace/oxUtil/target/site/apidocs/org/xdi/model/ldap/package-use.html...
Generating /home/jenkins/.jenkins/jobs/oxCore_3.1.7/workspace/oxUtil/target/site/apidocs/org/xdi/net/package-use.html...
Generating /home/jenkins/.jenkins/jobs/oxCore_3.1.7/workspace/oxUtil/target/site/apidocs/org/xdi/util/package-use.html...
Generating /home/jenkins/.jenkins/jobs/oxCore_3.1.7/workspace/oxUtil/target/site/apidocs/org/xdi/util/exception/package-use.html...
Generating /home/jenkins/.jenkins/jobs/oxCore_3.1.7/workspace/oxUtil/target/site/apidocs/org/xdi/util/image/package-use.html...
Generating /home/jenkins/.jenkins/jobs/oxCore_3.1.7/workspace/oxUtil/target/site/apidocs/org/xdi/util/init/package-use.html...
Generating /home/jenkins/.jenkins/jobs/oxCore_3.1.7/workspace/oxUtil/target/site/apidocs/org/xdi/util/io/package-use.html...
Generating /home/jenkins/.jenkins/jobs/oxCore_3.1.7/workspace/oxUtil/target/site/apidocs/org/xdi/util/process/package-use.html...
Generating /home/jenkins/.jenkins/jobs/oxCore_3.1.7/workspace/oxUtil/target/site/apidocs/org/xdi/util/properties/package-use.html...
Generating /home/jenkins/.jenkins/jobs/oxCore_3.1.7/workspace/oxUtil/target/site/apidocs/org/xdi/util/repository/package-use.html...
Generating /home/jenkins/.jenkins/jobs/oxCore_3.1.7/workspace/oxUtil/target/site/apidocs/org/xdi/util/security/package-use.html...
Generating /home/jenkins/.jenkins/jobs/oxCore_3.1.7/workspace/oxUtil/target/site/apidocs/org/xdi/xml/package-use.html...
Generating /home/jenkins/.jenkins/jobs/oxCore_3.1.7/workspace/oxUtil/target/site/apidocs/org/xdi/zip/package-use.html...
Building index for all the packages and classes...
Generating /home/jenkins/.jenkins/jobs/oxCore_3.1.7/workspace/oxUtil/target/site/apidocs/overview-tree.html...
Generating /home/jenkins/.jenkins/jobs/oxCore_3.1.7/workspace/oxUtil/target/site/apidocs/index-all.html...
Generating /home/jenkins/.jenkins/jobs/oxCore_3.1.7/workspace/oxUtil/target/site/apidocs/deprecated-list.html...
Building index for all classes...
Generating /home/jenkins/.jenkins/jobs/oxCore_3.1.7/workspace/oxUtil/target/site/apidocs/allclasses-frame.html...
Generating /home/jenkins/.jenkins/jobs/oxCore_3.1.7/workspace/oxUtil/target/site/apidocs/allclasses-noframe.html...
Generating /home/jenkins/.jenkins/jobs/oxCore_3.1.7/workspace/oxUtil/target/site/apidocs/index.html...
Generating /home/jenkins/.jenkins/jobs/oxCore_3.1.7/workspace/oxUtil/target/site/apidocs/overview-summary.html...
Generating /home/jenkins/.jenkins/jobs/oxCore_3.1.7/workspace/oxUtil/target/site/apidocs/help-doc.html...
17 errors
73 warnings
[ERROR] Error while creating javadoc report: 
Exit code: 1 - warning: unknown enum constant ThreadingBehavior.IMMUTABLE
  reason: class file for org.apache.http.annotation.ThreadingBehavior not found
warning: unknown enum constant ThreadingBehavior.IMMUTABLE
warning: unknown enum constant ThreadingBehavior.SAFE
warning: unknown enum constant ThreadingBehavior.SAFE_CONDITIONAL
warning: unknown enum constant ThreadingBehavior.SAFE_CONDITIONAL
warning: unknown enum constant ThreadingBehavior.SAFE_CONDITIONAL
warning: unknown enum constant ThreadingBehavior.SAFE_CONDITIONAL
warning: unknown enum constant ThreadingBehavior.SAFE
/home/jenkins/.jenkins/jobs/oxCore_3.1.7/workspace/oxUtil/src/main/java/org/xdi/context/WebContext.java:23: warning: no description for @param
	 * @param name
	   ^
/home/jenkins/.jenkins/jobs/oxCore_3.1.7/workspace/oxUtil/src/main/java/org/xdi/context/WebContext.java:38: warning: no description for @param
	 * @param name
	   ^
/home/jenkins/.jenkins/jobs/oxCore_3.1.7/workspace/oxUtil/src/main/java/org/xdi/context/WebContext.java:46: warning: no description for @param
	 * @param name
	   ^
/home/jenkins/.jenkins/jobs/oxCore_3.1.7/workspace/oxUtil/src/main/java/org/xdi/context/WebContext.java:47: warning: no description for @param
	 * @param value
	   ^
/home/jenkins/.jenkins/jobs/oxCore_3.1.7/workspace/oxUtil/src/main/java/org/xdi/context/WebContext.java:54: warning: no description for @param
	 * @param name
	   ^
/home/jenkins/.jenkins/jobs/oxCore_3.1.7/workspace/oxUtil/src/main/java/org/xdi/context/WebContext.java:62: warning: no description for @param
	 * @param name
	   ^
/home/jenkins/.jenkins/jobs/oxCore_3.1.7/workspace/oxUtil/src/main/java/org/xdi/context/WebContext.java:63: warning: no description for @param
	 * @param value
	   ^
/home/jenkins/.jenkins/jobs/oxCore_3.1.7/workspace/oxUtil/src/main/java/org/xdi/context/WebContext.java:70: warning: no description for @param
	 * @param name
	   ^
/home/jenkins/.jenkins/jobs/oxCore_3.1.7/workspace/oxUtil/src/main/java/org/xdi/context/WebContext.java:85: warning: no description for @param
	 * @param content
	   ^
/home/jenkins/.jenkins/jobs/oxCore_3.1.7/workspace/oxUtil/src/main/java/org/xdi/context/WebContext.java:87: warning: no @throws for java.io.IOException
	public void writeResponseContent(String content) throws IOException;
	            ^
/home/jenkins/.jenkins/jobs/oxCore_3.1.7/workspace/oxUtil/src/main/java/org/xdi/context/WebContext.java:92: warning: no description for @param
	 * @param name
	   ^
/home/jenkins/.jenkins/jobs/oxCore_3.1.7/workspace/oxUtil/src/main/java/org/xdi/context/WebContext.java:93: warning: no description for @param
	 * @param value
	   ^
/home/jenkins/.jenkins/jobs/oxCore_3.1.7/workspace/oxUtil/src/main/java/org/xdi/context/J2EContext.java:28: warning: no description for @param
	 * @param request
	   ^
/home/jenkins/.jenkins/jobs/oxCore_3.1.7/workspace/oxUtil/src/main/java/org/xdi/context/J2EContext.java:29: warning: no description for @param
         * @param response
           ^
/home/jenkins/.jenkins/jobs/oxCore_3.1.7/workspace/oxUtil/src/main/java/org/xdi/net/InetAddressUtility.java:31: warning: no @param for ipAddress
	public static boolean isIpAddress(String ipAddress) {
	                      ^
/home/jenkins/.jenkins/jobs/oxCore_3.1.7/workspace/oxUtil/src/main/java/org/xdi/net/InetAddressUtility.java:31: warning: no @return
	public static boolean isIpAddress(String ipAddress) {
	                      ^
/home/jenkins/.jenkins/jobs/oxCore_3.1.7/workspace/oxUtil/src/main/java/org/xdi/util/EasySSLProtocolSocketFactory.java:177: warning: no @param for socket
	public Socket createSocket(Socket socket, String host, int port, boolean autoClose) throws IOException, UnknownHostException {
	              ^
/home/jenkins/.jenkins/jobs/oxCore_3.1.7/workspace/oxUtil/src/main/java/org/xdi/util/EasySSLProtocolSocketFactory.java:177: warning: no @param for host
	public Socket createSocket(Socket socket, String host, int port, boolean autoClose) throws IOException, UnknownHostException {
	              ^
/home/jenkins/.jenkins/jobs/oxCore_3.1.7/workspace/oxUtil/src/main/java/org/xdi/util/EasySSLProtocolSocketFactory.java:177: warning: no @param for port
	public Socket createSocket(Socket socket, String host, int port, boolean autoClose) throws IOException, UnknownHostException {
	              ^
/home/jenkins/.jenkins/jobs/oxCore_3.1.7/workspace/oxUtil/src/main/java/org/xdi/util/EasySSLProtocolSocketFactory.java:177: warning: no @param for autoClose
	public Socket createSocket(Socket socket, String host, int port, boolean autoClose) throws IOException, UnknownHostException {
	              ^
/home/jenkins/.jenkins/jobs/oxCore_3.1.7/workspace/oxUtil/src/main/java/org/xdi/util/EasySSLProtocolSocketFactory.java:177: warning: no @return
	public Socket createSocket(Socket socket, String host, int port, boolean autoClose) throws IOException, UnknownHostException {
	              ^
/home/jenkins/.jenkins/jobs/oxCore_3.1.7/workspace/oxUtil/src/main/java/org/xdi/util/EasySSLProtocolSocketFactory.java:177: warning: no @throws for java.io.IOException
	public Socket createSocket(Socket socket, String host, int port, boolean autoClose) throws IOException, UnknownHostException {
	              ^
/home/jenkins/.jenkins/jobs/oxCore_3.1.7/workspace/oxUtil/src/main/java/org/xdi/util/EasySSLProtocolSocketFactory.java:177: warning: no @throws for java.net.UnknownHostException
	public Socket createSocket(Socket socket, String host, int port, boolean autoClose) throws IOException, UnknownHostException {
	              ^
/home/jenkins/.jenkins/jobs/oxCore_3.1.7/workspace/oxUtil/src/main/java/org/xdi/util/EasySSLProtocolSocketFactory.java:54: error: unexpected end tag: </p>
 * </p>
   ^
/home/jenkins/.jenkins/jobs/oxCore_3.1.7/workspace/oxUtil/src/main/java/org/xdi/util/EasySSLProtocolSocketFactory.java:68: error: unexpected end tag: </p>
 * </p>
   ^
/home/jenkins/.jenkins/jobs/oxCore_3.1.7/workspace/oxUtil/src/main/java/org/xdi/util/EasySSLProtocolSocketFactory.java:70: error: invalid uri: "mailto:oleg -at- ural.ru"
 * @author <a href="mailto:oleg -at- ural.ru">Oleg Kalnichevski</a>
              ^
/home/jenkins/.jenkins/jobs/oxCore_3.1.7/workspace/oxUtil/src/main/java/org/xdi/util/EasyX509TrustManager.java:57: warning: no @param for keystore
	public EasyX509TrustManager(KeyStore keystore) throws NoSuchAlgorithmException, KeyStoreException {
	       ^
/home/jenkins/.jenkins/jobs/oxCore_3.1.7/workspace/oxUtil/src/main/java/org/xdi/util/EasyX509TrustManager.java:57: warning: no @throws for java.security.NoSuchAlgorithmException
	public EasyX509TrustManager(KeyStore keystore) throws NoSuchAlgorithmException, KeyStoreException {
	       ^
/home/jenkins/.jenkins/jobs/oxCore_3.1.7/workspace/oxUtil/src/main/java/org/xdi/util/EasyX509TrustManager.java:57: warning: no @throws for java.security.KeyStoreException
	public EasyX509TrustManager(KeyStore keystore) throws NoSuchAlgorithmException, KeyStoreException {
	       ^
/home/jenkins/.jenkins/jobs/oxCore_3.1.7/workspace/oxUtil/src/main/java/org/xdi/util/FileUtil.java:33: warning: no description for @param
	 * @param filePath
	   ^
/home/jenkins/.jenkins/jobs/oxCore_3.1.7/workspace/oxUtil/src/main/java/org/xdi/util/FileUtil.java:34: warning: no description for @param
	 * @param position
	   ^
/home/jenkins/.jenkins/jobs/oxCore_3.1.7/workspace/oxUtil/src/main/java/org/xdi/util/FileUtil.java:35: warning: no description for @param
	 * @param data
	   ^
/home/jenkins/.jenkins/jobs/oxCore_3.1.7/workspace/oxUtil/src/main/java/org/xdi/util/FileUtil.java:36: warning: no description for @return
	 * @return
	   ^
/home/jenkins/.jenkins/jobs/oxCore_3.1.7/workspace/oxUtil/src/main/java/org/xdi/util/FileUtil.java:67: warning: no description for @param
	 * @param filePath
	   ^
/home/jenkins/.jenkins/jobs/oxCore_3.1.7/workspace/oxUtil/src/main/java/org/xdi/util/FileUtil.java:68: warning: no description for @param
	 * @param position
	   ^
/home/jenkins/.jenkins/jobs/oxCore_3.1.7/workspace/oxUtil/src/main/java/org/xdi/util/FileUtil.java:69: warning: no description for @param
	 * @param data
	   ^
/home/jenkins/.jenkins/jobs/oxCore_3.1.7/workspace/oxUtil/src/main/java/org/xdi/util/FileUtil.java:70: warning: no description for @return
	 * @return
	   ^
/home/jenkins/.jenkins/jobs/oxCore_3.1.7/workspace/oxUtil/src/main/java/org/xdi/util/FileUtil.java:91: warning: no description for @param
	 * @param filePath
	   ^
/home/jenkins/.jenkins/jobs/oxCore_3.1.7/workspace/oxUtil/src/main/java/org/xdi/util/FileUtil.java:92: warning: no description for @param
	 * @param searchStr
	   ^
/home/jenkins/.jenkins/jobs/oxCore_3.1.7/workspace/oxUtil/src/main/java/org/xdi/util/FileUtil.java:93: warning: no description for @return
	 * @return
	   ^
/home/jenkins/.jenkins/jobs/oxCore_3.1.7/workspace/oxUtil/src/main/java/org/xdi/util/FileUtil.java:144: warning: no description for @param
	 * @param url
	   ^
/home/jenkins/.jenkins/jobs/oxCore_3.1.7/workspace/oxUtil/src/main/java/org/xdi/util/FileUtil.java:145: warning: no description for @return
	 * @return
	   ^
/home/jenkins/.jenkins/jobs/oxCore_3.1.7/workspace/oxUtil/src/main/java/org/xdi/util/FileUtil.java:174: warning: no description for @param
	 * @param filePath
	   ^
/home/jenkins/.jenkins/jobs/oxCore_3.1.7/workspace/oxUtil/src/main/java/org/xdi/util/FileUtil.java:175: warning: no description for @return
	 * @return
	   ^
/home/jenkins/.jenkins/jobs/oxCore_3.1.7/workspace/oxUtil/src/main/java/org/xdi/util/InterfaceRegistry.java:43: warning: no @param for <T>
    public static synchronized <T> T get(Class p_interface) {
                                     ^
/home/jenkins/.jenkins/jobs/oxCore_3.1.7/workspace/oxUtil/src/main/java/org/xdi/util/Util.java:37: error: unknown tag: T
	 * @return An ArrayList<T> of the same values *
	                       ^
/home/jenkins/.jenkins/jobs/oxCore_3.1.7/workspace/oxUtil/src/main/java/org/xdi/util/Util.java:48: error: unknown tag: String
	 * Convert a list of unknown type to a List<String> in a type-safe way
	                                           ^
/home/jenkins/.jenkins/jobs/oxCore_3.1.7/workspace/oxUtil/src/main/java/org/xdi/util/Util.java:52: error: unknown tag: String
	 * @return List<String> of the items in list
	               ^
/home/jenkins/.jenkins/jobs/oxCore_3.1.7/workspace/oxUtil/src/main/java/org/xdi/util/Util.java:63: error: unknown tag: String
	 * Convert a single String to a List<String>
	                                    ^
/home/jenkins/.jenkins/jobs/oxCore_3.1.7/workspace/oxUtil/src/main/java/org/xdi/util/Util.java:76: error: unknown tag: String
	 * Convert a String array to an List<String>
	                                    ^
/home/jenkins/.jenkins/jobs/oxCore_3.1.7/workspace/oxUtil/src/main/java/org/xdi/util/Util.java:80: error: unknown tag: String
	 * @return List<String> of the items in the array
	               ^
/home/jenkins/.jenkins/jobs/oxCore_3.1.7/workspace/oxUtil/src/main/java/org/xdi/util/Util.java:105: warning: no description for @throws
     * @throws IOException
       ^
/home/jenkins/.jenkins/jobs/oxCore_3.1.7/workspace/oxUtil/src/main/java/org/xdi/util/Util.java:117: warning: no description for @throws
     * @throws IOException
       ^
/home/jenkins/.jenkins/jobs/oxCore_3.1.7/workspace/oxUtil/src/main/java/org/xdi/util/Util.java:164: warning: no description for @param
	 * @param dn
	   ^
/home/jenkins/.jenkins/jobs/oxCore_3.1.7/workspace/oxUtil/src/main/java/org/xdi/util/process/ProcessHelper.java:97: warning: no description for @param
	 * @param streamHandler
	   ^
/home/jenkins/.jenkins/jobs/oxCore_3.1.7/workspace/oxUtil/src/main/java/org/xdi/util/process/ProcessHelper.java:102: warning: no @param for commandLine
	public static PrintResultHandler executeProgram(CommandLine commandLine, long printJobTimeout, boolean printInBackground,
	                                 ^
/home/jenkins/.jenkins/jobs/oxCore_3.1.7/workspace/oxUtil/src/main/java/org/xdi/util/process/ProcessHelper.java:102: warning: no @param for successExitValue
	public static PrintResultHandler executeProgram(CommandLine commandLine, long printJobTimeout, boolean printInBackground,
	                                 ^
/home/jenkins/.jenkins/jobs/oxCore_3.1.7/workspace/oxUtil/src/main/java/org/xdi/util/process/ProcessHelper.java:114: warning: no description for @param
	 * @param streamHandler
	   ^
/home/jenkins/.jenkins/jobs/oxCore_3.1.7/workspace/oxUtil/src/main/java/org/xdi/util/process/ProcessHelper.java:119: warning: no @param for commandLine
	public static PrintResultHandler executeProgram(CommandLine commandLine, String workingDirectory, long printJobTimeout,
	                                 ^
/home/jenkins/.jenkins/jobs/oxCore_3.1.7/workspace/oxUtil/src/main/java/org/xdi/util/process/ProcessHelper.java:119: warning: no @param for workingDirectory
	public static PrintResultHandler executeProgram(CommandLine commandLine, String workingDirectory, long printJobTimeout,
	                                 ^
/home/jenkins/.jenkins/jobs/oxCore_3.1.7/workspace/oxUtil/src/main/java/org/xdi/util/process/ProcessHelper.java:119: warning: no @param for successExitValue
	public static PrintResultHandler executeProgram(CommandLine commandLine, String workingDirectory, long printJobTimeout,
	                                 ^
/home/jenkins/.jenkins/jobs/oxCore_3.1.7/workspace/oxUtil/src/main/java/org/xdi/util/security/BCrypt.java:26: error: self-closing element not allowed
 * String pw_hash = BCrypt.hashpw(plain_password, BCrypt.gensalt()); <br />
                                                                     ^
/home/jenkins/.jenkins/jobs/oxCore_3.1.7/workspace/oxUtil/src/main/java/org/xdi/util/security/BCrypt.java:33: error: self-closing element not allowed
 * if (BCrypt.checkpw(candidate_password, stored_hash))<br />
                                                       ^
/home/jenkins/.jenkins/jobs/oxCore_3.1.7/workspace/oxUtil/src/main/java/org/xdi/util/security/BCrypt.java:34: error: self-closing element not allowed
 * &nbsp;&nbsp;&nbsp;&nbsp;System.out.println("It matches");<br />
                                                            ^
/home/jenkins/.jenkins/jobs/oxCore_3.1.7/workspace/oxUtil/src/main/java/org/xdi/util/security/BCrypt.java:35: error: self-closing element not allowed
 * else<br />
       ^
/home/jenkins/.jenkins/jobs/oxCore_3.1.7/workspace/oxUtil/src/main/java/org/xdi/util/security/BCrypt.java:36: error: self-closing element not allowed
 * &nbsp;&nbsp;&nbsp;&nbsp;System.out.println("It does not match");<br />
                                                                   ^
/home/jenkins/.jenkins/jobs/oxCore_3.1.7/workspace/oxUtil/src/main/java/org/xdi/util/security/BCrypt.java:43: error: self-closing element not allowed
 * String strong_salt = BCrypt.gensalt(10)<br />
                                          ^
/home/jenkins/.jenkins/jobs/oxCore_3.1.7/workspace/oxUtil/src/main/java/org/xdi/util/security/BCrypt.java:44: error: self-closing element not allowed
 * String stronger_salt = BCrypt.gensalt(12)<br />
                                            ^
/home/jenkins/.jenkins/jobs/oxCore_3.1.7/workspace/oxUtil/src/main/java/org/xdi/util/security/StringEncrypter.java:223: warning: no description for @throws
	 * @throws EncryptionException
	   ^
/home/jenkins/.jenkins/jobs/oxCore_3.1.7/workspace/oxUtil/src/main/java/org/xdi/util/security/StringEncrypter.java:240: warning: no description for @throws
	 * @throws EncryptionException
	   ^
/home/jenkins/.jenkins/jobs/oxCore_3.1.7/workspace/oxUtil/src/main/java/org/xdi/util/security/StringEncrypter.java:242: warning: no @param for encryptionKey
	public String decrypt(final String encryptedString, String encryptionKey) throws EncryptionException {
	              ^
/home/jenkins/.jenkins/jobs/oxCore_3.1.7/workspace/oxUtil/src/main/java/org/xdi/util/security/StringEncrypter.java:292: warning: no description for @throws
	 * @throws EncryptionException
	   ^
/home/jenkins/.jenkins/jobs/oxCore_3.1.7/workspace/oxUtil/src/main/java/org/xdi/util/security/StringEncrypter.java:309: warning: no description for @throws
	 * @throws EncryptionException
	   ^
/home/jenkins/.jenkins/jobs/oxCore_3.1.7/workspace/oxUtil/src/main/java/org/xdi/util/security/StringEncrypter.java:311: warning: no @param for encryptionKey
	public String encrypt(final String unencryptedString, String encryptionKey) throws EncryptionException {
	              ^
/home/jenkins/.jenkins/jobs/oxCore_3.1.7/workspace/oxUtil/src/main/java/org/xdi/util/security/StringEncrypter.java:139: error: @param name not found
	 * @param encryptionKey
	          ^
/home/jenkins/.jenkins/jobs/oxCore_3.1.7/workspace/oxUtil/src/main/java/org/xdi/util/security/StringEncrypter.java:141: warning: no description for @throws
	 * @throws EncryptionException
	   ^
/home/jenkins/.jenkins/jobs/oxCore_3.1.7/workspace/oxUtil/src/main/java/org/xdi/util/security/StringEncrypter.java:161: warning: no description for @throws
	 * @throws EncryptionException
	   ^
/home/jenkins/.jenkins/jobs/oxCore_3.1.7/workspace/oxUtil/src/main/java/org/xdi/xml/XMLValidator.java:26: warning: no description for @param
    * @param stream
      ^
/home/jenkins/.jenkins/jobs/oxCore_3.1.7/workspace/oxUtil/src/main/java/org/xdi/xml/XMLValidator.java:27: warning: no description for @param
    * @param validationSchema
      ^
/home/jenkins/.jenkins/jobs/oxCore_3.1.7/workspace/oxUtil/src/main/java/org/xdi/xml/XMLValidator.java:28: warning: no description for @throws
    * @throws IOException
      ^
/home/jenkins/.jenkins/jobs/oxCore_3.1.7/workspace/oxUtil/src/main/java/org/xdi/xml/XMLValidator.java:29: warning: no description for @throws
    * @throws SAXException
      ^
/home/jenkins/.jenkins/jobs/oxCore_3.1.7/workspace/oxUtil/src/main/java/org/xdi/xml/XMLValidator.java:30: warning: no description for @throws
    * @throws ParserConfigurationException
      ^

Command line was: /opt/java/jdk1.8.0_221/jre/../bin/javadoc @options @packages

Refer to the generated Javadoc files in '/home/jenkins/.jenkins/jobs/oxCore_3.1.7/workspace/oxUtil/target/site/apidocs' dir.

org.apache.maven.reporting.MavenReportException: 
Exit code: 1 - warning: unknown enum constant ThreadingBehavior.IMMUTABLE
  reason: class file for org.apache.http.annotation.ThreadingBehavior not found
warning: unknown enum constant ThreadingBehavior.IMMUTABLE
warning: unknown enum constant ThreadingBehavior.SAFE
warning: unknown enum constant ThreadingBehavior.SAFE_CONDITIONAL
warning: unknown enum constant ThreadingBehavior.SAFE_CONDITIONAL
warning: unknown enum constant ThreadingBehavior.SAFE_CONDITIONAL
warning: unknown enum constant ThreadingBehavior.SAFE_CONDITIONAL
warning: unknown enum constant ThreadingBehavior.SAFE
/home/jenkins/.jenkins/jobs/oxCore_3.1.7/workspace/oxUtil/src/main/java/org/xdi/context/WebContext.java:23: warning: no description for @param
	 * @param name
	   ^
/home/jenkins/.jenkins/jobs/oxCore_3.1.7/workspace/oxUtil/src/main/java/org/xdi/context/WebContext.java:38: warning: no description for @param
	 * @param name
	   ^
/home/jenkins/.jenkins/jobs/oxCore_3.1.7/workspace/oxUtil/src/main/java/org/xdi/context/WebContext.java:46: warning: no description for @param
	 * @param name
	   ^
/home/jenkins/.jenkins/jobs/oxCore_3.1.7/workspace/oxUtil/src/main/java/org/xdi/context/WebContext.java:47: warning: no description for @param
	 * @param value
	   ^
/home/jenkins/.jenkins/jobs/oxCore_3.1.7/workspace/oxUtil/src/main/java/org/xdi/context/WebContext.java:54: warning: no description for @param
	 * @param name
	   ^
/home/jenkins/.jenkins/jobs/oxCore_3.1.7/workspace/oxUtil/src/main/java/org/xdi/context/WebContext.java:62: warning: no description for @param
	 * @param name
	   ^
/home/jenkins/.jenkins/jobs/oxCore_3.1.7/workspace/oxUtil/src/main/java/org/xdi/context/WebContext.java:63: warning: no description for @param
	 * @param value
	   ^
/home/jenkins/.jenkins/jobs/oxCore_3.1.7/workspace/oxUtil/src/main/java/org/xdi/context/WebContext.java:70: warning: no description for @param
	 * @param name
	   ^
/home/jenkins/.jenkins/jobs/oxCore_3.1.7/workspace/oxUtil/src/main/java/org/xdi/context/WebContext.java:85: warning: no description for @param
	 * @param content
	   ^
/home/jenkins/.jenkins/jobs/oxCore_3.1.7/workspace/oxUtil/src/main/java/org/xdi/context/WebContext.java:87: warning: no @throws for java.io.IOException
	public void writeResponseContent(String content) throws IOException;
	            ^
/home/jenkins/.jenkins/jobs/oxCore_3.1.7/workspace/oxUtil/src/main/java/org/xdi/context/WebContext.java:92: warning: no description for @param
	 * @param name
	   ^
/home/jenkins/.jenkins/jobs/oxCore_3.1.7/workspace/oxUtil/src/main/java/org/xdi/context/WebContext.java:93: warning: no description for @param
	 * @param value
	   ^
/home/jenkins/.jenkins/jobs/oxCore_3.1.7/workspace/oxUtil/src/main/java/org/xdi/context/J2EContext.java:28: warning: no description for @param
	 * @param request
	   ^
/home/jenkins/.jenkins/jobs/oxCore_3.1.7/workspace/oxUtil/src/main/java/org/xdi/context/J2EContext.java:29: warning: no description for @param
         * @param response
           ^
/home/jenkins/.jenkins/jobs/oxCore_3.1.7/workspace/oxUtil/src/main/java/org/xdi/net/InetAddressUtility.java:31: warning: no @param for ipAddress
	public static boolean isIpAddress(String ipAddress) {
	                      ^
/home/jenkins/.jenkins/jobs/oxCore_3.1.7/workspace/oxUtil/src/main/java/org/xdi/net/InetAddressUtility.java:31: warning: no @return
	public static boolean isIpAddress(String ipAddress) {
	                      ^
/home/jenkins/.jenkins/jobs/oxCore_3.1.7/workspace/oxUtil/src/main/java/org/xdi/util/EasySSLProtocolSocketFactory.java:177: warning: no @param for socket
	public Socket createSocket(Socket socket, String host, int port, boolean autoClose) throws IOException, UnknownHostException {
	              ^
/home/jenkins/.jenkins/jobs/oxCore_3.1.7/workspace/oxUtil/src/main/java/org/xdi/util/EasySSLProtocolSocketFactory.java:177: warning: no @param for host
	public Socket createSocket(Socket socket, String host, int port, boolean autoClose) throws IOException, UnknownHostException {
	              ^
/home/jenkins/.jenkins/jobs/oxCore_3.1.7/workspace/oxUtil/src/main/java/org/xdi/util/EasySSLProtocolSocketFactory.java:177: warning: no @param for port
	public Socket createSocket(Socket socket, String host, int port, boolean autoClose) throws IOException, UnknownHostException {
	              ^
/home/jenkins/.jenkins/jobs/oxCore_3.1.7/workspace/oxUtil/src/main/java/org/xdi/util/EasySSLProtocolSocketFactory.java:177: warning: no @param for autoClose
	public Socket createSocket(Socket socket, String host, int port, boolean autoClose) throws IOException, UnknownHostException {
	              ^
/home/jenkins/.jenkins/jobs/oxCore_3.1.7/workspace/oxUtil/src/main/java/org/xdi/util/EasySSLProtocolSocketFactory.java:177: warning: no @return
	public Socket createSocket(Socket socket, String host, int port, boolean autoClose) throws IOException, UnknownHostException {
	              ^
/home/jenkins/.jenkins/jobs/oxCore_3.1.7/workspace/oxUtil/src/main/java/org/xdi/util/EasySSLProtocolSocketFactory.java:177: warning: no @throws for java.io.IOException
	public Socket createSocket(Socket socket, String host, int port, boolean autoClose) throws IOException, UnknownHostException {
	              ^
/home/jenkins/.jenkins/jobs/oxCore_3.1.7/workspace/oxUtil/src/main/java/org/xdi/util/EasySSLProtocolSocketFactory.java:177: warning: no @throws for java.net.UnknownHostException
	public Socket createSocket(Socket socket, String host, int port, boolean autoClose) throws IOException, UnknownHostException {
	              ^
/home/jenkins/.jenkins/jobs/oxCore_3.1.7/workspace/oxUtil/src/main/java/org/xdi/util/EasySSLProtocolSocketFactory.java:54: error: unexpected end tag: </p>
 * </p>
   ^
/home/jenkins/.jenkins/jobs/oxCore_3.1.7/workspace/oxUtil/src/main/java/org/xdi/util/EasySSLProtocolSocketFactory.java:68: error: unexpected end tag: </p>
 * </p>
   ^
/home/jenkins/.jenkins/jobs/oxCore_3.1.7/workspace/oxUtil/src/main/java/org/xdi/util/EasySSLProtocolSocketFactory.java:70: error: invalid uri: "mailto:oleg -at- ural.ru"
 * @author <a href="mailto:oleg -at- ural.ru">Oleg Kalnichevski</a>
              ^
/home/jenkins/.jenkins/jobs/oxCore_3.1.7/workspace/oxUtil/src/main/java/org/xdi/util/EasyX509TrustManager.java:57: warning: no @param for keystore
	public EasyX509TrustManager(KeyStore keystore) throws NoSuchAlgorithmException, KeyStoreException {
	       ^
/home/jenkins/.jenkins/jobs/oxCore_3.1.7/workspace/oxUtil/src/main/java/org/xdi/util/EasyX509TrustManager.java:57: warning: no @throws for java.security.NoSuchAlgorithmException
	public EasyX509TrustManager(KeyStore keystore) throws NoSuchAlgorithmException, KeyStoreException {
	       ^
/home/jenkins/.jenkins/jobs/oxCore_3.1.7/workspace/oxUtil/src/main/java/org/xdi/util/EasyX509TrustManager.java:57: warning: no @throws for java.security.KeyStoreException
	public EasyX509TrustManager(KeyStore keystore) throws NoSuchAlgorithmException, KeyStoreException {
	       ^
/home/jenkins/.jenkins/jobs/oxCore_3.1.7/workspace/oxUtil/src/main/java/org/xdi/util/FileUtil.java:33: warning: no description for @param
	 * @param filePath
	   ^
/home/jenkins/.jenkins/jobs/oxCore_3.1.7/workspace/oxUtil/src/main/java/org/xdi/util/FileUtil.java:34: warning: no description for @param
	 * @param position
	   ^
/home/jenkins/.jenkins/jobs/oxCore_3.1.7/workspace/oxUtil/src/main/java/org/xdi/util/FileUtil.java:35: warning: no description for @param
	 * @param data
	   ^
/home/jenkins/.jenkins/jobs/oxCore_3.1.7/workspace/oxUtil/src/main/java/org/xdi/util/FileUtil.java:36: warning: no description for @return
	 * @return
	   ^
/home/jenkins/.jenkins/jobs/oxCore_3.1.7/workspace/oxUtil/src/main/java/org/xdi/util/FileUtil.java:67: warning: no description for @param
	 * @param filePath
	   ^
/home/jenkins/.jenkins/jobs/oxCore_3.1.7/workspace/oxUtil/src/main/java/org/xdi/util/FileUtil.java:68: warning: no description for @param
	 * @param position
	   ^
/home/jenkins/.jenkins/jobs/oxCore_3.1.7/workspace/oxUtil/src/main/java/org/xdi/util/FileUtil.java:69: warning: no description for @param
	 * @param data
	   ^
/home/jenkins/.jenkins/jobs/oxCore_3.1.7/workspace/oxUtil/src/main/java/org/xdi/util/FileUtil.java:70: warning: no description for @return
	 * @return
	   ^
/home/jenkins/.jenkins/jobs/oxCore_3.1.7/workspace/oxUtil/src/main/java/org/xdi/util/FileUtil.java:91: warning: no description for @param
	 * @param filePath
	   ^
/home/jenkins/.jenkins/jobs/oxCore_3.1.7/workspace/oxUtil/src/main/java/org/xdi/util/FileUtil.java:92: warning: no description for @param
	 * @param searchStr
	   ^
/home/jenkins/.jenkins/jobs/oxCore_3.1.7/workspace/oxUtil/src/main/java/org/xdi/util/FileUtil.java:93: warning: no description for @return
	 * @return
	   ^
/home/jenkins/.jenkins/jobs/oxCore_3.1.7/workspace/oxUtil/src/main/java/org/xdi/util/FileUtil.java:144: warning: no description for @param
	 * @param url
	   ^
/home/jenkins/.jenkins/jobs/oxCore_3.1.7/workspace/oxUtil/src/main/java/org/xdi/util/FileUtil.java:145: warning: no description for @return
	 * @return
	   ^
/home/jenkins/.jenkins/jobs/oxCore_3.1.7/workspace/oxUtil/src/main/java/org/xdi/util/FileUtil.java:174: warning: no description for @param
	 * @param filePath
	   ^
/home/jenkins/.jenkins/jobs/oxCore_3.1.7/workspace/oxUtil/src/main/java/org/xdi/util/FileUtil.java:175: warning: no description for @return
	 * @return
	   ^
/home/jenkins/.jenkins/jobs/oxCore_3.1.7/workspace/oxUtil/src/main/java/org/xdi/util/InterfaceRegistry.java:43: warning: no @param for <T>
    public static synchronized <T> T get(Class p_interface) {
                                     ^
/home/jenkins/.jenkins/jobs/oxCore_3.1.7/workspace/oxUtil/src/main/java/org/xdi/util/Util.java:37: error: unknown tag: T
	 * @return An ArrayList<T> of the same values *
	                       ^
/home/jenkins/.jenkins/jobs/oxCore_3.1.7/workspace/oxUtil/src/main/java/org/xdi/util/Util.java:48: error: unknown tag: String
	 * Convert a list of unknown type to a List<String> in a type-safe way
	                                           ^
/home/jenkins/.jenkins/jobs/oxCore_3.1.7/workspace/oxUtil/src/main/java/org/xdi/util/Util.java:52: error: unknown tag: String
	 * @return List<String> of the items in list
	               ^
/home/jenkins/.jenkins/jobs/oxCore_3.1.7/workspace/oxUtil/src/main/java/org/xdi/util/Util.java:63: error: unknown tag: String
	 * Convert a single String to a List<String>
	                                    ^
/home/jenkins/.jenkins/jobs/oxCore_3.1.7/workspace/oxUtil/src/main/java/org/xdi/util/Util.java:76: error: unknown tag: String
	 * Convert a String array to an List<String>
	                                    ^
/home/jenkins/.jenkins/jobs/oxCore_3.1.7/workspace/oxUtil/src/main/java/org/xdi/util/Util.java:80: error: unknown tag: String
	 * @return List<String> of the items in the array
	               ^
/home/jenkins/.jenkins/jobs/oxCore_3.1.7/workspace/oxUtil/src/main/java/org/xdi/util/Util.java:105: warning: no description for @throws
     * @throws IOException
       ^
/home/jenkins/.jenkins/jobs/oxCore_3.1.7/workspace/oxUtil/src/main/java/org/xdi/util/Util.java:117: warning: no description for @throws
     * @throws IOException
       ^
/home/jenkins/.jenkins/jobs/oxCore_3.1.7/workspace/oxUtil/src/main/java/org/xdi/util/Util.java:164: warning: no description for @param
	 * @param dn
	   ^
/home/jenkins/.jenkins/jobs/oxCore_3.1.7/workspace/oxUtil/src/main/java/org/xdi/util/process/ProcessHelper.java:97: warning: no description for @param
	 * @param streamHandler
	   ^
/home/jenkins/.jenkins/jobs/oxCore_3.1.7/workspace/oxUtil/src/main/java/org/xdi/util/process/ProcessHelper.java:102: warning: no @param for commandLine
	public static PrintResultHandler executeProgram(CommandLine commandLine, long printJobTimeout, boolean printInBackground,
	                                 ^
/home/jenkins/.jenkins/jobs/oxCore_3.1.7/workspace/oxUtil/src/main/java/org/xdi/util/process/ProcessHelper.java:102: warning: no @param for successExitValue
	public static PrintResultHandler executeProgram(CommandLine commandLine, long printJobTimeout, boolean printInBackground,
	                                 ^
/home/jenkins/.jenkins/jobs/oxCore_3.1.7/workspace/oxUtil/src/main/java/org/xdi/util/process/ProcessHelper.java:114: warning: no description for @param
	 * @param streamHandler
	   ^
/home/jenkins/.jenkins/jobs/oxCore_3.1.7/workspace/oxUtil/src/main/java/org/xdi/util/process/ProcessHelper.java:119: warning: no @param for commandLine
	public static PrintResultHandler executeProgram(CommandLine commandLine, String workingDirectory, long printJobTimeout,
	                                 ^
/home/jenkins/.jenkins/jobs/oxCore_3.1.7/workspace/oxUtil/src/main/java/org/xdi/util/process/ProcessHelper.java:119: warning: no @param for workingDirectory
	public static PrintResultHandler executeProgram(CommandLine commandLine, String workingDirectory, long printJobTimeout,
	                                 ^
/home/jenkins/.jenkins/jobs/oxCore_3.1.7/workspace/oxUtil/src/main/java/org/xdi/util/process/ProcessHelper.java:119: warning: no @param for successExitValue
	public static PrintResultHandler executeProgram(CommandLine commandLine, String workingDirectory, long printJobTimeout,
	                                 ^
/home/jenkins/.jenkins/jobs/oxCore_3.1.7/workspace/oxUtil/src/main/java/org/xdi/util/security/BCrypt.java:26: error: self-closing element not allowed
 * String pw_hash = BCrypt.hashpw(plain_password, BCrypt.gensalt()); <br />
                                                                     ^
/home/jenkins/.jenkins/jobs/oxCore_3.1.7/workspace/oxUtil/src/main/java/org/xdi/util/security/BCrypt.java:33: error: self-closing element not allowed
 * if (BCrypt.checkpw(candidate_password, stored_hash))<br />
                                                       ^
/home/jenkins/.jenkins/jobs/oxCore_3.1.7/workspace/oxUtil/src/main/java/org/xdi/util/security/BCrypt.java:34: error: self-closing element not allowed
 * &nbsp;&nbsp;&nbsp;&nbsp;System.out.println("It matches");<br />
                                                            ^
/home/jenkins/.jenkins/jobs/oxCore_3.1.7/workspace/oxUtil/src/main/java/org/xdi/util/security/BCrypt.java:35: error: self-closing element not allowed
 * else<br />
       ^
/home/jenkins/.jenkins/jobs/oxCore_3.1.7/workspace/oxUtil/src/main/java/org/xdi/util/security/BCrypt.java:36: error: self-closing element not allowed
 * &nbsp;&nbsp;&nbsp;&nbsp;System.out.println("It does not match");<br />
                                                                   ^
/home/jenkins/.jenkins/jobs/oxCore_3.1.7/workspace/oxUtil/src/main/java/org/xdi/util/security/BCrypt.java:43: error: self-closing element not allowed
 * String strong_salt = BCrypt.gensalt(10)<br />
                                          ^
/home/jenkins/.jenkins/jobs/oxCore_3.1.7/workspace/oxUtil/src/main/java/org/xdi/util/security/BCrypt.java:44: error: self-closing element not allowed
 * String stronger_salt = BCrypt.gensalt(12)<br />
                                            ^
/home/jenkins/.jenkins/jobs/oxCore_3.1.7/workspace/oxUtil/src/main/java/org/xdi/util/security/StringEncrypter.java:223: warning: no description for @throws
	 * @throws EncryptionException
	   ^
/home/jenkins/.jenkins/jobs/oxCore_3.1.7/workspace/oxUtil/src/main/java/org/xdi/util/security/StringEncrypter.java:240: warning: no description for @throws
	 * @throws EncryptionException
	   ^
/home/jenkins/.jenkins/jobs/oxCore_3.1.7/workspace/oxUtil/src/main/java/org/xdi/util/security/StringEncrypter.java:242: warning: no @param for encryptionKey
	public String decrypt(final String encryptedString, String encryptionKey) throws EncryptionException {
	              ^
/home/jenkins/.jenkins/jobs/oxCore_3.1.7/workspace/oxUtil/src/main/java/org/xdi/util/security/StringEncrypter.java:292: warning: no description for @throws
	 * @throws EncryptionException
	   ^
/home/jenkins/.jenkins/jobs/oxCore_3.1.7/workspace/oxUtil/src/main/java/org/xdi/util/security/StringEncrypter.java:309: warning: no description for @throws
	 * @throws EncryptionException
	   ^
/home/jenkins/.jenkins/jobs/oxCore_3.1.7/workspace/oxUtil/src/main/java/org/xdi/util/security/StringEncrypter.java:311: warning: no @param for encryptionKey
	public String encrypt(final String unencryptedString, String encryptionKey) throws EncryptionException {
	              ^
/home/jenkins/.jenkins/jobs/oxCore_3.1.7/workspace/oxUtil/src/main/java/org/xdi/util/security/StringEncrypter.java:139: error: @param name not found
	 * @param encryptionKey
	          ^
/home/jenkins/.jenkins/jobs/oxCore_3.1.7/workspace/oxUtil/src/main/java/org/xdi/util/security/StringEncrypter.java:141: warning: no description for @throws
	 * @throws EncryptionException
	   ^
/home/jenkins/.jenkins/jobs/oxCore_3.1.7/workspace/oxUtil/src/main/java/org/xdi/util/security/StringEncrypter.java:161: warning: no description for @throws
	 * @throws EncryptionException
	   ^
/home/jenkins/.jenkins/jobs/oxCore_3.1.7/workspace/oxUtil/src/main/java/org/xdi/xml/XMLValidator.java:26: warning: no description for @param
    * @param stream
      ^
/home/jenkins/.jenkins/jobs/oxCore_3.1.7/workspace/oxUtil/src/main/java/org/xdi/xml/XMLValidator.java:27: warning: no description for @param
    * @param validationSchema
      ^
/home/jenkins/.jenkins/jobs/oxCore_3.1.7/workspace/oxUtil/src/main/java/org/xdi/xml/XMLValidator.java:28: warning: no description for @throws
    * @throws IOException
      ^
/home/jenkins/.jenkins/jobs/oxCore_3.1.7/workspace/oxUtil/src/main/java/org/xdi/xml/XMLValidator.java:29: warning: no description for @throws
    * @throws SAXException
      ^
/home/jenkins/.jenkins/jobs/oxCore_3.1.7/workspace/oxUtil/src/main/java/org/xdi/xml/XMLValidator.java:30: warning: no description for @throws
    * @throws ParserConfigurationException
      ^

Command line was: /opt/java/jdk1.8.0_221/jre/../bin/javadoc @options @packages

Refer to the generated Javadoc files in '/home/jenkins/.jenkins/jobs/oxCore_3.1.7/workspace/oxUtil/target/site/apidocs' dir.

	at org.apache.maven.plugins.javadoc.AbstractJavadocMojo.executeJavadocCommandLine(AbstractJavadocMojo.java:5298)
	at org.apache.maven.plugins.javadoc.AbstractJavadocMojo.executeReport(AbstractJavadocMojo.java:2134)
	at org.apache.maven.plugins.javadoc.JavadocReport.generate(JavadocReport.java:134)
	at org.apache.maven.plugins.javadoc.JavadocReport.doExecute(JavadocReport.java:329)
	at org.apache.maven.plugins.javadoc.AbstractJavadocMojo.execute(AbstractJavadocMojo.java:1912)
	at org.apache.maven.plugin.DefaultBuildPluginManager.executeMojo(DefaultBuildPluginManager.java:134)
	at org.apache.maven.lifecycle.internal.MojoExecutor.execute(MojoExecutor.java:207)
	at org.apache.maven.lifecycle.internal.MojoExecutor.execute(MojoExecutor.java:153)
	at org.apache.maven.lifecycle.internal.MojoExecutor.execute(MojoExecutor.java:145)
	at org.apache.maven.lifecycle.internal.LifecycleModuleBuilder.buildProject(LifecycleModuleBuilder.java:116)
	at org.apache.maven.lifecycle.internal.LifecycleModuleBuilder.buildProject(LifecycleModuleBuilder.java:80)
	at org.apache.maven.lifecycle.internal.builder.singlethreaded.SingleThreadedBuilder.build(SingleThreadedBuilder.java:51)
	at org.apache.maven.lifecycle.internal.LifecycleStarter.execute(LifecycleStarter.java:128)
	at org.apache.maven.DefaultMaven.doExecute(DefaultMaven.java:307)
	at org.apache.maven.DefaultMaven.doExecute(DefaultMaven.java:193)
	at org.apache.maven.DefaultMaven.execute(DefaultMaven.java:106)
	at org.apache.maven.cli.MavenCli.execute(MavenCli.java:863)
	at org.apache.maven.cli.MavenCli.doMain(MavenCli.java:288)
	at org.apache.maven.cli.MavenCli.main(MavenCli.java:199)
	at sun.reflect.NativeMethodAccessorImpl.invoke0(Native Method)
	at sun.reflect.NativeMethodAccessorImpl.invoke(NativeMethodAccessorImpl.java:62)
	at sun.reflect.DelegatingMethodAccessorImpl.invoke(DelegatingMethodAccessorImpl.java:43)
	at java.lang.reflect.Method.invoke(Method.java:498)
	at org.codehaus.plexus.classworlds.launcher.Launcher.launchEnhanced(Launcher.java:289)
	at org.codehaus.plexus.classworlds.launcher.Launcher.launch(Launcher.java:229)
	at org.codehaus.plexus.classworlds.launcher.Launcher.mainWithExitCode(Launcher.java:415)
	at org.codehaus.plexus.classworlds.launcher.Launcher.main(Launcher.java:356)
[INFO] 
[INFO] --- maven-site-plugin:2.1.1:site (default-site) @ oxcore-util ---
[INFO]                                                                         
[INFO] ------------------------------------------------------------------------
[INFO] Building oxLdap 3.1.5.sp7
[INFO] ------------------------------------------------------------------------
[INFO] 
[INFO] --- maven-clean-plugin:2.4.1:clean (default-clean) @ oxcore-ldap ---
[INFO] Deleting /home/jenkins/.jenkins/jobs/oxCore_3.1.7/workspace/oxLdap/target
[INFO] 
[INFO] --- maven-resources-plugin:2.4:resources (default-resources) @ oxcore-ldap ---
[INFO] Using 'UTF-8' encoding to copy filtered resources.
[INFO] skip non existing resourceDirectory /home/jenkins/.jenkins/jobs/oxCore_3.1.7/workspace/oxLdap/src/main/resources
[INFO] 
[INFO] --- maven-compiler-plugin:2.3.2:compile (default-compile) @ oxcore-ldap ---
[INFO] Compiling 50 source files to /home/jenkins/.jenkins/jobs/oxCore_3.1.7/workspace/oxLdap/target/classes
[INFO] 
[INFO] --- maven-resources-plugin:2.4:resources (default-resources) @ oxcore-ldap ---
[INFO] Using 'UTF-8' encoding to copy filtered resources.
[INFO] skip non existing resourceDirectory /home/jenkins/.jenkins/jobs/oxCore_3.1.7/workspace/oxLdap/src/main/resources
[INFO] 
[INFO] --- maven-compiler-plugin:2.3.2:compile (default-compile) @ oxcore-ldap ---
[INFO] Nothing to compile - all classes are up to date
[INFO] 
[INFO] --- maven-resources-plugin:2.4:testResources (default-testResources) @ oxcore-ldap ---
[INFO] Using 'UTF-8' encoding to copy filtered resources.
[INFO] skip non existing resourceDirectory /home/jenkins/.jenkins/jobs/oxCore_3.1.7/workspace/oxLdap/src/test/resources
[INFO] 
[INFO] --- maven-compiler-plugin:2.3.2:testCompile (default-testCompile) @ oxcore-ldap ---
[INFO] Not compiling test sources
[INFO] 
[INFO] --- maven-surefire-plugin:2.7.2:test (default-test) @ oxcore-ldap ---
[INFO] Tests are skipped.
[INFO] 
[INFO] --- maven-jar-plugin:2.4:jar (default-jar) @ oxcore-ldap ---
[INFO] Building jar: /home/jenkins/.jenkins/jobs/oxCore_3.1.7/workspace/oxLdap/target/oxcore-ldap-3.1.5.sp7.jar
[INFO] 
[INFO] --- maven-install-plugin:2.3.1:install (default-install) @ oxcore-ldap ---
[INFO] Installing /home/jenkins/.jenkins/jobs/oxCore_3.1.7/workspace/oxLdap/target/oxcore-ldap-3.1.5.sp7.jar to /var/www/html/maven/org/xdi/oxcore-ldap/3.1.5.sp7/oxcore-ldap-3.1.5.sp7.jar
[INFO] Installing /home/jenkins/.jenkins/jobs/oxCore_3.1.7/workspace/oxLdap/pom.xml to /var/www/html/maven/org/xdi/oxcore-ldap/3.1.5.sp7/oxcore-ldap-3.1.5.sp7.pom
[INFO] 
[INFO] --- findbugs-maven-plugin:3.0.4:findbugs (default-cli) @ oxcore-ldap ---
[INFO] Fork Value is true
     [java] Warnings generated: 27
[INFO] Done FindBugs Analysis....
[INFO] 
[INFO] --- maven-checkstyle-plugin:3.0.0:checkstyle (default-cli) @ oxcore-ldap ---
[INFO] There are 3389 errors reported by Checkstyle 6.18 with sun_checks.xml ruleset.
[WARNING] Unable to locate Source XRef to link to - DISABLED
[INFO] 
[INFO] >>> maven-javadoc-plugin:3.0.1:javadoc (default-cli) > generate-sources @ oxcore-ldap >>>
[INFO] 
[INFO] <<< maven-javadoc-plugin:3.0.1:javadoc (default-cli) < generate-sources @ oxcore-ldap <<<
[INFO] 
[INFO] --- maven-javadoc-plugin:3.0.1:javadoc (default-cli) @ oxcore-ldap ---
[INFO] 
Loading source files for package org.gluu.site.ldap...
Loading source files for package org.gluu.site.ldap.exception...
Loading source files for package org.gluu.site.ldap.persistence...
Loading source files for package org.gluu.site.ldap.persistence.exception...
Loading source files for package org.gluu.site.ldap.persistence.property...
Loading source files for package org.gluu.site.ldap.persistence.util...
Loading source files for package org.xdi.ldap.model...
Constructing Javadoc information...
Standard Doclet version 1.8.0_221
Building tree for all the packages and classes...
Generating /home/jenkins/.jenkins/jobs/oxCore_3.1.7/workspace/oxLdap/target/site/apidocs/org/gluu/site/ldap/LDAPConnectionProvider.html...
Generating /home/jenkins/.jenkins/jobs/oxCore_3.1.7/workspace/oxLdap/target/site/apidocs/org/gluu/site/ldap/OperationsFacade.html...
Generating /home/jenkins/.jenkins/jobs/oxCore_3.1.7/workspace/oxLdap/target/site/apidocs/org/gluu/site/ldap/exception/ConnectionException.html...
Generating /home/jenkins/.jenkins/jobs/oxCore_3.1.7/workspace/oxLdap/target/site/apidocs/org/gluu/site/ldap/exception/DuplicateEntryException.html...
Generating /home/jenkins/.jenkins/jobs/oxCore_3.1.7/workspace/oxLdap/target/site/apidocs/org/gluu/site/ldap/exception/EntryNotFoundException.html...
Generating /home/jenkins/.jenkins/jobs/oxCore_3.1.7/workspace/oxLdap/target/site/apidocs/org/gluu/site/ldap/exception/InvalidEntryException.html...
Generating /home/jenkins/.jenkins/jobs/oxCore_3.1.7/workspace/oxLdap/target/site/apidocs/org/gluu/site/ldap/exception/InvalidSimplePageControlException.html...
Generating /home/jenkins/.jenkins/jobs/oxCore_3.1.7/workspace/oxLdap/target/site/apidocs/org/gluu/site/ldap/exception/LugeException.html...
Generating /home/jenkins/.jenkins/jobs/oxCore_3.1.7/workspace/oxLdap/target/site/apidocs/org/gluu/site/ldap/persistence/AbstractEntryManager.html...
Generating /home/jenkins/.jenkins/jobs/oxCore_3.1.7/workspace/oxLdap/target/site/apidocs/org/gluu/site/ldap/persistence/AttributeData.html...
Generating /home/jenkins/.jenkins/jobs/oxCore_3.1.7/workspace/oxLdap/target/site/apidocs/org/gluu/site/ldap/persistence/AttributeDataModification.html...
Generating /home/jenkins/.jenkins/jobs/oxCore_3.1.7/workspace/oxLdap/target/site/apidocs/org/gluu/site/ldap/persistence/AttributeDataModification.AttributeModificationType.html...
Generating /home/jenkins/.jenkins/jobs/oxCore_3.1.7/workspace/oxLdap/target/site/apidocs/org/gluu/site/ldap/persistence/BatchOperation.html...
Generating /home/jenkins/.jenkins/jobs/oxCore_3.1.7/workspace/oxLdap/target/site/apidocs/org/gluu/site/ldap/persistence/DeleteNotifier.html...
Generating /home/jenkins/.jenkins/jobs/oxCore_3.1.7/workspace/oxLdap/target/site/apidocs/org/gluu/site/ldap/persistence/LdapCustomAttribute.html...
Generating /home/jenkins/.jenkins/jobs/oxCore_3.1.7/workspace/oxLdap/target/site/apidocs/org/gluu/site/ldap/persistence/LdapEntryManager.html...
Generating /home/jenkins/.jenkins/jobs/oxCore_3.1.7/workspace/oxLdap/target/site/apidocs/org/gluu/site/ldap/persistence/LdifDataUtility.html...
Generating /home/jenkins/.jenkins/jobs/oxCore_3.1.7/workspace/oxLdap/target/site/apidocs/org/gluu/site/ldap/persistence/PropertyAnnotation.html...
Generating /home/jenkins/.jenkins/jobs/oxCore_3.1.7/workspace/oxLdap/target/site/apidocs/org/gluu/site/ldap/persistence/exception/AuthenticationException.html...
Generating /home/jenkins/.jenkins/jobs/oxCore_3.1.7/workspace/oxLdap/target/site/apidocs/org/gluu/site/ldap/persistence/exception/EmptyEntryPersistenceException.html...
Generating /home/jenkins/.jenkins/jobs/oxCore_3.1.7/workspace/oxLdap/target/site/apidocs/org/gluu/site/ldap/persistence/exception/EntryPersistenceException.html...
Generating /home/jenkins/.jenkins/jobs/oxCore_3.1.7/workspace/oxLdap/target/site/apidocs/org/gluu/site/ldap/persistence/exception/InvalidArgumentException.html...
Generating /home/jenkins/.jenkins/jobs/oxCore_3.1.7/workspace/oxLdap/target/site/apidocs/org/gluu/site/ldap/persistence/exception/InvalidConfigurationException.html...
Generating /home/jenkins/.jenkins/jobs/oxCore_3.1.7/workspace/oxLdap/target/site/apidocs/org/gluu/site/ldap/persistence/exception/LdapMappingException.html...
Generating /home/jenkins/.jenkins/jobs/oxCore_3.1.7/workspace/oxLdap/target/site/apidocs/org/gluu/site/ldap/persistence/exception/MappingException.html...
Generating /home/jenkins/.jenkins/jobs/oxCore_3.1.7/workspace/oxLdap/target/site/apidocs/org/gluu/site/ldap/persistence/exception/PropertyAccessException.html...
Generating /home/jenkins/.jenkins/jobs/oxCore_3.1.7/workspace/oxLdap/target/site/apidocs/org/gluu/site/ldap/persistence/exception/PropertyNotFoundException.html...
Generating /home/jenkins/.jenkins/jobs/oxCore_3.1.7/workspace/oxLdap/target/site/apidocs/org/gluu/site/ldap/persistence/exception/PropertyValueException.html...
Generating /home/jenkins/.jenkins/jobs/oxCore_3.1.7/workspace/oxLdap/target/site/apidocs/org/gluu/site/ldap/persistence/exception/UnsupportedOperationException.html...
Generating /home/jenkins/.jenkins/jobs/oxCore_3.1.7/workspace/oxLdap/target/site/apidocs/org/gluu/site/ldap/persistence/property/BasicPropertyAccessor.html...
Generating /home/jenkins/.jenkins/jobs/oxCore_3.1.7/workspace/oxLdap/target/site/apidocs/org/gluu/site/ldap/persistence/property/BasicPropertyAccessor.BasicGetter.html...
Generating /home/jenkins/.jenkins/jobs/oxCore_3.1.7/workspace/oxLdap/target/site/apidocs/org/gluu/site/ldap/persistence/property/BasicPropertyAccessor.BasicSetter.html...
Generating /home/jenkins/.jenkins/jobs/oxCore_3.1.7/workspace/oxLdap/target/site/apidocs/org/gluu/site/ldap/persistence/property/BasicPropertyAnnotationResolver.html...
Generating /home/jenkins/.jenkins/jobs/oxCore_3.1.7/workspace/oxLdap/target/site/apidocs/org/gluu/site/ldap/persistence/property/DirectPropertyAccessor.html...
Generating /home/jenkins/.jenkins/jobs/oxCore_3.1.7/workspace/oxLdap/target/site/apidocs/org/gluu/site/ldap/persistence/property/DirectPropertyAccessor.DirectGetter.html...
Generating /home/jenkins/.jenkins/jobs/oxCore_3.1.7/workspace/oxLdap/target/site/apidocs/org/gluu/site/ldap/persistence/property/DirectPropertyAccessor.DirectSetter.html...
Generating /home/jenkins/.jenkins/jobs/oxCore_3.1.7/workspace/oxLdap/target/site/apidocs/org/gluu/site/ldap/persistence/property/Getter.html...
Generating /home/jenkins/.jenkins/jobs/oxCore_3.1.7/workspace/oxLdap/target/site/apidocs/org/gluu/site/ldap/persistence/property/PropertyAccessor.html...
Generating /home/jenkins/.jenkins/jobs/oxCore_3.1.7/workspace/oxLdap/target/site/apidocs/org/gluu/site/ldap/persistence/property/PropertyAnnotationResolver.html...
Generating /home/jenkins/.jenkins/jobs/oxCore_3.1.7/workspace/oxLdap/target/site/apidocs/org/gluu/site/ldap/persistence/property/Setter.html...
Generating /home/jenkins/.jenkins/jobs/oxCore_3.1.7/workspace/oxLdap/target/site/apidocs/org/gluu/site/ldap/persistence/util/ReflectHelper.html...
Generating /home/jenkins/.jenkins/jobs/oxCore_3.1.7/workspace/oxLdap/target/site/apidocs/org/xdi/ldap/model/BaseEntry.html...
Generating /home/jenkins/.jenkins/jobs/oxCore_3.1.7/workspace/oxLdap/target/site/apidocs/org/xdi/ldap/model/CustomAttribute.html...
Generating /home/jenkins/.jenkins/jobs/oxCore_3.1.7/workspace/oxLdap/target/site/apidocs/org/xdi/ldap/model/CustomEntry.html...
Generating /home/jenkins/.jenkins/jobs/oxCore_3.1.7/workspace/oxLdap/target/site/apidocs/org/xdi/ldap/model/Entry.html...
Generating /home/jenkins/.jenkins/jobs/oxCore_3.1.7/workspace/oxLdap/target/site/apidocs/org/xdi/ldap/model/GluuBoolean.html...
Generating /home/jenkins/.jenkins/jobs/oxCore_3.1.7/workspace/oxLdap/target/site/apidocs/org/xdi/ldap/model/GluuDummyEntry.html...
Generating /home/jenkins/.jenkins/jobs/oxCore_3.1.7/workspace/oxLdap/target/site/apidocs/org/xdi/ldap/model/GluuStatus.html...
Generating /home/jenkins/.jenkins/jobs/oxCore_3.1.7/workspace/oxLdap/target/site/apidocs/org/xdi/ldap/model/InumEntry.html...
Generating /home/jenkins/.jenkins/jobs/oxCore_3.1.7/workspace/oxLdap/target/site/apidocs/org/xdi/ldap/model/LdapDummyEntry.html...
Generating /home/jenkins/.jenkins/jobs/oxCore_3.1.7/workspace/oxLdap/target/site/apidocs/org/xdi/ldap/model/SearchScope.html...
Generating /home/jenkins/.jenkins/jobs/oxCore_3.1.7/workspace/oxLdap/target/site/apidocs/org/xdi/ldap/model/SimpleBranch.html...
Generating /home/jenkins/.jenkins/jobs/oxCore_3.1.7/workspace/oxLdap/target/site/apidocs/org/xdi/ldap/model/SimpleUser.html...
Generating /home/jenkins/.jenkins/jobs/oxCore_3.1.7/workspace/oxLdap/target/site/apidocs/org/xdi/ldap/model/SortOrder.html...
Generating /home/jenkins/.jenkins/jobs/oxCore_3.1.7/workspace/oxLdap/target/site/apidocs/org/xdi/ldap/model/VirtualListViewResponse.html...
Generating /home/jenkins/.jenkins/jobs/oxCore_3.1.7/workspace/oxLdap/target/site/apidocs/overview-frame.html...
Generating /home/jenkins/.jenkins/jobs/oxCore_3.1.7/workspace/oxLdap/target/site/apidocs/org/gluu/site/ldap/package-frame.html...
Generating /home/jenkins/.jenkins/jobs/oxCore_3.1.7/workspace/oxLdap/target/site/apidocs/org/gluu/site/ldap/package-summary.html...
Generating /home/jenkins/.jenkins/jobs/oxCore_3.1.7/workspace/oxLdap/target/site/apidocs/org/gluu/site/ldap/package-tree.html...
Generating /home/jenkins/.jenkins/jobs/oxCore_3.1.7/workspace/oxLdap/target/site/apidocs/org/gluu/site/ldap/exception/package-frame.html...
Generating /home/jenkins/.jenkins/jobs/oxCore_3.1.7/workspace/oxLdap/target/site/apidocs/org/gluu/site/ldap/exception/package-summary.html...
Generating /home/jenkins/.jenkins/jobs/oxCore_3.1.7/workspace/oxLdap/target/site/apidocs/org/gluu/site/ldap/exception/package-tree.html...
Generating /home/jenkins/.jenkins/jobs/oxCore_3.1.7/workspace/oxLdap/target/site/apidocs/org/gluu/site/ldap/persistence/package-frame.html...
Generating /home/jenkins/.jenkins/jobs/oxCore_3.1.7/workspace/oxLdap/target/site/apidocs/org/gluu/site/ldap/persistence/package-summary.html...
Generating /home/jenkins/.jenkins/jobs/oxCore_3.1.7/workspace/oxLdap/target/site/apidocs/org/gluu/site/ldap/persistence/package-tree.html...
Generating /home/jenkins/.jenkins/jobs/oxCore_3.1.7/workspace/oxLdap/target/site/apidocs/org/gluu/site/ldap/persistence/exception/package-frame.html...
Generating /home/jenkins/.jenkins/jobs/oxCore_3.1.7/workspace/oxLdap/target/site/apidocs/org/gluu/site/ldap/persistence/exception/package-summary.html...
Generating /home/jenkins/.jenkins/jobs/oxCore_3.1.7/workspace/oxLdap/target/site/apidocs/org/gluu/site/ldap/persistence/exception/package-tree.html...
Generating /home/jenkins/.jenkins/jobs/oxCore_3.1.7/workspace/oxLdap/target/site/apidocs/org/gluu/site/ldap/persistence/property/package-frame.html...
Generating /home/jenkins/.jenkins/jobs/oxCore_3.1.7/workspace/oxLdap/target/site/apidocs/org/gluu/site/ldap/persistence/property/package-summary.html...
Generating /home/jenkins/.jenkins/jobs/oxCore_3.1.7/workspace/oxLdap/target/site/apidocs/org/gluu/site/ldap/persistence/property/package-tree.html...
Generating /home/jenkins/.jenkins/jobs/oxCore_3.1.7/workspace/oxLdap/target/site/apidocs/org/gluu/site/ldap/persistence/util/package-frame.html...
Generating /home/jenkins/.jenkins/jobs/oxCore_3.1.7/workspace/oxLdap/target/site/apidocs/org/gluu/site/ldap/persistence/util/package-summary.html...
Generating /home/jenkins/.jenkins/jobs/oxCore_3.1.7/workspace/oxLdap/target/site/apidocs/org/gluu/site/ldap/persistence/util/package-tree.html...
Generating /home/jenkins/.jenkins/jobs/oxCore_3.1.7/workspace/oxLdap/target/site/apidocs/org/xdi/ldap/model/package-frame.html...
Generating /home/jenkins/.jenkins/jobs/oxCore_3.1.7/workspace/oxLdap/target/site/apidocs/org/xdi/ldap/model/package-summary.html...
Generating /home/jenkins/.jenkins/jobs/oxCore_3.1.7/workspace/oxLdap/target/site/apidocs/org/xdi/ldap/model/package-tree.html...
Generating /home/jenkins/.jenkins/jobs/oxCore_3.1.7/workspace/oxLdap/target/site/apidocs/constant-values.html...
Generating /home/jenkins/.jenkins/jobs/oxCore_3.1.7/workspace/oxLdap/target/site/apidocs/serialized-form.html...
Generating /home/jenkins/.jenkins/jobs/oxCore_3.1.7/workspace/oxLdap/target/site/apidocs/org/gluu/site/ldap/class-use/OperationsFacade.html...
Generating /home/jenkins/.jenkins/jobs/oxCore_3.1.7/workspace/oxLdap/target/site/apidocs/org/gluu/site/ldap/class-use/LDAPConnectionProvider.html...
Generating /home/jenkins/.jenkins/jobs/oxCore_3.1.7/workspace/oxLdap/target/site/apidocs/org/gluu/site/ldap/exception/class-use/LugeException.html...
Generating /home/jenkins/.jenkins/jobs/oxCore_3.1.7/workspace/oxLdap/target/site/apidocs/org/gluu/site/ldap/exception/class-use/InvalidSimplePageControlException.html...
Generating /home/jenkins/.jenkins/jobs/oxCore_3.1.7/workspace/oxLdap/target/site/apidocs/org/gluu/site/ldap/exception/class-use/InvalidEntryException.html...
Generating /home/jenkins/.jenkins/jobs/oxCore_3.1.7/workspace/oxLdap/target/site/apidocs/org/gluu/site/ldap/exception/class-use/EntryNotFoundException.html...
Generating /home/jenkins/.jenkins/jobs/oxCore_3.1.7/workspace/oxLdap/target/site/apidocs/org/gluu/site/ldap/exception/class-use/DuplicateEntryException.html...
Generating /home/jenkins/.jenkins/jobs/oxCore_3.1.7/workspace/oxLdap/target/site/apidocs/org/gluu/site/ldap/exception/class-use/ConnectionException.html...
Generating /home/jenkins/.jenkins/jobs/oxCore_3.1.7/workspace/oxLdap/target/site/apidocs/org/gluu/site/ldap/persistence/class-use/PropertyAnnotation.html...
Generating /home/jenkins/.jenkins/jobs/oxCore_3.1.7/workspace/oxLdap/target/site/apidocs/org/gluu/site/ldap/persistence/class-use/LdifDataUtility.html...
Generating /home/jenkins/.jenkins/jobs/oxCore_3.1.7/workspace/oxLdap/target/site/apidocs/org/gluu/site/ldap/persistence/class-use/LdapEntryManager.html...
Generating /home/jenkins/.jenkins/jobs/oxCore_3.1.7/workspace/oxLdap/target/site/apidocs/org/gluu/site/ldap/persistence/class-use/LdapCustomAttribute.html...
Generating /home/jenkins/.jenkins/jobs/oxCore_3.1.7/workspace/oxLdap/target/site/apidocs/org/gluu/site/ldap/persistence/class-use/DeleteNotifier.html...
Generating /home/jenkins/.jenkins/jobs/oxCore_3.1.7/workspace/oxLdap/target/site/apidocs/org/gluu/site/ldap/persistence/class-use/BatchOperation.html...
Generating /home/jenkins/.jenkins/jobs/oxCore_3.1.7/workspace/oxLdap/target/site/apidocs/org/gluu/site/ldap/persistence/class-use/AttributeDataModification.html...
Generating /home/jenkins/.jenkins/jobs/oxCore_3.1.7/workspace/oxLdap/target/site/apidocs/org/gluu/site/ldap/persistence/class-use/AttributeDataModification.AttributeModificationType.html...
Generating /home/jenkins/.jenkins/jobs/oxCore_3.1.7/workspace/oxLdap/target/site/apidocs/org/gluu/site/ldap/persistence/class-use/AttributeData.html...
Generating /home/jenkins/.jenkins/jobs/oxCore_3.1.7/workspace/oxLdap/target/site/apidocs/org/gluu/site/ldap/persistence/class-use/AbstractEntryManager.html...
Generating /home/jenkins/.jenkins/jobs/oxCore_3.1.7/workspace/oxLdap/target/site/apidocs/org/gluu/site/ldap/persistence/exception/class-use/UnsupportedOperationException.html...
Generating /home/jenkins/.jenkins/jobs/oxCore_3.1.7/workspace/oxLdap/target/site/apidocs/org/gluu/site/ldap/persistence/exception/class-use/PropertyValueException.html...
Generating /home/jenkins/.jenkins/jobs/oxCore_3.1.7/workspace/oxLdap/target/site/apidocs/org/gluu/site/ldap/persistence/exception/class-use/PropertyNotFoundException.html...
Generating /home/jenkins/.jenkins/jobs/oxCore_3.1.7/workspace/oxLdap/target/site/apidocs/org/gluu/site/ldap/persistence/exception/class-use/PropertyAccessException.html...
Generating /home/jenkins/.jenkins/jobs/oxCore_3.1.7/workspace/oxLdap/target/site/apidocs/org/gluu/site/ldap/persistence/exception/class-use/MappingException.html...
Generating /home/jenkins/.jenkins/jobs/oxCore_3.1.7/workspace/oxLdap/target/site/apidocs/org/gluu/site/ldap/persistence/exception/class-use/LdapMappingException.html...
Generating /home/jenkins/.jenkins/jobs/oxCore_3.1.7/workspace/oxLdap/target/site/apidocs/org/gluu/site/ldap/persistence/exception/class-use/InvalidConfigurationException.html...
Generating /home/jenkins/.jenkins/jobs/oxCore_3.1.7/workspace/oxLdap/target/site/apidocs/org/gluu/site/ldap/persistence/exception/class-use/InvalidArgumentException.html...
Generating /home/jenkins/.jenkins/jobs/oxCore_3.1.7/workspace/oxLdap/target/site/apidocs/org/gluu/site/ldap/persistence/exception/class-use/EntryPersistenceException.html...
Generating /home/jenkins/.jenkins/jobs/oxCore_3.1.7/workspace/oxLdap/target/site/apidocs/org/gluu/site/ldap/persistence/exception/class-use/EmptyEntryPersistenceException.html...
Generating /home/jenkins/.jenkins/jobs/oxCore_3.1.7/workspace/oxLdap/target/site/apidocs/org/gluu/site/ldap/persistence/exception/class-use/AuthenticationException.html...
Generating /home/jenkins/.jenkins/jobs/oxCore_3.1.7/workspace/oxLdap/target/site/apidocs/org/gluu/site/ldap/persistence/property/class-use/Setter.html...
Generating /home/jenkins/.jenkins/jobs/oxCore_3.1.7/workspace/oxLdap/target/site/apidocs/org/gluu/site/ldap/persistence/property/class-use/PropertyAnnotationResolver.html...
Generating /home/jenkins/.jenkins/jobs/oxCore_3.1.7/workspace/oxLdap/target/site/apidocs/org/gluu/site/ldap/persistence/property/class-use/PropertyAccessor.html...
Generating /home/jenkins/.jenkins/jobs/oxCore_3.1.7/workspace/oxLdap/target/site/apidocs/org/gluu/site/ldap/persistence/property/class-use/Getter.html...
Generating /home/jenkins/.jenkins/jobs/oxCore_3.1.7/workspace/oxLdap/target/site/apidocs/org/gluu/site/ldap/persistence/property/class-use/DirectPropertyAccessor.html...
Generating /home/jenkins/.jenkins/jobs/oxCore_3.1.7/workspace/oxLdap/target/site/apidocs/org/gluu/site/ldap/persistence/property/class-use/DirectPropertyAccessor.DirectGetter.html...
Generating /home/jenkins/.jenkins/jobs/oxCore_3.1.7/workspace/oxLdap/target/site/apidocs/org/gluu/site/ldap/persistence/property/class-use/DirectPropertyAccessor.DirectSetter.html...
Generating /home/jenkins/.jenkins/jobs/oxCore_3.1.7/workspace/oxLdap/target/site/apidocs/org/gluu/site/ldap/persistence/property/class-use/BasicPropertyAnnotationResolver.html...
Generating /home/jenkins/.jenkins/jobs/oxCore_3.1.7/workspace/oxLdap/target/site/apidocs/org/gluu/site/ldap/persistence/property/class-use/BasicPropertyAccessor.html...
Generating /home/jenkins/.jenkins/jobs/oxCore_3.1.7/workspace/oxLdap/target/site/apidocs/org/gluu/site/ldap/persistence/property/class-use/BasicPropertyAccessor.BasicSetter.html...
Generating /home/jenkins/.jenkins/jobs/oxCore_3.1.7/workspace/oxLdap/target/site/apidocs/org/gluu/site/ldap/persistence/property/class-use/BasicPropertyAccessor.BasicGetter.html...
Generating /home/jenkins/.jenkins/jobs/oxCore_3.1.7/workspace/oxLdap/target/site/apidocs/org/gluu/site/ldap/persistence/util/class-use/ReflectHelper.html...
Generating /home/jenkins/.jenkins/jobs/oxCore_3.1.7/workspace/oxLdap/target/site/apidocs/org/xdi/ldap/model/class-use/VirtualListViewResponse.html...
Generating /home/jenkins/.jenkins/jobs/oxCore_3.1.7/workspace/oxLdap/target/site/apidocs/org/xdi/ldap/model/class-use/SortOrder.html...
Generating /home/jenkins/.jenkins/jobs/oxCore_3.1.7/workspace/oxLdap/target/site/apidocs/org/xdi/ldap/model/class-use/SimpleUser.html...
Generating /home/jenkins/.jenkins/jobs/oxCore_3.1.7/workspace/oxLdap/target/site/apidocs/org/xdi/ldap/model/class-use/SimpleBranch.html...
Generating /home/jenkins/.jenkins/jobs/oxCore_3.1.7/workspace/oxLdap/target/site/apidocs/org/xdi/ldap/model/class-use/SearchScope.html...
Generating /home/jenkins/.jenkins/jobs/oxCore_3.1.7/workspace/oxLdap/target/site/apidocs/org/xdi/ldap/model/class-use/LdapDummyEntry.html...
Generating /home/jenkins/.jenkins/jobs/oxCore_3.1.7/workspace/oxLdap/target/site/apidocs/org/xdi/ldap/model/class-use/InumEntry.html...
Generating /home/jenkins/.jenkins/jobs/oxCore_3.1.7/workspace/oxLdap/target/site/apidocs/org/xdi/ldap/model/class-use/GluuStatus.html...
Generating /home/jenkins/.jenkins/jobs/oxCore_3.1.7/workspace/oxLdap/target/site/apidocs/org/xdi/ldap/model/class-use/GluuDummyEntry.html...
Generating /home/jenkins/.jenkins/jobs/oxCore_3.1.7/workspace/oxLdap/target/site/apidocs/org/xdi/ldap/model/class-use/GluuBoolean.html...
Generating /home/jenkins/.jenkins/jobs/oxCore_3.1.7/workspace/oxLdap/target/site/apidocs/org/xdi/ldap/model/class-use/Entry.html...
Generating /home/jenkins/.jenkins/jobs/oxCore_3.1.7/workspace/oxLdap/target/site/apidocs/org/xdi/ldap/model/class-use/CustomEntry.html...
Generating /home/jenkins/.jenkins/jobs/oxCore_3.1.7/workspace/oxLdap/target/site/apidocs/org/xdi/ldap/model/class-use/CustomAttribute.html...
Generating /home/jenkins/.jenkins/jobs/oxCore_3.1.7/workspace/oxLdap/target/site/apidocs/org/xdi/ldap/model/class-use/BaseEntry.html...
Generating /home/jenkins/.jenkins/jobs/oxCore_3.1.7/workspace/oxLdap/target/site/apidocs/org/gluu/site/ldap/package-use.html...
Generating /home/jenkins/.jenkins/jobs/oxCore_3.1.7/workspace/oxLdap/target/site/apidocs/org/gluu/site/ldap/exception/package-use.html...
Generating /home/jenkins/.jenkins/jobs/oxCore_3.1.7/workspace/oxLdap/target/site/apidocs/org/gluu/site/ldap/persistence/package-use.html...
Generating /home/jenkins/.jenkins/jobs/oxCore_3.1.7/workspace/oxLdap/target/site/apidocs/org/gluu/site/ldap/persistence/exception/package-use.html...
Generating /home/jenkins/.jenkins/jobs/oxCore_3.1.7/workspace/oxLdap/target/site/apidocs/org/gluu/site/ldap/persistence/property/package-use.html...
Generating /home/jenkins/.jenkins/jobs/oxCore_3.1.7/workspace/oxLdap/target/site/apidocs/org/gluu/site/ldap/persistence/util/package-use.html...
Generating /home/jenkins/.jenkins/jobs/oxCore_3.1.7/workspace/oxLdap/target/site/apidocs/org/xdi/ldap/model/package-use.html...
Building index for all the packages and classes...
Generating /home/jenkins/.jenkins/jobs/oxCore_3.1.7/workspace/oxLdap/target/site/apidocs/overview-tree.html...
Generating /home/jenkins/.jenkins/jobs/oxCore_3.1.7/workspace/oxLdap/target/site/apidocs/index-all.html...
Generating /home/jenkins/.jenkins/jobs/oxCore_3.1.7/workspace/oxLdap/target/site/apidocs/deprecated-list.html...
Building index for all classes...
Generating /home/jenkins/.jenkins/jobs/oxCore_3.1.7/workspace/oxLdap/target/site/apidocs/allclasses-frame.html...
Generating /home/jenkins/.jenkins/jobs/oxCore_3.1.7/workspace/oxLdap/target/site/apidocs/allclasses-noframe.html...
Generating /home/jenkins/.jenkins/jobs/oxCore_3.1.7/workspace/oxLdap/target/site/apidocs/index.html...
Generating /home/jenkins/.jenkins/jobs/oxCore_3.1.7/workspace/oxLdap/target/site/apidocs/overview-summary.html...
Generating /home/jenkins/.jenkins/jobs/oxCore_3.1.7/workspace/oxLdap/target/site/apidocs/help-doc.html...
9 errors
69 warnings
[ERROR] Error while creating javadoc report: 
Exit code: 1 - /home/jenkins/.jenkins/jobs/oxCore_3.1.7/workspace/oxLdap/src/main/java/org/gluu/site/ldap/LDAPConnectionProvider.java:91: warning: no description for @throws
	 * @throws NumberFormatException
	   ^
/home/jenkins/.jenkins/jobs/oxCore_3.1.7/workspace/oxLdap/src/main/java/org/gluu/site/ldap/LDAPConnectionProvider.java:92: warning: no description for @throws
	 * @throws LDAPException
	   ^
/home/jenkins/.jenkins/jobs/oxCore_3.1.7/workspace/oxLdap/src/main/java/org/gluu/site/ldap/LDAPConnectionProvider.java:93: warning: no description for @throws
	 * @throws GeneralSecurityException
	   ^
/home/jenkins/.jenkins/jobs/oxCore_3.1.7/workspace/oxLdap/src/main/java/org/gluu/site/ldap/LDAPConnectionProvider.java:94: error: exception not thrown: org.xdi.util.security.StringEncrypter.EncryptionException
	 * @throws EncryptionException
	           ^
/home/jenkins/.jenkins/jobs/oxCore_3.1.7/workspace/oxLdap/src/main/java/org/gluu/site/ldap/LDAPConnectionProvider.java:94: warning: no description for @throws
	 * @throws EncryptionException
	   ^
/home/jenkins/.jenkins/jobs/oxCore_3.1.7/workspace/oxLdap/src/main/java/org/gluu/site/ldap/LDAPConnectionProvider.java:95: error: exception not thrown: org.xdi.util.security.StringEncrypter.EncryptionException
	 * @throws EncryptionException
	           ^
/home/jenkins/.jenkins/jobs/oxCore_3.1.7/workspace/oxLdap/src/main/java/org/gluu/site/ldap/LDAPConnectionProvider.java:95: warning: no description for @throws
	 * @throws EncryptionException
	   ^
/home/jenkins/.jenkins/jobs/oxCore_3.1.7/workspace/oxLdap/src/main/java/org/gluu/site/ldap/LDAPConnectionProvider.java:97: warning: no @param for props
	public void init(Properties props) throws NumberFormatException, LDAPException, GeneralSecurityException {
	            ^
/home/jenkins/.jenkins/jobs/oxCore_3.1.7/workspace/oxLdap/src/main/java/org/gluu/site/ldap/LDAPConnectionProvider.java:392: warning: no description for @throws
	 * @throws LDAPException
	   ^
/home/jenkins/.jenkins/jobs/oxCore_3.1.7/workspace/oxLdap/src/main/java/org/gluu/site/ldap/LDAPConnectionProvider.java:409: warning: no description for @param
	 * @param connection
	   ^
/home/jenkins/.jenkins/jobs/oxCore_3.1.7/workspace/oxLdap/src/main/java/org/gluu/site/ldap/LDAPConnectionProvider.java:418: warning: no description for @param
	 * @param connection
	   ^
/home/jenkins/.jenkins/jobs/oxCore_3.1.7/workspace/oxLdap/src/main/java/org/gluu/site/ldap/LDAPConnectionProvider.java:430: warning: no description for @param
	 * @param connection
	   ^
/home/jenkins/.jenkins/jobs/oxCore_3.1.7/workspace/oxLdap/src/main/java/org/gluu/site/ldap/OperationsFacade.java:139: warning: no description for @param
	 * @param userName
	   ^
/home/jenkins/.jenkins/jobs/oxCore_3.1.7/workspace/oxLdap/src/main/java/org/gluu/site/ldap/OperationsFacade.java:140: warning: no description for @param
	 * @param password
	   ^
/home/jenkins/.jenkins/jobs/oxCore_3.1.7/workspace/oxLdap/src/main/java/org/gluu/site/ldap/OperationsFacade.java:141: warning: no description for @return
	 * @return
	   ^
/home/jenkins/.jenkins/jobs/oxCore_3.1.7/workspace/oxLdap/src/main/java/org/gluu/site/ldap/OperationsFacade.java:142: warning: no description for @throws
	 * @throws ConnectionException
	   ^
/home/jenkins/.jenkins/jobs/oxCore_3.1.7/workspace/oxLdap/src/main/java/org/gluu/site/ldap/OperationsFacade.java:143: warning: no description for @throws
	 * @throws ConnectionException
	   ^
/home/jenkins/.jenkins/jobs/oxCore_3.1.7/workspace/oxLdap/src/main/java/org/gluu/site/ldap/OperationsFacade.java:144: error: exception not thrown: com.unboundid.ldap.sdk.LDAPException
	 * @throws LDAPException
	           ^
/home/jenkins/.jenkins/jobs/oxCore_3.1.7/workspace/oxLdap/src/main/java/org/gluu/site/ldap/OperationsFacade.java:144: warning: no description for @throws
	 * @throws LDAPException
	   ^
/home/jenkins/.jenkins/jobs/oxCore_3.1.7/workspace/oxLdap/src/main/java/org/gluu/site/ldap/OperationsFacade.java:146: warning: no @param for baseDN
	public boolean authenticate(final String userName, final String password, final String baseDN) throws ConnectionException {
	               ^
/home/jenkins/.jenkins/jobs/oxCore_3.1.7/workspace/oxLdap/src/main/java/org/gluu/site/ldap/OperationsFacade.java:217: warning: no @param for uid
	protected String lookupDnByUid(String uid, String baseDN) throws LDAPSearchException {
	                 ^
/home/jenkins/.jenkins/jobs/oxCore_3.1.7/workspace/oxLdap/src/main/java/org/gluu/site/ldap/OperationsFacade.java:217: warning: no @param for baseDN
	protected String lookupDnByUid(String uid, String baseDN) throws LDAPSearchException {
	                 ^
/home/jenkins/.jenkins/jobs/oxCore_3.1.7/workspace/oxLdap/src/main/java/org/gluu/site/ldap/OperationsFacade.java:217: warning: no @return
	protected String lookupDnByUid(String uid, String baseDN) throws LDAPSearchException {
	                 ^
/home/jenkins/.jenkins/jobs/oxCore_3.1.7/workspace/oxLdap/src/main/java/org/gluu/site/ldap/OperationsFacade.java:217: warning: no @throws for com.unboundid.ldap.sdk.LDAPSearchException
	protected String lookupDnByUid(String uid, String baseDN) throws LDAPSearchException {
	                 ^
/home/jenkins/.jenkins/jobs/oxCore_3.1.7/workspace/oxLdap/src/main/java/org/gluu/site/ldap/OperationsFacade.java:546: warning: no description for @param
	 * @param dn
	   ^
/home/jenkins/.jenkins/jobs/oxCore_3.1.7/workspace/oxLdap/src/main/java/org/gluu/site/ldap/OperationsFacade.java:548: warning: no description for @throws
	 * @throws ConnectionException
	   ^
/home/jenkins/.jenkins/jobs/oxCore_3.1.7/workspace/oxLdap/src/main/java/org/gluu/site/ldap/OperationsFacade.java:557: warning: no description for @param
	 * @param dn
	   ^
/home/jenkins/.jenkins/jobs/oxCore_3.1.7/workspace/oxLdap/src/main/java/org/gluu/site/ldap/OperationsFacade.java:558: warning: no description for @param
	 * @param attributes
	   ^
/home/jenkins/.jenkins/jobs/oxCore_3.1.7/workspace/oxLdap/src/main/java/org/gluu/site/ldap/OperationsFacade.java:560: warning: no description for @throws
	 * @throws ConnectionException
	   ^
/home/jenkins/.jenkins/jobs/oxCore_3.1.7/workspace/oxLdap/src/main/java/org/gluu/site/ldap/OperationsFacade.java:586: warning: no description for @throws
	 * @throws DuplicateEntryException
	   ^
/home/jenkins/.jenkins/jobs/oxCore_3.1.7/workspace/oxLdap/src/main/java/org/gluu/site/ldap/OperationsFacade.java:587: warning: no description for @throws
	 * @throws ConnectionException
	   ^
/home/jenkins/.jenkins/jobs/oxCore_3.1.7/workspace/oxLdap/src/main/java/org/gluu/site/ldap/OperationsFacade.java:588: warning: no description for @throws
	 * @throws DuplicateEntryException
	   ^
/home/jenkins/.jenkins/jobs/oxCore_3.1.7/workspace/oxLdap/src/main/java/org/gluu/site/ldap/OperationsFacade.java:589: warning: no description for @throws
	 * @throws ConnectionException
	   ^
/home/jenkins/.jenkins/jobs/oxCore_3.1.7/workspace/oxLdap/src/main/java/org/gluu/site/ldap/OperationsFacade.java:590: error: exception not thrown: com.unboundid.ldap.sdk.LDAPException
	 * @throws LDAPException
	           ^
/home/jenkins/.jenkins/jobs/oxCore_3.1.7/workspace/oxLdap/src/main/java/org/gluu/site/ldap/OperationsFacade.java:590: warning: no description for @throws
	 * @throws LDAPException
	   ^
/home/jenkins/.jenkins/jobs/oxCore_3.1.7/workspace/oxLdap/src/main/java/org/gluu/site/ldap/OperationsFacade.java:621: warning: no description for @param
	 * @param dn
	   ^
/home/jenkins/.jenkins/jobs/oxCore_3.1.7/workspace/oxLdap/src/main/java/org/gluu/site/ldap/OperationsFacade.java:622: warning: no description for @param
	 * @param attrs
	   ^
/home/jenkins/.jenkins/jobs/oxCore_3.1.7/workspace/oxLdap/src/main/java/org/gluu/site/ldap/OperationsFacade.java:623: warning: no description for @return
	 * @return
	   ^
/home/jenkins/.jenkins/jobs/oxCore_3.1.7/workspace/oxLdap/src/main/java/org/gluu/site/ldap/OperationsFacade.java:624: warning: no description for @throws
	 * @throws ConnectionException 
	   ^
/home/jenkins/.jenkins/jobs/oxCore_3.1.7/workspace/oxLdap/src/main/java/org/gluu/site/ldap/OperationsFacade.java:625: warning: no description for @throws
	 * @throws DuplicateEntryException 
	   ^
/home/jenkins/.jenkins/jobs/oxCore_3.1.7/workspace/oxLdap/src/main/java/org/gluu/site/ldap/OperationsFacade.java:655: warning: no description for @param
	 * @param modifyRequest
	   ^
/home/jenkins/.jenkins/jobs/oxCore_3.1.7/workspace/oxLdap/src/main/java/org/gluu/site/ldap/OperationsFacade.java:657: warning: no description for @throws
	 * @throws DuplicateEntryException 
	   ^
/home/jenkins/.jenkins/jobs/oxCore_3.1.7/workspace/oxLdap/src/main/java/org/gluu/site/ldap/OperationsFacade.java:658: warning: no description for @throws
	 * @throws ConnectionException 
	   ^
/home/jenkins/.jenkins/jobs/oxCore_3.1.7/workspace/oxLdap/src/main/java/org/gluu/site/ldap/OperationsFacade.java:684: warning: no description for @param
	 * @param dn
	   ^
/home/jenkins/.jenkins/jobs/oxCore_3.1.7/workspace/oxLdap/src/main/java/org/gluu/site/ldap/OperationsFacade.java:685: warning: no description for @throws
	 * @throws ConnectionException
	   ^
/home/jenkins/.jenkins/jobs/oxCore_3.1.7/workspace/oxLdap/src/main/java/org/gluu/site/ldap/OperationsFacade.java:698: warning: no description for @param
   	 * @param dn
   	   ^
/home/jenkins/.jenkins/jobs/oxCore_3.1.7/workspace/oxLdap/src/main/java/org/gluu/site/ldap/OperationsFacade.java:699: warning: no description for @throws
   	 * @throws ConnectionException
   	   ^
/home/jenkins/.jenkins/jobs/oxCore_3.1.7/workspace/oxLdap/src/main/java/org/gluu/site/ldap/exception/ConnectionException.java:52: error: @param name not found
	 * @param e
	          ^
/home/jenkins/.jenkins/jobs/oxCore_3.1.7/workspace/oxLdap/src/main/java/org/gluu/site/ldap/exception/ConnectionException.java:55: warning: no @param for root
	public ConnectionException(final String msg, final Throwable root) {
	       ^
/home/jenkins/.jenkins/jobs/oxCore_3.1.7/workspace/oxLdap/src/main/java/org/gluu/site/ldap/exception/ConnectionException.java:40: error: @param name not found
	 * @param e
	          ^
/home/jenkins/.jenkins/jobs/oxCore_3.1.7/workspace/oxLdap/src/main/java/org/gluu/site/ldap/exception/ConnectionException.java:43: warning: no @param for root
	public ConnectionException(final Throwable root) {
	       ^
/home/jenkins/.jenkins/jobs/oxCore_3.1.7/workspace/oxLdap/src/main/java/org/gluu/site/ldap/persistence/property/PropertyAccessor.java:19: warning: no @param for theClass
	public Getter getGetter(Class<?> theClass, String propertyName) throws PropertyNotFoundException;
	              ^
/home/jenkins/.jenkins/jobs/oxCore_3.1.7/workspace/oxLdap/src/main/java/org/gluu/site/ldap/persistence/property/PropertyAccessor.java:19: warning: no @param for propertyName
	public Getter getGetter(Class<?> theClass, String propertyName) throws PropertyNotFoundException;
	              ^
/home/jenkins/.jenkins/jobs/oxCore_3.1.7/workspace/oxLdap/src/main/java/org/gluu/site/ldap/persistence/property/PropertyAccessor.java:19: warning: no @return
	public Getter getGetter(Class<?> theClass, String propertyName) throws PropertyNotFoundException;
	              ^
/home/jenkins/.jenkins/jobs/oxCore_3.1.7/workspace/oxLdap/src/main/java/org/gluu/site/ldap/persistence/property/PropertyAccessor.java:24: warning: no @param for theClass
	public Setter getSetter(Class<?> theClass, String propertyName) throws PropertyNotFoundException;
	              ^
/home/jenkins/.jenkins/jobs/oxCore_3.1.7/workspace/oxLdap/src/main/java/org/gluu/site/ldap/persistence/property/PropertyAccessor.java:24: warning: no @param for propertyName
	public Setter getSetter(Class<?> theClass, String propertyName) throws PropertyNotFoundException;
	              ^
/home/jenkins/.jenkins/jobs/oxCore_3.1.7/workspace/oxLdap/src/main/java/org/gluu/site/ldap/persistence/property/PropertyAccessor.java:24: warning: no @return
	public Setter getSetter(Class<?> theClass, String propertyName) throws PropertyNotFoundException;
	              ^
/home/jenkins/.jenkins/jobs/oxCore_3.1.7/workspace/oxLdap/src/main/java/org/gluu/site/ldap/persistence/property/Getter.java:24: warning: no description for @throws
	 * @throws LdapMappingException
	   ^
/home/jenkins/.jenkins/jobs/oxCore_3.1.7/workspace/oxLdap/src/main/java/org/gluu/site/ldap/persistence/property/Getter.java:31: warning: no @return
	public Class<?> getReturnType();
	                ^
/home/jenkins/.jenkins/jobs/oxCore_3.1.7/workspace/oxLdap/src/main/java/org/gluu/site/ldap/persistence/property/Getter.java:36: warning: no @return
	public String getMethodName();
	              ^
/home/jenkins/.jenkins/jobs/oxCore_3.1.7/workspace/oxLdap/src/main/java/org/gluu/site/ldap/persistence/property/Getter.java:41: warning: no @return
	public Method getMethod();
	              ^
/home/jenkins/.jenkins/jobs/oxCore_3.1.7/workspace/oxLdap/src/main/java/org/gluu/site/ldap/persistence/property/Setter.java:25: warning: no description for @throws
	 * @throws LdapMappingException
	   ^
/home/jenkins/.jenkins/jobs/oxCore_3.1.7/workspace/oxLdap/src/main/java/org/gluu/site/ldap/persistence/property/Setter.java:32: warning: no @return
	public String getMethodName();
	              ^
/home/jenkins/.jenkins/jobs/oxCore_3.1.7/workspace/oxLdap/src/main/java/org/gluu/site/ldap/persistence/property/Setter.java:37: warning: no @return
	public Method getMethod();
	              ^
/home/jenkins/.jenkins/jobs/oxCore_3.1.7/workspace/oxLdap/src/main/java/org/gluu/site/ldap/persistence/property/PropertyAnnotationResolver.java:25: warning: no @param for theClass
	public List<Annotation> getClassAnnotations(Class<?> theClass, Class<?>... allowedAnnotations);
	                        ^
/home/jenkins/.jenkins/jobs/oxCore_3.1.7/workspace/oxLdap/src/main/java/org/gluu/site/ldap/persistence/property/PropertyAnnotationResolver.java:25: warning: no @param for allowedAnnotations
	public List<Annotation> getClassAnnotations(Class<?> theClass, Class<?>... allowedAnnotations);
	                        ^
/home/jenkins/.jenkins/jobs/oxCore_3.1.7/workspace/oxLdap/src/main/java/org/gluu/site/ldap/persistence/property/PropertyAnnotationResolver.java:25: warning: no @return
	public List<Annotation> getClassAnnotations(Class<?> theClass, Class<?>... allowedAnnotations);
	                        ^
/home/jenkins/.jenkins/jobs/oxCore_3.1.7/workspace/oxLdap/src/main/java/org/gluu/site/ldap/persistence/property/PropertyAnnotationResolver.java:30: warning: no @param for theClass
	public List<Annotation> getPropertyAnnotations(Class<?> theClass, String propertyName, Class<?>... allowedAnnotations)
	                        ^
/home/jenkins/.jenkins/jobs/oxCore_3.1.7/workspace/oxLdap/src/main/java/org/gluu/site/ldap/persistence/property/PropertyAnnotationResolver.java:30: warning: no @param for propertyName
	public List<Annotation> getPropertyAnnotations(Class<?> theClass, String propertyName, Class<?>... allowedAnnotations)
	                        ^
/home/jenkins/.jenkins/jobs/oxCore_3.1.7/workspace/oxLdap/src/main/java/org/gluu/site/ldap/persistence/property/PropertyAnnotationResolver.java:30: warning: no @param for allowedAnnotations
	public List<Annotation> getPropertyAnnotations(Class<?> theClass, String propertyName, Class<?>... allowedAnnotations)
	                        ^
/home/jenkins/.jenkins/jobs/oxCore_3.1.7/workspace/oxLdap/src/main/java/org/gluu/site/ldap/persistence/property/PropertyAnnotationResolver.java:30: warning: no @return
	public List<Annotation> getPropertyAnnotations(Class<?> theClass, String propertyName, Class<?>... allowedAnnotations)
	                        ^
/home/jenkins/.jenkins/jobs/oxCore_3.1.7/workspace/oxLdap/src/main/java/org/gluu/site/ldap/persistence/property/PropertyAnnotationResolver.java:36: warning: no @param for theClass
	public Map<String, List<Annotation>> getPropertiesAnnotations(Class<?> theClass, Class<?>... allowedAnnotations);
	                                     ^
/home/jenkins/.jenkins/jobs/oxCore_3.1.7/workspace/oxLdap/src/main/java/org/gluu/site/ldap/persistence/property/PropertyAnnotationResolver.java:36: warning: no @param for allowedAnnotations
	public Map<String, List<Annotation>> getPropertiesAnnotations(Class<?> theClass, Class<?>... allowedAnnotations);
	                                     ^
/home/jenkins/.jenkins/jobs/oxCore_3.1.7/workspace/oxLdap/src/main/java/org/gluu/site/ldap/persistence/property/PropertyAnnotationResolver.java:36: warning: no @return
	public Map<String, List<Annotation>> getPropertiesAnnotations(Class<?> theClass, Class<?>... allowedAnnotations);
	                                     ^
/home/jenkins/.jenkins/jobs/oxCore_3.1.7/workspace/oxLdap/src/main/java/org/gluu/site/ldap/persistence/util/ReflectHelper.java:152: error: self-closing element not allowed
	 * <p/>
	   ^
/home/jenkins/.jenkins/jobs/oxCore_3.1.7/workspace/oxLdap/src/main/java/org/gluu/site/ldap/persistence/util/ReflectHelper.java:179: error: self-closing element not allowed
	 * <p/>
	   ^
/home/jenkins/.jenkins/jobs/oxCore_3.1.7/workspace/oxLdap/src/main/java/org/gluu/site/ldap/persistence/util/ReflectHelper.java:203: error: self-closing element not allowed
	 * <p/>
	   ^
/home/jenkins/.jenkins/jobs/oxCore_3.1.7/workspace/oxLdap/src/main/java/org/gluu/site/ldap/persistence/util/ReflectHelper.java:314: warning: no @param for <T>
	public static <T> Constructor<T> getDefaultConstructor(Class<T> clazz) throws PropertyNotFoundException {
	                                 ^

Command line was: /opt/java/jdk1.8.0_221/jre/../bin/javadoc @options @packages

Refer to the generated Javadoc files in '/home/jenkins/.jenkins/jobs/oxCore_3.1.7/workspace/oxLdap/target/site/apidocs' dir.

org.apache.maven.reporting.MavenReportException: 
Exit code: 1 - /home/jenkins/.jenkins/jobs/oxCore_3.1.7/workspace/oxLdap/src/main/java/org/gluu/site/ldap/LDAPConnectionProvider.java:91: warning: no description for @throws
	 * @throws NumberFormatException
	   ^
/home/jenkins/.jenkins/jobs/oxCore_3.1.7/workspace/oxLdap/src/main/java/org/gluu/site/ldap/LDAPConnectionProvider.java:92: warning: no description for @throws
	 * @throws LDAPException
	   ^
/home/jenkins/.jenkins/jobs/oxCore_3.1.7/workspace/oxLdap/src/main/java/org/gluu/site/ldap/LDAPConnectionProvider.java:93: warning: no description for @throws
	 * @throws GeneralSecurityException
	   ^
/home/jenkins/.jenkins/jobs/oxCore_3.1.7/workspace/oxLdap/src/main/java/org/gluu/site/ldap/LDAPConnectionProvider.java:94: error: exception not thrown: org.xdi.util.security.StringEncrypter.EncryptionException
	 * @throws EncryptionException
	           ^
/home/jenkins/.jenkins/jobs/oxCore_3.1.7/workspace/oxLdap/src/main/java/org/gluu/site/ldap/LDAPConnectionProvider.java:94: warning: no description for @throws
	 * @throws EncryptionException
	   ^
/home/jenkins/.jenkins/jobs/oxCore_3.1.7/workspace/oxLdap/src/main/java/org/gluu/site/ldap/LDAPConnectionProvider.java:95: error: exception not thrown: org.xdi.util.security.StringEncrypter.EncryptionException
	 * @throws EncryptionException
	           ^
/home/jenkins/.jenkins/jobs/oxCore_3.1.7/workspace/oxLdap/src/main/java/org/gluu/site/ldap/LDAPConnectionProvider.java:95: warning: no description for @throws
	 * @throws EncryptionException
	   ^
/home/jenkins/.jenkins/jobs/oxCore_3.1.7/workspace/oxLdap/src/main/java/org/gluu/site/ldap/LDAPConnectionProvider.java:97: warning: no @param for props
	public void init(Properties props) throws NumberFormatException, LDAPException, GeneralSecurityException {
	            ^
/home/jenkins/.jenkins/jobs/oxCore_3.1.7/workspace/oxLdap/src/main/java/org/gluu/site/ldap/LDAPConnectionProvider.java:392: warning: no description for @throws
	 * @throws LDAPException
	   ^
/home/jenkins/.jenkins/jobs/oxCore_3.1.7/workspace/oxLdap/src/main/java/org/gluu/site/ldap/LDAPConnectionProvider.java:409: warning: no description for @param
	 * @param connection
	   ^
/home/jenkins/.jenkins/jobs/oxCore_3.1.7/workspace/oxLdap/src/main/java/org/gluu/site/ldap/LDAPConnectionProvider.java:418: warning: no description for @param
	 * @param connection
	   ^
/home/jenkins/.jenkins/jobs/oxCore_3.1.7/workspace/oxLdap/src/main/java/org/gluu/site/ldap/LDAPConnectionProvider.java:430: warning: no description for @param
	 * @param connection
	   ^
/home/jenkins/.jenkins/jobs/oxCore_3.1.7/workspace/oxLdap/src/main/java/org/gluu/site/ldap/OperationsFacade.java:139: warning: no description for @param
	 * @param userName
	   ^
/home/jenkins/.jenkins/jobs/oxCore_3.1.7/workspace/oxLdap/src/main/java/org/gluu/site/ldap/OperationsFacade.java:140: warning: no description for @param
	 * @param password
	   ^
/home/jenkins/.jenkins/jobs/oxCore_3.1.7/workspace/oxLdap/src/main/java/org/gluu/site/ldap/OperationsFacade.java:141: warning: no description for @return
	 * @return
	   ^
/home/jenkins/.jenkins/jobs/oxCore_3.1.7/workspace/oxLdap/src/main/java/org/gluu/site/ldap/OperationsFacade.java:142: warning: no description for @throws
	 * @throws ConnectionException
	   ^
/home/jenkins/.jenkins/jobs/oxCore_3.1.7/workspace/oxLdap/src/main/java/org/gluu/site/ldap/OperationsFacade.java:143: warning: no description for @throws
	 * @throws ConnectionException
	   ^
/home/jenkins/.jenkins/jobs/oxCore_3.1.7/workspace/oxLdap/src/main/java/org/gluu/site/ldap/OperationsFacade.java:144: error: exception not thrown: com.unboundid.ldap.sdk.LDAPException
	 * @throws LDAPException
	           ^
/home/jenkins/.jenkins/jobs/oxCore_3.1.7/workspace/oxLdap/src/main/java/org/gluu/site/ldap/OperationsFacade.java:144: warning: no description for @throws
	 * @throws LDAPException
	   ^
/home/jenkins/.jenkins/jobs/oxCore_3.1.7/workspace/oxLdap/src/main/java/org/gluu/site/ldap/OperationsFacade.java:146: warning: no @param for baseDN
	public boolean authenticate(final String userName, final String password, final String baseDN) throws ConnectionException {
	               ^
/home/jenkins/.jenkins/jobs/oxCore_3.1.7/workspace/oxLdap/src/main/java/org/gluu/site/ldap/OperationsFacade.java:217: warning: no @param for uid
	protected String lookupDnByUid(String uid, String baseDN) throws LDAPSearchException {
	                 ^
/home/jenkins/.jenkins/jobs/oxCore_3.1.7/workspace/oxLdap/src/main/java/org/gluu/site/ldap/OperationsFacade.java:217: warning: no @param for baseDN
	protected String lookupDnByUid(String uid, String baseDN) throws LDAPSearchException {
	                 ^
/home/jenkins/.jenkins/jobs/oxCore_3.1.7/workspace/oxLdap/src/main/java/org/gluu/site/ldap/OperationsFacade.java:217: warning: no @return
	protected String lookupDnByUid(String uid, String baseDN) throws LDAPSearchException {
	                 ^
/home/jenkins/.jenkins/jobs/oxCore_3.1.7/workspace/oxLdap/src/main/java/org/gluu/site/ldap/OperationsFacade.java:217: warning: no @throws for com.unboundid.ldap.sdk.LDAPSearchException
	protected String lookupDnByUid(String uid, String baseDN) throws LDAPSearchException {
	                 ^
/home/jenkins/.jenkins/jobs/oxCore_3.1.7/workspace/oxLdap/src/main/java/org/gluu/site/ldap/OperationsFacade.java:546: warning: no description for @param
	 * @param dn
	   ^
/home/jenkins/.jenkins/jobs/oxCore_3.1.7/workspace/oxLdap/src/main/java/org/gluu/site/ldap/OperationsFacade.java:548: warning: no description for @throws
	 * @throws ConnectionException
	   ^
/home/jenkins/.jenkins/jobs/oxCore_3.1.7/workspace/oxLdap/src/main/java/org/gluu/site/ldap/OperationsFacade.java:557: warning: no description for @param
	 * @param dn
	   ^
/home/jenkins/.jenkins/jobs/oxCore_3.1.7/workspace/oxLdap/src/main/java/org/gluu/site/ldap/OperationsFacade.java:558: warning: no description for @param
	 * @param attributes
	   ^
/home/jenkins/.jenkins/jobs/oxCore_3.1.7/workspace/oxLdap/src/main/java/org/gluu/site/ldap/OperationsFacade.java:560: warning: no description for @throws
	 * @throws ConnectionException
	   ^
/home/jenkins/.jenkins/jobs/oxCore_3.1.7/workspace/oxLdap/src/main/java/org/gluu/site/ldap/OperationsFacade.java:586: warning: no description for @throws
	 * @throws DuplicateEntryException
	   ^
/home/jenkins/.jenkins/jobs/oxCore_3.1.7/workspace/oxLdap/src/main/java/org/gluu/site/ldap/OperationsFacade.java:587: warning: no description for @throws
	 * @throws ConnectionException
	   ^
/home/jenkins/.jenkins/jobs/oxCore_3.1.7/workspace/oxLdap/src/main/java/org/gluu/site/ldap/OperationsFacade.java:588: warning: no description for @throws
	 * @throws DuplicateEntryException
	   ^
/home/jenkins/.jenkins/jobs/oxCore_3.1.7/workspace/oxLdap/src/main/java/org/gluu/site/ldap/OperationsFacade.java:589: warning: no description for @throws
	 * @throws ConnectionException
	   ^
/home/jenkins/.jenkins/jobs/oxCore_3.1.7/workspace/oxLdap/src/main/java/org/gluu/site/ldap/OperationsFacade.java:590: error: exception not thrown: com.unboundid.ldap.sdk.LDAPException
	 * @throws LDAPException
	           ^
/home/jenkins/.jenkins/jobs/oxCore_3.1.7/workspace/oxLdap/src/main/java/org/gluu/site/ldap/OperationsFacade.java:590: warning: no description for @throws
	 * @throws LDAPException
	   ^
/home/jenkins/.jenkins/jobs/oxCore_3.1.7/workspace/oxLdap/src/main/java/org/gluu/site/ldap/OperationsFacade.java:621: warning: no description for @param
	 * @param dn
	   ^
/home/jenkins/.jenkins/jobs/oxCore_3.1.7/workspace/oxLdap/src/main/java/org/gluu/site/ldap/OperationsFacade.java:622: warning: no description for @param
	 * @param attrs
	   ^
/home/jenkins/.jenkins/jobs/oxCore_3.1.7/workspace/oxLdap/src/main/java/org/gluu/site/ldap/OperationsFacade.java:623: warning: no description for @return
	 * @return
	   ^
/home/jenkins/.jenkins/jobs/oxCore_3.1.7/workspace/oxLdap/src/main/java/org/gluu/site/ldap/OperationsFacade.java:624: warning: no description for @throws
	 * @throws ConnectionException 
	   ^
/home/jenkins/.jenkins/jobs/oxCore_3.1.7/workspace/oxLdap/src/main/java/org/gluu/site/ldap/OperationsFacade.java:625: warning: no description for @throws
	 * @throws DuplicateEntryException 
	   ^
/home/jenkins/.jenkins/jobs/oxCore_3.1.7/workspace/oxLdap/src/main/java/org/gluu/site/ldap/OperationsFacade.java:655: warning: no description for @param
	 * @param modifyRequest
	   ^
/home/jenkins/.jenkins/jobs/oxCore_3.1.7/workspace/oxLdap/src/main/java/org/gluu/site/ldap/OperationsFacade.java:657: warning: no description for @throws
	 * @throws DuplicateEntryException 
	   ^
/home/jenkins/.jenkins/jobs/oxCore_3.1.7/workspace/oxLdap/src/main/java/org/gluu/site/ldap/OperationsFacade.java:658: warning: no description for @throws
	 * @throws ConnectionException 
	   ^
/home/jenkins/.jenkins/jobs/oxCore_3.1.7/workspace/oxLdap/src/main/java/org/gluu/site/ldap/OperationsFacade.java:684: warning: no description for @param
	 * @param dn
	   ^
/home/jenkins/.jenkins/jobs/oxCore_3.1.7/workspace/oxLdap/src/main/java/org/gluu/site/ldap/OperationsFacade.java:685: warning: no description for @throws
	 * @throws ConnectionException
	   ^
/home/jenkins/.jenkins/jobs/oxCore_3.1.7/workspace/oxLdap/src/main/java/org/gluu/site/ldap/OperationsFacade.java:698: warning: no description for @param
   	 * @param dn
   	   ^
/home/jenkins/.jenkins/jobs/oxCore_3.1.7/workspace/oxLdap/src/main/java/org/gluu/site/ldap/OperationsFacade.java:699: warning: no description for @throws
   	 * @throws ConnectionException
   	   ^
/home/jenkins/.jenkins/jobs/oxCore_3.1.7/workspace/oxLdap/src/main/java/org/gluu/site/ldap/exception/ConnectionException.java:52: error: @param name not found
	 * @param e
	          ^
/home/jenkins/.jenkins/jobs/oxCore_3.1.7/workspace/oxLdap/src/main/java/org/gluu/site/ldap/exception/ConnectionException.java:55: warning: no @param for root
	public ConnectionException(final String msg, final Throwable root) {
	       ^
/home/jenkins/.jenkins/jobs/oxCore_3.1.7/workspace/oxLdap/src/main/java/org/gluu/site/ldap/exception/ConnectionException.java:40: error: @param name not found
	 * @param e
	          ^
/home/jenkins/.jenkins/jobs/oxCore_3.1.7/workspace/oxLdap/src/main/java/org/gluu/site/ldap/exception/ConnectionException.java:43: warning: no @param for root
	public ConnectionException(final Throwable root) {
	       ^
/home/jenkins/.jenkins/jobs/oxCore_3.1.7/workspace/oxLdap/src/main/java/org/gluu/site/ldap/persistence/property/PropertyAccessor.java:19: warning: no @param for theClass
	public Getter getGetter(Class<?> theClass, String propertyName) throws PropertyNotFoundException;
	              ^
/home/jenkins/.jenkins/jobs/oxCore_3.1.7/workspace/oxLdap/src/main/java/org/gluu/site/ldap/persistence/property/PropertyAccessor.java:19: warning: no @param for propertyName
	public Getter getGetter(Class<?> theClass, String propertyName) throws PropertyNotFoundException;
	              ^
/home/jenkins/.jenkins/jobs/oxCore_3.1.7/workspace/oxLdap/src/main/java/org/gluu/site/ldap/persistence/property/PropertyAccessor.java:19: warning: no @return
	public Getter getGetter(Class<?> theClass, String propertyName) throws PropertyNotFoundException;
	              ^
/home/jenkins/.jenkins/jobs/oxCore_3.1.7/workspace/oxLdap/src/main/java/org/gluu/site/ldap/persistence/property/PropertyAccessor.java:24: warning: no @param for theClass
	public Setter getSetter(Class<?> theClass, String propertyName) throws PropertyNotFoundException;
	              ^
/home/jenkins/.jenkins/jobs/oxCore_3.1.7/workspace/oxLdap/src/main/java/org/gluu/site/ldap/persistence/property/PropertyAccessor.java:24: warning: no @param for propertyName
	public Setter getSetter(Class<?> theClass, String propertyName) throws PropertyNotFoundException;
	              ^
/home/jenkins/.jenkins/jobs/oxCore_3.1.7/workspace/oxLdap/src/main/java/org/gluu/site/ldap/persistence/property/PropertyAccessor.java:24: warning: no @return
	public Setter getSetter(Class<?> theClass, String propertyName) throws PropertyNotFoundException;
	              ^
/home/jenkins/.jenkins/jobs/oxCore_3.1.7/workspace/oxLdap/src/main/java/org/gluu/site/ldap/persistence/property/Getter.java:24: warning: no description for @throws
	 * @throws LdapMappingException
	   ^
/home/jenkins/.jenkins/jobs/oxCore_3.1.7/workspace/oxLdap/src/main/java/org/gluu/site/ldap/persistence/property/Getter.java:31: warning: no @return
	public Class<?> getReturnType();
	                ^
/home/jenkins/.jenkins/jobs/oxCore_3.1.7/workspace/oxLdap/src/main/java/org/gluu/site/ldap/persistence/property/Getter.java:36: warning: no @return
	public String getMethodName();
	              ^
/home/jenkins/.jenkins/jobs/oxCore_3.1.7/workspace/oxLdap/src/main/java/org/gluu/site/ldap/persistence/property/Getter.java:41: warning: no @return
	public Method getMethod();
	              ^
/home/jenkins/.jenkins/jobs/oxCore_3.1.7/workspace/oxLdap/src/main/java/org/gluu/site/ldap/persistence/property/Setter.java:25: warning: no description for @throws
	 * @throws LdapMappingException
	   ^
/home/jenkins/.jenkins/jobs/oxCore_3.1.7/workspace/oxLdap/src/main/java/org/gluu/site/ldap/persistence/property/Setter.java:32: warning: no @return
	public String getMethodName();
	              ^
/home/jenkins/.jenkins/jobs/oxCore_3.1.7/workspace/oxLdap/src/main/java/org/gluu/site/ldap/persistence/property/Setter.java:37: warning: no @return
	public Method getMethod();
	              ^
/home/jenkins/.jenkins/jobs/oxCore_3.1.7/workspace/oxLdap/src/main/java/org/gluu/site/ldap/persistence/property/PropertyAnnotationResolver.java:25: warning: no @param for theClass
	public List<Annotation> getClassAnnotations(Class<?> theClass, Class<?>... allowedAnnotations);
	                        ^
/home/jenkins/.jenkins/jobs/oxCore_3.1.7/workspace/oxLdap/src/main/java/org/gluu/site/ldap/persistence/property/PropertyAnnotationResolver.java:25: warning: no @param for allowedAnnotations
	public List<Annotation> getClassAnnotations(Class<?> theClass, Class<?>... allowedAnnotations);
	                        ^
/home/jenkins/.jenkins/jobs/oxCore_3.1.7/workspace/oxLdap/src/main/java/org/gluu/site/ldap/persistence/property/PropertyAnnotationResolver.java:25: warning: no @return
	public List<Annotation> getClassAnnotations(Class<?> theClass, Class<?>... allowedAnnotations);
	                        ^
/home/jenkins/.jenkins/jobs/oxCore_3.1.7/workspace/oxLdap/src/main/java/org/gluu/site/ldap/persistence/property/PropertyAnnotationResolver.java:30: warning: no @param for theClass
	public List<Annotation> getPropertyAnnotations(Class<?> theClass, String propertyName, Class<?>... allowedAnnotations)
	                        ^
/home/jenkins/.jenkins/jobs/oxCore_3.1.7/workspace/oxLdap/src/main/java/org/gluu/site/ldap/persistence/property/PropertyAnnotationResolver.java:30: warning: no @param for propertyName
	public List<Annotation> getPropertyAnnotations(Class<?> theClass, String propertyName, Class<?>... allowedAnnotations)
	                        ^
/home/jenkins/.jenkins/jobs/oxCore_3.1.7/workspace/oxLdap/src/main/java/org/gluu/site/ldap/persistence/property/PropertyAnnotationResolver.java:30: warning: no @param for allowedAnnotations
	public List<Annotation> getPropertyAnnotations(Class<?> theClass, String propertyName, Class<?>... allowedAnnotations)
	                        ^
/home/jenkins/.jenkins/jobs/oxCore_3.1.7/workspace/oxLdap/src/main/java/org/gluu/site/ldap/persistence/property/PropertyAnnotationResolver.java:30: warning: no @return
	public List<Annotation> getPropertyAnnotations(Class<?> theClass, String propertyName, Class<?>... allowedAnnotations)
	                        ^
/home/jenkins/.jenkins/jobs/oxCore_3.1.7/workspace/oxLdap/src/main/java/org/gluu/site/ldap/persistence/property/PropertyAnnotationResolver.java:36: warning: no @param for theClass
	public Map<String, List<Annotation>> getPropertiesAnnotations(Class<?> theClass, Class<?>... allowedAnnotations);
	                                     ^
/home/jenkins/.jenkins/jobs/oxCore_3.1.7/workspace/oxLdap/src/main/java/org/gluu/site/ldap/persistence/property/PropertyAnnotationResolver.java:36: warning: no @param for allowedAnnotations
	public Map<String, List<Annotation>> getPropertiesAnnotations(Class<?> theClass, Class<?>... allowedAnnotations);
	                                     ^
/home/jenkins/.jenkins/jobs/oxCore_3.1.7/workspace/oxLdap/src/main/java/org/gluu/site/ldap/persistence/property/PropertyAnnotationResolver.java:36: warning: no @return
	public Map<String, List<Annotation>> getPropertiesAnnotations(Class<?> theClass, Class<?>... allowedAnnotations);
	                                     ^
/home/jenkins/.jenkins/jobs/oxCore_3.1.7/workspace/oxLdap/src/main/java/org/gluu/site/ldap/persistence/util/ReflectHelper.java:152: error: self-closing element not allowed
	 * <p/>
	   ^
/home/jenkins/.jenkins/jobs/oxCore_3.1.7/workspace/oxLdap/src/main/java/org/gluu/site/ldap/persistence/util/ReflectHelper.java:179: error: self-closing element not allowed
	 * <p/>
	   ^
/home/jenkins/.jenkins/jobs/oxCore_3.1.7/workspace/oxLdap/src/main/java/org/gluu/site/ldap/persistence/util/ReflectHelper.java:203: error: self-closing element not allowed
	 * <p/>
	   ^
/home/jenkins/.jenkins/jobs/oxCore_3.1.7/workspace/oxLdap/src/main/java/org/gluu/site/ldap/persistence/util/ReflectHelper.java:314: warning: no @param for <T>
	public static <T> Constructor<T> getDefaultConstructor(Class<T> clazz) throws PropertyNotFoundException {
	                                 ^

Command line was: /opt/java/jdk1.8.0_221/jre/../bin/javadoc @options @packages

Refer to the generated Javadoc files in '/home/jenkins/.jenkins/jobs/oxCore_3.1.7/workspace/oxLdap/target/site/apidocs' dir.

	at org.apache.maven.plugins.javadoc.AbstractJavadocMojo.executeJavadocCommandLine(AbstractJavadocMojo.java:5298)
	at org.apache.maven.plugins.javadoc.AbstractJavadocMojo.executeReport(AbstractJavadocMojo.java:2134)
	at org.apache.maven.plugins.javadoc.JavadocReport.generate(JavadocReport.java:134)
	at org.apache.maven.plugins.javadoc.JavadocReport.doExecute(JavadocReport.java:329)
	at org.apache.maven.plugins.javadoc.AbstractJavadocMojo.execute(AbstractJavadocMojo.java:1912)
	at org.apache.maven.plugin.DefaultBuildPluginManager.executeMojo(DefaultBuildPluginManager.java:134)
	at org.apache.maven.lifecycle.internal.MojoExecutor.execute(MojoExecutor.java:207)
	at org.apache.maven.lifecycle.internal.MojoExecutor.execute(MojoExecutor.java:153)
	at org.apache.maven.lifecycle.internal.MojoExecutor.execute(MojoExecutor.java:145)
	at org.apache.maven.lifecycle.internal.LifecycleModuleBuilder.buildProject(LifecycleModuleBuilder.java:116)
	at org.apache.maven.lifecycle.internal.LifecycleModuleBuilder.buildProject(LifecycleModuleBuilder.java:80)
	at org.apache.maven.lifecycle.internal.builder.singlethreaded.SingleThreadedBuilder.build(SingleThreadedBuilder.java:51)
	at org.apache.maven.lifecycle.internal.LifecycleStarter.execute(LifecycleStarter.java:128)
	at org.apache.maven.DefaultMaven.doExecute(DefaultMaven.java:307)
	at org.apache.maven.DefaultMaven.doExecute(DefaultMaven.java:193)
	at org.apache.maven.DefaultMaven.execute(DefaultMaven.java:106)
	at org.apache.maven.cli.MavenCli.execute(MavenCli.java:863)
	at org.apache.maven.cli.MavenCli.doMain(MavenCli.java:288)
	at org.apache.maven.cli.MavenCli.main(MavenCli.java:199)
	at sun.reflect.NativeMethodAccessorImpl.invoke0(Native Method)
	at sun.reflect.NativeMethodAccessorImpl.invoke(NativeMethodAccessorImpl.java:62)
	at sun.reflect.DelegatingMethodAccessorImpl.invoke(DelegatingMethodAccessorImpl.java:43)
	at java.lang.reflect.Method.invoke(Method.java:498)
	at org.codehaus.plexus.classworlds.launcher.Launcher.launchEnhanced(Launcher.java:289)
	at org.codehaus.plexus.classworlds.launcher.Launcher.launch(Launcher.java:229)
	at org.codehaus.plexus.classworlds.launcher.Launcher.mainWithExitCode(Launcher.java:415)
	at org.codehaus.plexus.classworlds.launcher.Launcher.main(Launcher.java:356)
[INFO] 
[INFO] --- maven-site-plugin:2.1.1:site (default-site) @ oxcore-ldap ---
[INFO]                                                                         
[INFO] ------------------------------------------------------------------------
[INFO] Building oxLdapSample 3.1.5.sp7
[INFO] ------------------------------------------------------------------------
[INFO] 
[INFO] --- maven-clean-plugin:2.4.1:clean (default-clean) @ oxcore-ldap-sample ---
[INFO] Deleting /home/jenkins/.jenkins/jobs/oxCore_3.1.7/workspace/oxLdapSample/target
[INFO] 
[INFO] --- maven-resources-plugin:2.4:resources (default-resources) @ oxcore-ldap-sample ---
[INFO] Using 'UTF-8' encoding to copy filtered resources.
[INFO] skip non existing resourceDirectory /home/jenkins/.jenkins/jobs/oxCore_3.1.7/workspace/oxLdapSample/src/main/resources
[INFO] 
[INFO] --- maven-compiler-plugin:2.3.2:compile (default-compile) @ oxcore-ldap-sample ---
[INFO] Compiling 10 source files to /home/jenkins/.jenkins/jobs/oxCore_3.1.7/workspace/oxLdapSample/target/classes
[INFO] 
[INFO] --- maven-resources-plugin:2.4:resources (default-resources) @ oxcore-ldap-sample ---
[INFO] Using 'UTF-8' encoding to copy filtered resources.
[INFO] skip non existing resourceDirectory /home/jenkins/.jenkins/jobs/oxCore_3.1.7/workspace/oxLdapSample/src/main/resources
[INFO] 
[INFO] --- maven-compiler-plugin:2.3.2:compile (default-compile) @ oxcore-ldap-sample ---
[INFO] Nothing to compile - all classes are up to date
[INFO] 
[INFO] --- maven-resources-plugin:2.4:testResources (default-testResources) @ oxcore-ldap-sample ---
[INFO] Using 'UTF-8' encoding to copy filtered resources.
[INFO] skip non existing resourceDirectory /home/jenkins/.jenkins/jobs/oxCore_3.1.7/workspace/oxLdapSample/src/test/resources
[INFO] 
[INFO] --- maven-compiler-plugin:2.3.2:testCompile (default-testCompile) @ oxcore-ldap-sample ---
[INFO] Not compiling test sources
[INFO] 
[INFO] --- maven-surefire-plugin:2.7.2:test (default-test) @ oxcore-ldap-sample ---
[INFO] Tests are skipped.
[INFO] 
[INFO] --- maven-jar-plugin:2.4:jar (default-jar) @ oxcore-ldap-sample ---
[INFO] Building jar: /home/jenkins/.jenkins/jobs/oxCore_3.1.7/workspace/oxLdapSample/target/oxcore-ldap-sample-3.1.5.sp7.jar
[INFO] 
[INFO] --- maven-install-plugin:2.3.1:install (default-install) @ oxcore-ldap-sample ---
[INFO] Installing /home/jenkins/.jenkins/jobs/oxCore_3.1.7/workspace/oxLdapSample/target/oxcore-ldap-sample-3.1.5.sp7.jar to /var/www/html/maven/org/gluu/oxcore-ldap-sample/3.1.5.sp7/oxcore-ldap-sample-3.1.5.sp7.jar
[INFO] Installing /home/jenkins/.jenkins/jobs/oxCore_3.1.7/workspace/oxLdapSample/pom.xml to /var/www/html/maven/org/gluu/oxcore-ldap-sample/3.1.5.sp7/oxcore-ldap-sample-3.1.5.sp7.pom
[INFO] 
[INFO] --- findbugs-maven-plugin:3.0.4:findbugs (default-cli) @ oxcore-ldap-sample ---
[INFO] Fork Value is true
     [java] Warnings generated: 10
[INFO] Done FindBugs Analysis....
[INFO] 
[INFO] --- maven-checkstyle-plugin:3.0.0:checkstyle (default-cli) @ oxcore-ldap-sample ---
[INFO] There are 376 errors reported by Checkstyle 6.18 with sun_checks.xml ruleset.
[WARNING] Unable to locate Source XRef to link to - DISABLED
[INFO] 
[INFO] >>> maven-javadoc-plugin:3.0.1:javadoc (default-cli) > generate-sources @ oxcore-ldap-sample >>>
[INFO] 
[INFO] <<< maven-javadoc-plugin:3.0.1:javadoc (default-cli) < generate-sources @ oxcore-ldap-sample <<<
[INFO] 
[INFO] --- maven-javadoc-plugin:3.0.1:javadoc (default-cli) @ oxcore-ldap-sample ---
[INFO] 
Loading source files for package org.gluu.ldap...
Constructing Javadoc information...
Standard Doclet version 1.8.0_221
Building tree for all the packages and classes...
Generating /home/jenkins/.jenkins/jobs/oxCore_3.1.7/workspace/oxLdapSample/target/site/apidocs/org/gluu/ldap/LdapSample.html...
Generating /home/jenkins/.jenkins/jobs/oxCore_3.1.7/workspace/oxLdapSample/target/site/apidocs/org/gluu/ldap/LdapSampleBatchJob.html...
Generating /home/jenkins/.jenkins/jobs/oxCore_3.1.7/workspace/oxLdapSample/target/site/apidocs/org/gluu/ldap/LdapSampleEntryManager.html...
Generating /home/jenkins/.jenkins/jobs/oxCore_3.1.7/workspace/oxLdapSample/target/site/apidocs/org/gluu/ldap/LdapSampleSimpleSessionSample.html...
Generating /home/jenkins/.jenkins/jobs/oxCore_3.1.7/workspace/oxLdapSample/target/site/apidocs/org/gluu/ldap/SimpleAttribute.html...
Generating /home/jenkins/.jenkins/jobs/oxCore_3.1.7/workspace/oxLdapSample/target/site/apidocs/org/gluu/ldap/SimpleGrant.html...
Generating /home/jenkins/.jenkins/jobs/oxCore_3.1.7/workspace/oxLdapSample/target/site/apidocs/org/gluu/ldap/SimpleSession.html...
Generating /home/jenkins/.jenkins/jobs/oxCore_3.1.7/workspace/oxLdapSample/target/site/apidocs/org/gluu/ldap/SimpleSessionState.html...
Generating /home/jenkins/.jenkins/jobs/oxCore_3.1.7/workspace/oxLdapSample/target/site/apidocs/org/gluu/ldap/SimpleTokenLdap.html...
Generating /home/jenkins/.jenkins/jobs/oxCore_3.1.7/workspace/oxLdapSample/target/site/apidocs/org/gluu/ldap/SimpleUser.html...
Generating /home/jenkins/.jenkins/jobs/oxCore_3.1.7/workspace/oxLdapSample/target/site/apidocs/org/gluu/ldap/package-frame.html...
Generating /home/jenkins/.jenkins/jobs/oxCore_3.1.7/workspace/oxLdapSample/target/site/apidocs/org/gluu/ldap/package-summary.html...
Generating /home/jenkins/.jenkins/jobs/oxCore_3.1.7/workspace/oxLdapSample/target/site/apidocs/org/gluu/ldap/package-tree.html...
Generating /home/jenkins/.jenkins/jobs/oxCore_3.1.7/workspace/oxLdapSample/target/site/apidocs/constant-values.html...
Generating /home/jenkins/.jenkins/jobs/oxCore_3.1.7/workspace/oxLdapSample/target/site/apidocs/serialized-form.html...
Generating /home/jenkins/.jenkins/jobs/oxCore_3.1.7/workspace/oxLdapSample/target/site/apidocs/org/gluu/ldap/class-use/SimpleUser.html...
Generating /home/jenkins/.jenkins/jobs/oxCore_3.1.7/workspace/oxLdapSample/target/site/apidocs/org/gluu/ldap/class-use/SimpleTokenLdap.html...
Generating /home/jenkins/.jenkins/jobs/oxCore_3.1.7/workspace/oxLdapSample/target/site/apidocs/org/gluu/ldap/class-use/SimpleSessionState.html...
Generating /home/jenkins/.jenkins/jobs/oxCore_3.1.7/workspace/oxLdapSample/target/site/apidocs/org/gluu/ldap/class-use/SimpleSession.html...
Generating /home/jenkins/.jenkins/jobs/oxCore_3.1.7/workspace/oxLdapSample/target/site/apidocs/org/gluu/ldap/class-use/SimpleGrant.html...
Generating /home/jenkins/.jenkins/jobs/oxCore_3.1.7/workspace/oxLdapSample/target/site/apidocs/org/gluu/ldap/class-use/SimpleAttribute.html...
Generating /home/jenkins/.jenkins/jobs/oxCore_3.1.7/workspace/oxLdapSample/target/site/apidocs/org/gluu/ldap/class-use/LdapSampleSimpleSessionSample.html...
Generating /home/jenkins/.jenkins/jobs/oxCore_3.1.7/workspace/oxLdapSample/target/site/apidocs/org/gluu/ldap/class-use/LdapSampleEntryManager.html...
Generating /home/jenkins/.jenkins/jobs/oxCore_3.1.7/workspace/oxLdapSample/target/site/apidocs/org/gluu/ldap/class-use/LdapSampleBatchJob.html...
Generating /home/jenkins/.jenkins/jobs/oxCore_3.1.7/workspace/oxLdapSample/target/site/apidocs/org/gluu/ldap/class-use/LdapSample.html...
Generating /home/jenkins/.jenkins/jobs/oxCore_3.1.7/workspace/oxLdapSample/target/site/apidocs/org/gluu/ldap/package-use.html...
Building index for all the packages and classes...
Generating /home/jenkins/.jenkins/jobs/oxCore_3.1.7/workspace/oxLdapSample/target/site/apidocs/overview-tree.html...
Generating /home/jenkins/.jenkins/jobs/oxCore_3.1.7/workspace/oxLdapSample/target/site/apidocs/index-all.html...
Generating /home/jenkins/.jenkins/jobs/oxCore_3.1.7/workspace/oxLdapSample/target/site/apidocs/deprecated-list.html...
Building index for all classes...
Generating /home/jenkins/.jenkins/jobs/oxCore_3.1.7/workspace/oxLdapSample/target/site/apidocs/allclasses-frame.html...
Generating /home/jenkins/.jenkins/jobs/oxCore_3.1.7/workspace/oxLdapSample/target/site/apidocs/allclasses-noframe.html...
Generating /home/jenkins/.jenkins/jobs/oxCore_3.1.7/workspace/oxLdapSample/target/site/apidocs/index.html...
Generating /home/jenkins/.jenkins/jobs/oxCore_3.1.7/workspace/oxLdapSample/target/site/apidocs/help-doc.html...
[INFO] 
[INFO] --- maven-site-plugin:2.1.1:site (default-site) @ oxcore-ldap-sample ---
[INFO]                                                                         
[INFO] ------------------------------------------------------------------------
[INFO] Building oxModel 3.1.5.sp7
[INFO] ------------------------------------------------------------------------
[INFO] 
[INFO] --- maven-clean-plugin:2.4.1:clean (default-clean) @ oxcore-model ---
[INFO] Deleting /home/jenkins/.jenkins/jobs/oxCore_3.1.7/workspace/oxModel/target
[INFO] 
[INFO] --- maven-resources-plugin:2.4:resources (default-resources) @ oxcore-model ---
[INFO] Using 'UTF-8' encoding to copy filtered resources.
[INFO] skip non existing resourceDirectory /home/jenkins/.jenkins/jobs/oxCore_3.1.7/workspace/oxModel/src/main/resources
[INFO] 
[INFO] --- maven-compiler-plugin:2.3.2:compile (default-compile) @ oxcore-model ---
[INFO] Compiling 11 source files to /home/jenkins/.jenkins/jobs/oxCore_3.1.7/workspace/oxModel/target/classes
[INFO] 
[INFO] --- maven-resources-plugin:2.4:resources (default-resources) @ oxcore-model ---
[INFO] Using 'UTF-8' encoding to copy filtered resources.
[INFO] skip non existing resourceDirectory /home/jenkins/.jenkins/jobs/oxCore_3.1.7/workspace/oxModel/src/main/resources
[INFO] 
[INFO] --- maven-compiler-plugin:2.3.2:compile (default-compile) @ oxcore-model ---
[INFO] Nothing to compile - all classes are up to date
[INFO] 
[INFO] --- maven-resources-plugin:2.4:testResources (default-testResources) @ oxcore-model ---
[INFO] Using 'UTF-8' encoding to copy filtered resources.
[INFO] skip non existing resourceDirectory /home/jenkins/.jenkins/jobs/oxCore_3.1.7/workspace/oxModel/src/test/resources
[INFO] 
[INFO] --- maven-compiler-plugin:2.3.2:testCompile (default-testCompile) @ oxcore-model ---
[INFO] Not compiling test sources
[INFO] 
[INFO] --- maven-surefire-plugin:2.7.2:test (default-test) @ oxcore-model ---
[INFO] Tests are skipped.
[INFO] 
[INFO] --- maven-jar-plugin:2.4:jar (default-jar) @ oxcore-model ---
[INFO] Building jar: /home/jenkins/.jenkins/jobs/oxCore_3.1.7/workspace/oxModel/target/oxcore-model-3.1.5.sp7.jar
[INFO] 
[INFO] --- maven-install-plugin:2.3.1:install (default-install) @ oxcore-model ---
[INFO] Installing /home/jenkins/.jenkins/jobs/oxCore_3.1.7/workspace/oxModel/target/oxcore-model-3.1.5.sp7.jar to /var/www/html/maven/org/xdi/oxcore-model/3.1.5.sp7/oxcore-model-3.1.5.sp7.jar
[INFO] Installing /home/jenkins/.jenkins/jobs/oxCore_3.1.7/workspace/oxModel/pom.xml to /var/www/html/maven/org/xdi/oxcore-model/3.1.5.sp7/oxcore-model-3.1.5.sp7.pom
[INFO] 
[INFO] --- findbugs-maven-plugin:3.0.4:findbugs (default-cli) @ oxcore-model ---
[INFO] Fork Value is true
     [java] Warnings generated: 10
[INFO] Done FindBugs Analysis....
[INFO] 
[INFO] --- maven-checkstyle-plugin:3.0.0:checkstyle (default-cli) @ oxcore-model ---
[INFO] There are 465 errors reported by Checkstyle 6.18 with sun_checks.xml ruleset.
[WARNING] Unable to locate Source XRef to link to - DISABLED
[INFO] 
[INFO] >>> maven-javadoc-plugin:3.0.1:javadoc (default-cli) > generate-sources @ oxcore-model >>>
[INFO] 
[INFO] <<< maven-javadoc-plugin:3.0.1:javadoc (default-cli) < generate-sources @ oxcore-model <<<
[INFO] 
[INFO] --- maven-javadoc-plugin:3.0.1:javadoc (default-cli) @ oxcore-model ---
[INFO] 
Loading source files for package org.xdi.model...
Loading source files for package org.xdi.model.metric...
Loading source files for package org.xdi.model.metric.counter...
Loading source files for package org.xdi.model.metric.ldap...
Loading source files for package org.xdi.model.metric.timer...
Loading source files for package org.xdi.model.uma...
Constructing Javadoc information...
Standard Doclet version 1.8.0_221
Building tree for all the packages and classes...
Generating /home/jenkins/.jenkins/jobs/oxCore_3.1.7/workspace/oxModel/target/site/apidocs/org/xdi/model/ApplicationType.html...
Generating /home/jenkins/.jenkins/jobs/oxCore_3.1.7/workspace/oxModel/target/site/apidocs/org/xdi/model/metric/MetricData.html...
Generating /home/jenkins/.jenkins/jobs/oxCore_3.1.7/workspace/oxModel/target/site/apidocs/org/xdi/model/metric/MetricType.html...
Generating /home/jenkins/.jenkins/jobs/oxCore_3.1.7/workspace/oxModel/target/site/apidocs/org/xdi/model/metric/counter/CounterMetricData.html...
Generating /home/jenkins/.jenkins/jobs/oxCore_3.1.7/workspace/oxModel/target/site/apidocs/org/xdi/model/metric/counter/CounterMetricEntry.html...
Generating /home/jenkins/.jenkins/jobs/oxCore_3.1.7/workspace/oxModel/target/site/apidocs/org/xdi/model/metric/ldap/MetricEntry.html...
Generating /home/jenkins/.jenkins/jobs/oxCore_3.1.7/workspace/oxModel/target/site/apidocs/org/xdi/model/metric/ldap/MetricReport.html...
Generating /home/jenkins/.jenkins/jobs/oxCore_3.1.7/workspace/oxModel/target/site/apidocs/org/xdi/model/metric/timer/TimerMetricData.html...
Generating /home/jenkins/.jenkins/jobs/oxCore_3.1.7/workspace/oxModel/target/site/apidocs/org/xdi/model/metric/timer/TimerMetricEntry.html...
Generating /home/jenkins/.jenkins/jobs/oxCore_3.1.7/workspace/oxModel/target/site/apidocs/org/xdi/model/uma/ClaimDefinition.html...
Generating /home/jenkins/.jenkins/jobs/oxCore_3.1.7/workspace/oxModel/target/site/apidocs/org/xdi/model/uma/ClaimDefinitionList.html...
Generating /home/jenkins/.jenkins/jobs/oxCore_3.1.7/workspace/oxModel/target/site/apidocs/overview-frame.html...
Generating /home/jenkins/.jenkins/jobs/oxCore_3.1.7/workspace/oxModel/target/site/apidocs/org/xdi/model/package-frame.html...
Generating /home/jenkins/.jenkins/jobs/oxCore_3.1.7/workspace/oxModel/target/site/apidocs/org/xdi/model/package-summary.html...
Generating /home/jenkins/.jenkins/jobs/oxCore_3.1.7/workspace/oxModel/target/site/apidocs/org/xdi/model/package-tree.html...
Generating /home/jenkins/.jenkins/jobs/oxCore_3.1.7/workspace/oxModel/target/site/apidocs/org/xdi/model/metric/package-frame.html...
Generating /home/jenkins/.jenkins/jobs/oxCore_3.1.7/workspace/oxModel/target/site/apidocs/org/xdi/model/metric/package-summary.html...
Generating /home/jenkins/.jenkins/jobs/oxCore_3.1.7/workspace/oxModel/target/site/apidocs/org/xdi/model/metric/package-tree.html...
Generating /home/jenkins/.jenkins/jobs/oxCore_3.1.7/workspace/oxModel/target/site/apidocs/org/xdi/model/metric/counter/package-frame.html...
Generating /home/jenkins/.jenkins/jobs/oxCore_3.1.7/workspace/oxModel/target/site/apidocs/org/xdi/model/metric/counter/package-summary.html...
Generating /home/jenkins/.jenkins/jobs/oxCore_3.1.7/workspace/oxModel/target/site/apidocs/org/xdi/model/metric/counter/package-tree.html...
Generating /home/jenkins/.jenkins/jobs/oxCore_3.1.7/workspace/oxModel/target/site/apidocs/org/xdi/model/metric/ldap/package-frame.html...
Generating /home/jenkins/.jenkins/jobs/oxCore_3.1.7/workspace/oxModel/target/site/apidocs/org/xdi/model/metric/ldap/package-summary.html...
Generating /home/jenkins/.jenkins/jobs/oxCore_3.1.7/workspace/oxModel/target/site/apidocs/org/xdi/model/metric/ldap/package-tree.html...
Generating /home/jenkins/.jenkins/jobs/oxCore_3.1.7/workspace/oxModel/target/site/apidocs/org/xdi/model/metric/timer/package-frame.html...
Generating /home/jenkins/.jenkins/jobs/oxCore_3.1.7/workspace/oxModel/target/site/apidocs/org/xdi/model/metric/timer/package-summary.html...
Generating /home/jenkins/.jenkins/jobs/oxCore_3.1.7/workspace/oxModel/target/site/apidocs/org/xdi/model/metric/timer/package-tree.html...
Generating /home/jenkins/.jenkins/jobs/oxCore_3.1.7/workspace/oxModel/target/site/apidocs/org/xdi/model/uma/package-frame.html...
Generating /home/jenkins/.jenkins/jobs/oxCore_3.1.7/workspace/oxModel/target/site/apidocs/org/xdi/model/uma/package-summary.html...
Generating /home/jenkins/.jenkins/jobs/oxCore_3.1.7/workspace/oxModel/target/site/apidocs/org/xdi/model/uma/package-tree.html...
Generating /home/jenkins/.jenkins/jobs/oxCore_3.1.7/workspace/oxModel/target/site/apidocs/constant-values.html...
Generating /home/jenkins/.jenkins/jobs/oxCore_3.1.7/workspace/oxModel/target/site/apidocs/serialized-form.html...
Generating /home/jenkins/.jenkins/jobs/oxCore_3.1.7/workspace/oxModel/target/site/apidocs/org/xdi/model/class-use/ApplicationType.html...
Generating /home/jenkins/.jenkins/jobs/oxCore_3.1.7/workspace/oxModel/target/site/apidocs/org/xdi/model/metric/class-use/MetricType.html...
Generating /home/jenkins/.jenkins/jobs/oxCore_3.1.7/workspace/oxModel/target/site/apidocs/org/xdi/model/metric/class-use/MetricData.html...
Generating /home/jenkins/.jenkins/jobs/oxCore_3.1.7/workspace/oxModel/target/site/apidocs/org/xdi/model/metric/counter/class-use/CounterMetricEntry.html...
Generating /home/jenkins/.jenkins/jobs/oxCore_3.1.7/workspace/oxModel/target/site/apidocs/org/xdi/model/metric/counter/class-use/CounterMetricData.html...
Generating /home/jenkins/.jenkins/jobs/oxCore_3.1.7/workspace/oxModel/target/site/apidocs/org/xdi/model/metric/ldap/class-use/MetricReport.html...
Generating /home/jenkins/.jenkins/jobs/oxCore_3.1.7/workspace/oxModel/target/site/apidocs/org/xdi/model/metric/ldap/class-use/MetricEntry.html...
Generating /home/jenkins/.jenkins/jobs/oxCore_3.1.7/workspace/oxModel/target/site/apidocs/org/xdi/model/metric/timer/class-use/TimerMetricEntry.html...
Generating /home/jenkins/.jenkins/jobs/oxCore_3.1.7/workspace/oxModel/target/site/apidocs/org/xdi/model/metric/timer/class-use/TimerMetricData.html...
Generating /home/jenkins/.jenkins/jobs/oxCore_3.1.7/workspace/oxModel/target/site/apidocs/org/xdi/model/uma/class-use/ClaimDefinitionList.html...
Generating /home/jenkins/.jenkins/jobs/oxCore_3.1.7/workspace/oxModel/target/site/apidocs/org/xdi/model/uma/class-use/ClaimDefinition.html...
Generating /home/jenkins/.jenkins/jobs/oxCore_3.1.7/workspace/oxModel/target/site/apidocs/org/xdi/model/package-use.html...
Generating /home/jenkins/.jenkins/jobs/oxCore_3.1.7/workspace/oxModel/target/site/apidocs/org/xdi/model/metric/package-use.html...
Generating /home/jenkins/.jenkins/jobs/oxCore_3.1.7/workspace/oxModel/target/site/apidocs/org/xdi/model/metric/counter/package-use.html...
Generating /home/jenkins/.jenkins/jobs/oxCore_3.1.7/workspace/oxModel/target/site/apidocs/org/xdi/model/metric/ldap/package-use.html...
Generating /home/jenkins/.jenkins/jobs/oxCore_3.1.7/workspace/oxModel/target/site/apidocs/org/xdi/model/metric/timer/package-use.html...
Generating /home/jenkins/.jenkins/jobs/oxCore_3.1.7/workspace/oxModel/target/site/apidocs/org/xdi/model/uma/package-use.html...
Building index for all the packages and classes...
Generating /home/jenkins/.jenkins/jobs/oxCore_3.1.7/workspace/oxModel/target/site/apidocs/overview-tree.html...
Generating /home/jenkins/.jenkins/jobs/oxCore_3.1.7/workspace/oxModel/target/site/apidocs/index-all.html...
Generating /home/jenkins/.jenkins/jobs/oxCore_3.1.7/workspace/oxModel/target/site/apidocs/deprecated-list.html...
Building index for all classes...
Generating /home/jenkins/.jenkins/jobs/oxCore_3.1.7/workspace/oxModel/target/site/apidocs/allclasses-frame.html...
Generating /home/jenkins/.jenkins/jobs/oxCore_3.1.7/workspace/oxModel/target/site/apidocs/allclasses-noframe.html...
Generating /home/jenkins/.jenkins/jobs/oxCore_3.1.7/workspace/oxModel/target/site/apidocs/index.html...
Generating /home/jenkins/.jenkins/jobs/oxCore_3.1.7/workspace/oxModel/target/site/apidocs/overview-summary.html...
Generating /home/jenkins/.jenkins/jobs/oxCore_3.1.7/workspace/oxModel/target/site/apidocs/help-doc.html...
[INFO] 
[INFO] --- maven-site-plugin:2.1.1:site (default-site) @ oxcore-model ---
[INFO]                                                                         
[INFO] ------------------------------------------------------------------------
[INFO] Building oxSaml 3.1.5.sp7
[INFO] ------------------------------------------------------------------------
Downloading: http://repo1.maven.org/maven2/org/apache/santuario/xmlsec/2.2.1/xmlsec-2.2.1.pom

Downloading: http://repository.jboss.org/nexus/content/groups/public-jboss/org/apache/santuario/xmlsec/2.2.1/xmlsec-2.2.1.pom

Downloading: http://ox.gluu.org/maven/org/apache/santuario/xmlsec/2.2.1/xmlsec-2.2.1.pom

[INFO] ------------------------------------------------------------------------
[INFO] Reactor Summary:
[INFO] 
[INFO] oxCore ............................................. SUCCESS [  4.113 s]
[INFO] oxLdap-annotations ................................. SUCCESS [ 10.649 s]
[INFO] oxUtil ............................................. SUCCESS [ 22.802 s]
[INFO] oxLdap ............................................. SUCCESS [ 20.451 s]
[INFO] oxLdapSample ....................................... SUCCESS [ 10.098 s]
[INFO] oxModel ............................................ SUCCESS [ 11.665 s]
[INFO] oxSaml ............................................. FAILURE [  0.347 s]
[INFO] oxService .......................................... SKIPPED
[INFO] oxTomcat ........................................... SKIPPED
[INFO] oxServer ........................................... SKIPPED
[INFO] oxGwt .............................................. SKIPPED
[INFO] oxJsfUtil .......................................... SKIPPED
[INFO] ------------------------------------------------------------------------
[INFO] BUILD FAILURE
[INFO] ------------------------------------------------------------------------
[INFO] Total time: 01:21 min
[INFO] Finished at: 2020-12-26T20:40:10+00:00
[INFO] Final Memory: 87M/927M
[INFO] ------------------------------------------------------------------------
[ERROR] Failed to execute goal on project oxcore-saml: Could not resolve dependencies for project org.xdi:oxcore-saml:jar:3.1.5.sp7: Failed to collect dependencies at org.apache.santuario:xmlsec:jar:2.2.1: Failed to read artifact descriptor for org.apache.santuario:xmlsec:jar:2.2.1: Could not transfer artifact org.apache.santuario:xmlsec:pom:2.2.1 from/to central (http://repo1.maven.org/maven2): Failed to transfer file: http://repo1.maven.org/maven2/org/apache/santuario/xmlsec/2.2.1/xmlsec-2.2.1.pom. Return code is: 501 , ReasonPhrase:HTTPS Required. -> [Help 1]
[ERROR] 
[ERROR] To see the full stack trace of the errors, re-run Maven with the -e switch.
[ERROR] Re-run Maven using the -X switch to enable full debug logging.
[ERROR] 
[ERROR] For more information about the errors and possible solutions, please read the following articles:
[ERROR] [Help 1] http://cwiki.apache.org/confluence/display/MAVEN/DependencyResolutionException
[ERROR] 
[ERROR] After correcting the problems, you can resume the build with the command
[ERROR]   mvn <goals> -rf :oxcore-saml
Build step 'Invoke top-level Maven targets' marked build as failure
[FINDBUGS] Skipping publisher since build result is FAILURE
TestNG Reports Processing: START
Looking for TestNG results report in workspace using pattern: **/testng-results.xml
Did not find any matching files.
Not sending mail to unregistered user Yuriy.Movchan@gmail.com
Sending e-mails to: support@gluu.org
Finished: FAILURE