FailedConsole Output

Skipping 3 KB.. Full Log
:classifier)' must be unique: javax.annotation:javax.annotation-api:jar -> duplicate declaration of version (?) @ org.gluu:oxcore-cache:[unknown-version], /home/jenkins/.jenkins/jobs/oxCore/workspace/core-cache/pom.xml, line 113, column 15
[WARNING] 
[WARNING] It is highly recommended to fix these problems because they threaten the stability of your build.
[WARNING] 
[WARNING] For this reason, future Maven versions might no longer support building such malformed projects.
[WARNING] 
[INFO] ------------------------------------------------------------------------
[INFO] Reactor Build Order:
[INFO] 
[INFO] oxCore
[INFO] oxUtil
[INFO] oxModel
[INFO] Caches support
[INFO] Caches support
[INFO] Configuration factories for standalone applications
[INFO] oxSaml
[INFO] Reusable CDI classes which not depend on specific framework
[INFO] Reusable CDI Script implementation
[INFO] oxService
[INFO] oxJsfUtil
[INFO] Java extensions
[INFO] Weld CDI timer implementation
[INFO] Reusable CDI security extension
[INFO] Reusable CDI exception handler extension
[INFO] Web application specific classes
[INFO] oxRadius
[INFO] Demo CDI services
[INFO]                                                                         
[INFO] ------------------------------------------------------------------------
[INFO] Building oxCore 4.3.1-SNAPSHOT
[INFO] ------------------------------------------------------------------------
[INFO] 
[INFO] --- maven-clean-plugin:2.4.1:clean (default-clean) @ oxcore ---
[INFO] Deleting /home/jenkins/.jenkins/jobs/oxCore/workspace/target
[INFO] 
[INFO] --- maven-install-plugin:2.3.1:install (default-install) @ oxcore ---
[INFO] Installing /home/jenkins/.jenkins/jobs/oxCore/workspace/pom.xml to /var/www/html/maven/org/gluu/oxcore/4.3.1-SNAPSHOT/oxcore-4.3.1-SNAPSHOT.pom
[INFO] 
[INFO] >>> maven-javadoc-plugin:3.0.1:javadoc (default-cli) > generate-sources @ oxcore >>>
[INFO] 
[INFO] <<< maven-javadoc-plugin:3.0.1:javadoc (default-cli) < generate-sources @ oxcore <<<
[INFO] 
[INFO] --- maven-javadoc-plugin:3.0.1:javadoc (default-cli) @ oxcore ---
[INFO] 
[INFO] --- maven-site-plugin:2.1.1:site (default-site) @ oxcore ---
[INFO]                                                                         
[INFO] ------------------------------------------------------------------------
[INFO] Building oxUtil 4.3.1-SNAPSHOT
[INFO] ------------------------------------------------------------------------
[INFO] 
[INFO] --- maven-clean-plugin:2.4.1:clean (default-clean) @ oxcore-util ---
[INFO] Deleting /home/jenkins/.jenkins/jobs/oxCore/workspace/oxUtil/target
[INFO] 
[INFO] --- maven-resources-plugin:2.4:resources (default-resources) @ oxcore-util ---
[INFO] Using 'UTF-8' encoding to copy filtered resources.
[INFO] skip non existing resourceDirectory /home/jenkins/.jenkins/jobs/oxCore/workspace/oxUtil/src/main/resources
[INFO] 
[INFO] --- maven-compiler-plugin:2.3.2:compile (default-compile) @ oxcore-util ---
[INFO] Compiling 63 source files to /home/jenkins/.jenkins/jobs/oxCore/workspace/oxUtil/target/classes
[INFO] 
[INFO] --- maven-resources-plugin:2.4:resources (default-resources) @ oxcore-util ---
[INFO] Using 'UTF-8' encoding to copy filtered resources.
[INFO] skip non existing resourceDirectory /home/jenkins/.jenkins/jobs/oxCore/workspace/oxUtil/src/main/resources
[INFO] 
[INFO] --- maven-compiler-plugin:2.3.2:compile (default-compile) @ oxcore-util ---
[INFO] Nothing to compile - all classes are up to date
[INFO] 
[INFO] --- maven-resources-plugin:2.4:testResources (default-testResources) @ oxcore-util ---
[INFO] Using 'UTF-8' encoding to copy filtered resources.
[INFO] skip non existing resourceDirectory /home/jenkins/.jenkins/jobs/oxCore/workspace/oxUtil/src/test/resources
[INFO] 
[INFO] --- maven-compiler-plugin:2.3.2:testCompile (default-testCompile) @ oxcore-util ---
[INFO] No sources to compile
[INFO] 
[INFO] --- maven-surefire-plugin:2.7.2:test (default-test) @ oxcore-util ---
[INFO] No tests to run.
[INFO] Surefire report directory: /home/jenkins/.jenkins/jobs/oxCore/workspace/oxUtil/target/surefire-reports

-------------------------------------------------------
 T E S T S
-------------------------------------------------------
There are no tests to run.

Results :

Tests run: 0, Failures: 0, Errors: 0, Skipped: 0

[INFO] 
[INFO] --- maven-jar-plugin:2.4:jar (default-jar) @ oxcore-util ---
[INFO] Building jar: /home/jenkins/.jenkins/jobs/oxCore/workspace/oxUtil/target/oxcore-util-4.3.1-SNAPSHOT.jar
[INFO] 
[INFO] --- maven-install-plugin:2.3.1:install (default-install) @ oxcore-util ---
[INFO] Installing /home/jenkins/.jenkins/jobs/oxCore/workspace/oxUtil/target/oxcore-util-4.3.1-SNAPSHOT.jar to /var/www/html/maven/org/gluu/oxcore-util/4.3.1-SNAPSHOT/oxcore-util-4.3.1-SNAPSHOT.jar
[INFO] Installing /home/jenkins/.jenkins/jobs/oxCore/workspace/oxUtil/pom.xml to /var/www/html/maven/org/gluu/oxcore-util/4.3.1-SNAPSHOT/oxcore-util-4.3.1-SNAPSHOT.pom
[INFO] 
[INFO] >>> maven-javadoc-plugin:3.0.1:javadoc (default-cli) > generate-sources @ oxcore-util >>>
[INFO] 
[INFO] <<< maven-javadoc-plugin:3.0.1:javadoc (default-cli) < generate-sources @ oxcore-util <<<
[INFO] 
[INFO] --- maven-javadoc-plugin:3.0.1:javadoc (default-cli) @ oxcore-util ---
[INFO] 
Loading source files for package org.gluu.context...
Loading source files for package org.gluu.log...
Loading source files for package org.gluu.model.config...
Loading source files for package org.gluu.model.ldap...
Loading source files for package org.gluu.model...
Loading source files for package org.gluu.net...
Loading source files for package org.gluu.util.exception...
Loading source files for package org.gluu.util.image...
Loading source files for package org.gluu.util.init...
Loading source files for package org.gluu.util.io...
Loading source files for package org.gluu.util.process...
Loading source files for package org.gluu.util.properties...
Loading source files for package org.gluu.util.repository...
Loading source files for package org.gluu.util.security...
Loading source files for package org.gluu.util...
Loading source files for package org.gluu.util.ilocale...
Loading source files for package org.gluu.xml...
Loading source files for package org.gluu.zip...
Constructing Javadoc information...
Standard Doclet version 11.0.7
Building tree for all the packages and classes...
Generating /home/jenkins/.jenkins/jobs/oxCore/workspace/oxUtil/target/site/apidocs/org/gluu/context/J2EContext.html...
Generating /home/jenkins/.jenkins/jobs/oxCore/workspace/oxUtil/target/site/apidocs/org/gluu/context/WebContext.html...
Generating /home/jenkins/.jenkins/jobs/oxCore/workspace/oxUtil/target/site/apidocs/org/gluu/log/LoggingHelper.html...
Generating /home/jenkins/.jenkins/jobs/oxCore/workspace/oxUtil/target/site/apidocs/org/gluu/log/MacAddressLogIdConverter.html...
Generating /home/jenkins/.jenkins/jobs/oxCore/workspace/oxUtil/target/site/apidocs/org/gluu/model/AuthenticationMode.html...
Generating /home/jenkins/.jenkins/jobs/oxCore/workspace/oxUtil/target/site/apidocs/org/gluu/model/AuthenticationScriptUsageType.html...
Generating /home/jenkins/.jenkins/jobs/oxCore/workspace/oxUtil/target/site/apidocs/org/gluu/model/GluuImage.html...
Generating /home/jenkins/.jenkins/jobs/oxCore/workspace/oxUtil/target/site/apidocs/org/gluu/model/GluuIMAPData.html...
Generating /home/jenkins/.jenkins/jobs/oxCore/workspace/oxUtil/target/site/apidocs/org/gluu/model/ImapPassword.html...
Generating /home/jenkins/.jenkins/jobs/oxCore/workspace/oxUtil/target/site/apidocs/org/gluu/model/ProgrammingLanguage.html...
Generating /home/jenkins/.jenkins/jobs/oxCore/workspace/oxUtil/target/site/apidocs/org/gluu/model/ScriptLocationType.html...
Generating /home/jenkins/.jenkins/jobs/oxCore/workspace/oxUtil/target/site/apidocs/org/gluu/model/SelectableEntity.html...
Generating /home/jenkins/.jenkins/jobs/oxCore/workspace/oxUtil/target/site/apidocs/org/gluu/model/SimpleCustomProperty.html...
Generating /home/jenkins/.jenkins/jobs/oxCore/workspace/oxUtil/target/site/apidocs/org/gluu/model/SimpleExtendedCustomProperty.html...
Generating /home/jenkins/.jenkins/jobs/oxCore/workspace/oxUtil/target/site/apidocs/org/gluu/model/SimpleProperty.html...
Generating /home/jenkins/.jenkins/jobs/oxCore/workspace/oxUtil/target/site/apidocs/org/gluu/model/SmtpConfiguration.html...
Generating /home/jenkins/.jenkins/jobs/oxCore/workspace/oxUtil/target/site/apidocs/org/gluu/model/TrustContact.html...
Generating /home/jenkins/.jenkins/jobs/oxCore/workspace/oxUtil/target/site/apidocs/org/gluu/model/config/CustomAuthenticationConfiguration.html...
Generating /home/jenkins/.jenkins/jobs/oxCore/workspace/oxUtil/target/site/apidocs/org/gluu/model/ldap/GluuLdapConfiguration.html...
Generating /home/jenkins/.jenkins/jobs/oxCore/workspace/oxUtil/target/site/apidocs/org/gluu/net/InetAddressUtility.html...
Generating /home/jenkins/.jenkins/jobs/oxCore/workspace/oxUtil/target/site/apidocs/org/gluu/net/ProxyUtil.html...
Generating /home/jenkins/.jenkins/jobs/oxCore/workspace/oxUtil/target/site/apidocs/org/gluu/net/SslDefaultHttpClient.html...
Generating /home/jenkins/.jenkins/jobs/oxCore/workspace/oxUtil/target/site/apidocs/org/gluu/net/TrustAllTrustManager.html...
Generating /home/jenkins/.jenkins/jobs/oxCore/workspace/oxUtil/target/site/apidocs/org/gluu/util/ArrayHelper.html...
Generating /home/jenkins/.jenkins/jobs/oxCore/workspace/oxUtil/target/site/apidocs/org/gluu/util/AssertionHelper.html...
Generating /home/jenkins/.jenkins/jobs/oxCore/workspace/oxUtil/target/site/apidocs/org/gluu/util/EasySSLProtocolSocketFactory.html...
Generating /home/jenkins/.jenkins/jobs/oxCore/workspace/oxUtil/target/site/apidocs/org/gluu/util/EasyX509TrustManager.html...
Generating /home/jenkins/.jenkins/jobs/oxCore/workspace/oxUtil/target/site/apidocs/org/gluu/util/FileUtil.html...
Generating /home/jenkins/.jenkins/jobs/oxCore/workspace/oxUtil/target/site/apidocs/org/gluu/util/InterfaceRegistry.html...
Generating /home/jenkins/.jenkins/jobs/oxCore/workspace/oxUtil/target/site/apidocs/org/gluu/util/INumGenerator.html...
Generating /home/jenkins/.jenkins/jobs/oxCore/workspace/oxUtil/target/site/apidocs/org/gluu/util/OxConstants.html...
Generating /home/jenkins/.jenkins/jobs/oxCore/workspace/oxUtil/target/site/apidocs/org/gluu/util/Pair.html...
Generating /home/jenkins/.jenkins/jobs/oxCore/workspace/oxUtil/target/site/apidocs/org/gluu/util/PropertiesHelper.html...
Generating /home/jenkins/.jenkins/jobs/oxCore/workspace/oxUtil/target/site/apidocs/org/gluu/util/SelectableEntityHelper.html...
Generating /home/jenkins/.jenkins/jobs/oxCore/workspace/oxUtil/target/site/apidocs/org/gluu/util/StringHelper.html...
Generating /home/jenkins/.jenkins/jobs/oxCore/workspace/oxUtil/target/site/apidocs/org/gluu/util/Triple.html...
Generating /home/jenkins/.jenkins/jobs/oxCore/workspace/oxUtil/target/site/apidocs/org/gluu/util/Util.html...
Generating /home/jenkins/.jenkins/jobs/oxCore/workspace/oxUtil/target/site/apidocs/org/gluu/util/exception/ConfigurationException.html...
Generating /home/jenkins/.jenkins/jobs/oxCore/workspace/oxUtil/target/site/apidocs/org/gluu/util/exception/InvalidAttributeException.html...
Generating /home/jenkins/.jenkins/jobs/oxCore/workspace/oxUtil/target/site/apidocs/org/gluu/util/exception/InvalidConfigurationException.html...
Generating /home/jenkins/.jenkins/jobs/oxCore/workspace/oxUtil/target/site/apidocs/org/gluu/util/exception/InvalidSchemaUpdateException.html...
Generating /home/jenkins/.jenkins/jobs/oxCore/workspace/oxUtil/target/site/apidocs/org/gluu/util/ilocale/LocaleUtil.html...
Generating /home/jenkins/.jenkins/jobs/oxCore/workspace/oxUtil/target/site/apidocs/org/gluu/util/image/ImageTransformationUtility.html...
Generating /home/jenkins/.jenkins/jobs/oxCore/workspace/oxUtil/target/site/apidocs/org/gluu/util/init/Initializable.html...
Generating /home/jenkins/.jenkins/jobs/oxCore/workspace/oxUtil/target/site/apidocs/org/gluu/util/io/ByteDataInputStream.html...
Generating /home/jenkins/.jenkins/jobs/oxCore/workspace/oxUtil/target/site/apidocs/org/gluu/util/io/DownloadWrapper.html...
Generating /home/jenkins/.jenkins/jobs/oxCore/workspace/oxUtil/target/site/apidocs/org/gluu/util/io/ExcludeFilterInputStream.html...
Generating /home/jenkins/.jenkins/jobs/oxCore/workspace/oxUtil/target/site/apidocs/org/gluu/util/io/FileDownloader.html...
Generating /home/jenkins/.jenkins/jobs/oxCore/workspace/oxUtil/target/site/apidocs/org/gluu/util/io/FileDownloader.ContentDisposition.html...
Generating /home/jenkins/.jenkins/jobs/oxCore/workspace/oxUtil/target/site/apidocs/org/gluu/util/io/FileHelper.html...
Generating /home/jenkins/.jenkins/jobs/oxCore/workspace/oxUtil/target/site/apidocs/org/gluu/util/io/FileUploadWrapper.html...
Generating /home/jenkins/.jenkins/jobs/oxCore/workspace/oxUtil/target/site/apidocs/org/gluu/util/io/HTTPFileDownloader.html...
Generating /home/jenkins/.jenkins/jobs/oxCore/workspace/oxUtil/target/site/apidocs/org/gluu/util/io/ReverseLineReader.html...
Generating /home/jenkins/.jenkins/jobs/oxCore/workspace/oxUtil/target/site/apidocs/org/gluu/util/process/ProcessHelper.html...
Generating /home/jenkins/.jenkins/jobs/oxCore/workspace/oxUtil/target/site/apidocs/org/gluu/util/properties/FileConfiguration.html...
Generating /home/jenkins/.jenkins/jobs/oxCore/workspace/oxUtil/target/site/apidocs/org/gluu/util/repository/RepositoryUtility.html...
Generating /home/jenkins/.jenkins/jobs/oxCore/workspace/oxUtil/target/site/apidocs/org/gluu/util/security/BCrypt.html...
Generating /home/jenkins/.jenkins/jobs/oxCore/workspace/oxUtil/target/site/apidocs/org/gluu/util/security/CertificateHelper.html...
Generating /home/jenkins/.jenkins/jobs/oxCore/workspace/oxUtil/target/site/apidocs/org/gluu/util/security/PropertiesDecrypter.html...
Generating /home/jenkins/.jenkins/jobs/oxCore/workspace/oxUtil/target/site/apidocs/org/gluu/util/security/StringDecrypter.html...
Generating /home/jenkins/.jenkins/jobs/oxCore/workspace/oxUtil/target/site/apidocs/org/gluu/util/security/StringEncrypter.html...
Generating /home/jenkins/.jenkins/jobs/oxCore/workspace/oxUtil/target/site/apidocs/org/gluu/util/security/StringEncrypter.EncryptionException.html...
Generating /home/jenkins/.jenkins/jobs/oxCore/workspace/oxUtil/target/site/apidocs/org/gluu/xml/GluuErrorHandler.html...
Generating /home/jenkins/.jenkins/jobs/oxCore/workspace/oxUtil/target/site/apidocs/org/gluu/xml/XMLValidator.html...
Generating /home/jenkins/.jenkins/jobs/oxCore/workspace/oxUtil/target/site/apidocs/org/gluu/zip/CompressionHelper.html...
Generating /home/jenkins/.jenkins/jobs/oxCore/workspace/oxUtil/target/site/apidocs/org/gluu/context/package-summary.html...
Generating /home/jenkins/.jenkins/jobs/oxCore/workspace/oxUtil/target/site/apidocs/org/gluu/context/package-tree.html...
Generating /home/jenkins/.jenkins/jobs/oxCore/workspace/oxUtil/target/site/apidocs/org/gluu/log/package-summary.html...
Generating /home/jenkins/.jenkins/jobs/oxCore/workspace/oxUtil/target/site/apidocs/org/gluu/log/package-tree.html...
Generating /home/jenkins/.jenkins/jobs/oxCore/workspace/oxUtil/target/site/apidocs/org/gluu/model/package-summary.html...
Generating /home/jenkins/.jenkins/jobs/oxCore/workspace/oxUtil/target/site/apidocs/org/gluu/model/package-tree.html...
Generating /home/jenkins/.jenkins/jobs/oxCore/workspace/oxUtil/target/site/apidocs/org/gluu/model/config/package-summary.html...
Generating /home/jenkins/.jenkins/jobs/oxCore/workspace/oxUtil/target/site/apidocs/org/gluu/model/config/package-tree.html...
Generating /home/jenkins/.jenkins/jobs/oxCore/workspace/oxUtil/target/site/apidocs/org/gluu/model/ldap/package-summary.html...
Generating /home/jenkins/.jenkins/jobs/oxCore/workspace/oxUtil/target/site/apidocs/org/gluu/model/ldap/package-tree.html...
Generating /home/jenkins/.jenkins/jobs/oxCore/workspace/oxUtil/target/site/apidocs/org/gluu/net/package-summary.html...
Generating /home/jenkins/.jenkins/jobs/oxCore/workspace/oxUtil/target/site/apidocs/org/gluu/net/package-tree.html...
Generating /home/jenkins/.jenkins/jobs/oxCore/workspace/oxUtil/target/site/apidocs/org/gluu/util/package-summary.html...
Generating /home/jenkins/.jenkins/jobs/oxCore/workspace/oxUtil/target/site/apidocs/org/gluu/util/package-tree.html...
Generating /home/jenkins/.jenkins/jobs/oxCore/workspace/oxUtil/target/site/apidocs/org/gluu/util/exception/package-summary.html...
Generating /home/jenkins/.jenkins/jobs/oxCore/workspace/oxUtil/target/site/apidocs/org/gluu/util/exception/package-tree.html...
Generating /home/jenkins/.jenkins/jobs/oxCore/workspace/oxUtil/target/site/apidocs/org/gluu/util/ilocale/package-summary.html...
Generating /home/jenkins/.jenkins/jobs/oxCore/workspace/oxUtil/target/site/apidocs/org/gluu/util/ilocale/package-tree.html...
Generating /home/jenkins/.jenkins/jobs/oxCore/workspace/oxUtil/target/site/apidocs/org/gluu/util/image/package-summary.html...
Generating /home/jenkins/.jenkins/jobs/oxCore/workspace/oxUtil/target/site/apidocs/org/gluu/util/image/package-tree.html...
Generating /home/jenkins/.jenkins/jobs/oxCore/workspace/oxUtil/target/site/apidocs/org/gluu/util/init/package-summary.html...
Generating /home/jenkins/.jenkins/jobs/oxCore/workspace/oxUtil/target/site/apidocs/org/gluu/util/init/package-tree.html...
Generating /home/jenkins/.jenkins/jobs/oxCore/workspace/oxUtil/target/site/apidocs/org/gluu/util/io/package-summary.html...
Generating /home/jenkins/.jenkins/jobs/oxCore/workspace/oxUtil/target/site/apidocs/org/gluu/util/io/package-tree.html...
Generating /home/jenkins/.jenkins/jobs/oxCore/workspace/oxUtil/target/site/apidocs/org/gluu/util/process/package-summary.html...
Generating /home/jenkins/.jenkins/jobs/oxCore/workspace/oxUtil/target/site/apidocs/org/gluu/util/process/package-tree.html...
Generating /home/jenkins/.jenkins/jobs/oxCore/workspace/oxUtil/target/site/apidocs/org/gluu/util/properties/package-summary.html...
Generating /home/jenkins/.jenkins/jobs/oxCore/workspace/oxUtil/target/site/apidocs/org/gluu/util/properties/package-tree.html...
Generating /home/jenkins/.jenkins/jobs/oxCore/workspace/oxUtil/target/site/apidocs/org/gluu/util/repository/package-summary.html...
Generating /home/jenkins/.jenkins/jobs/oxCore/workspace/oxUtil/target/site/apidocs/org/gluu/util/repository/package-tree.html...
Generating /home/jenkins/.jenkins/jobs/oxCore/workspace/oxUtil/target/site/apidocs/org/gluu/util/security/package-summary.html...
Generating /home/jenkins/.jenkins/jobs/oxCore/workspace/oxUtil/target/site/apidocs/org/gluu/util/security/package-tree.html...
Generating /home/jenkins/.jenkins/jobs/oxCore/workspace/oxUtil/target/site/apidocs/org/gluu/xml/package-summary.html...
Generating /home/jenkins/.jenkins/jobs/oxCore/workspace/oxUtil/target/site/apidocs/org/gluu/xml/package-tree.html...
Generating /home/jenkins/.jenkins/jobs/oxCore/workspace/oxUtil/target/site/apidocs/org/gluu/zip/package-summary.html...
Generating /home/jenkins/.jenkins/jobs/oxCore/workspace/oxUtil/target/site/apidocs/org/gluu/zip/package-tree.html...
Generating /home/jenkins/.jenkins/jobs/oxCore/workspace/oxUtil/target/site/apidocs/constant-values.html...
Generating /home/jenkins/.jenkins/jobs/oxCore/workspace/oxUtil/target/site/apidocs/serialized-form.html...
Generating /home/jenkins/.jenkins/jobs/oxCore/workspace/oxUtil/target/site/apidocs/org/gluu/context/class-use/J2EContext.html...
Generating /home/jenkins/.jenkins/jobs/oxCore/workspace/oxUtil/target/site/apidocs/org/gluu/context/class-use/WebContext.html...
Generating /home/jenkins/.jenkins/jobs/oxCore/workspace/oxUtil/target/site/apidocs/org/gluu/log/class-use/LoggingHelper.html...
Generating /home/jenkins/.jenkins/jobs/oxCore/workspace/oxUtil/target/site/apidocs/org/gluu/log/class-use/MacAddressLogIdConverter.html...
Generating /home/jenkins/.jenkins/jobs/oxCore/workspace/oxUtil/target/site/apidocs/org/gluu/model/config/class-use/CustomAuthenticationConfiguration.html...
Generating /home/jenkins/.jenkins/jobs/oxCore/workspace/oxUtil/target/site/apidocs/org/gluu/model/ldap/class-use/GluuLdapConfiguration.html...
Generating /home/jenkins/.jenkins/jobs/oxCore/workspace/oxUtil/target/site/apidocs/org/gluu/model/class-use/AuthenticationMode.html...
Generating /home/jenkins/.jenkins/jobs/oxCore/workspace/oxUtil/target/site/apidocs/org/gluu/model/class-use/AuthenticationScriptUsageType.html...
Generating /home/jenkins/.jenkins/jobs/oxCore/workspace/oxUtil/target/site/apidocs/org/gluu/model/class-use/GluuIMAPData.html...
Generating /home/jenkins/.jenkins/jobs/oxCore/workspace/oxUtil/target/site/apidocs/org/gluu/model/class-use/GluuImage.html...
Generating /home/jenkins/.jenkins/jobs/oxCore/workspace/oxUtil/target/site/apidocs/org/gluu/model/class-use/ImapPassword.html...
Generating /home/jenkins/.jenkins/jobs/oxCore/workspace/oxUtil/target/site/apidocs/org/gluu/model/class-use/ProgrammingLanguage.html...
Generating /home/jenkins/.jenkins/jobs/oxCore/workspace/oxUtil/target/site/apidocs/org/gluu/model/class-use/SimpleCustomProperty.html...
Generating /home/jenkins/.jenkins/jobs/oxCore/workspace/oxUtil/target/site/apidocs/org/gluu/model/class-use/SimpleExtendedCustomProperty.html...
Generating /home/jenkins/.jenkins/jobs/oxCore/workspace/oxUtil/target/site/apidocs/org/gluu/model/class-use/SimpleProperty.html...
Generating /home/jenkins/.jenkins/jobs/oxCore/workspace/oxUtil/target/site/apidocs/org/gluu/model/class-use/SmtpConfiguration.html...
Generating /home/jenkins/.jenkins/jobs/oxCore/workspace/oxUtil/target/site/apidocs/org/gluu/model/class-use/ScriptLocationType.html...
Generating /home/jenkins/.jenkins/jobs/oxCore/workspace/oxUtil/target/site/apidocs/org/gluu/model/class-use/SelectableEntity.html...
Generating /home/jenkins/.jenkins/jobs/oxCore/workspace/oxUtil/target/site/apidocs/org/gluu/model/class-use/TrustContact.html...
Generating /home/jenkins/.jenkins/jobs/oxCore/workspace/oxUtil/target/site/apidocs/org/gluu/net/class-use/InetAddressUtility.html...
Generating /home/jenkins/.jenkins/jobs/oxCore/workspace/oxUtil/target/site/apidocs/org/gluu/net/class-use/SslDefaultHttpClient.html...
Generating /home/jenkins/.jenkins/jobs/oxCore/workspace/oxUtil/target/site/apidocs/org/gluu/net/class-use/TrustAllTrustManager.html...
Generating /home/jenkins/.jenkins/jobs/oxCore/workspace/oxUtil/target/site/apidocs/org/gluu/net/class-use/ProxyUtil.html...
Generating /home/jenkins/.jenkins/jobs/oxCore/workspace/oxUtil/target/site/apidocs/org/gluu/util/exception/class-use/ConfigurationException.html...
Generating /home/jenkins/.jenkins/jobs/oxCore/workspace/oxUtil/target/site/apidocs/org/gluu/util/exception/class-use/InvalidAttributeException.html...
Generating /home/jenkins/.jenkins/jobs/oxCore/workspace/oxUtil/target/site/apidocs/org/gluu/util/exception/class-use/InvalidConfigurationException.html...
Generating /home/jenkins/.jenkins/jobs/oxCore/workspace/oxUtil/target/site/apidocs/org/gluu/util/exception/class-use/InvalidSchemaUpdateException.html...
Generating /home/jenkins/.jenkins/jobs/oxCore/workspace/oxUtil/target/site/apidocs/org/gluu/util/image/class-use/ImageTransformationUtility.html...
Generating /home/jenkins/.jenkins/jobs/oxCore/workspace/oxUtil/target/site/apidocs/org/gluu/util/init/class-use/Initializable.html...
Generating /home/jenkins/.jenkins/jobs/oxCore/workspace/oxUtil/target/site/apidocs/org/gluu/util/io/class-use/ByteDataInputStream.html...
Generating /home/jenkins/.jenkins/jobs/oxCore/workspace/oxUtil/target/site/apidocs/org/gluu/util/io/class-use/DownloadWrapper.html...
Generating /home/jenkins/.jenkins/jobs/oxCore/workspace/oxUtil/target/site/apidocs/org/gluu/util/io/class-use/ExcludeFilterInputStream.html...
Generating /home/jenkins/.jenkins/jobs/oxCore/workspace/oxUtil/target/site/apidocs/org/gluu/util/io/class-use/FileDownloader.html...
Generating /home/jenkins/.jenkins/jobs/oxCore/workspace/oxUtil/target/site/apidocs/org/gluu/util/io/class-use/FileDownloader.ContentDisposition.html...
Generating /home/jenkins/.jenkins/jobs/oxCore/workspace/oxUtil/target/site/apidocs/org/gluu/util/io/class-use/FileHelper.html...
Generating /home/jenkins/.jenkins/jobs/oxCore/workspace/oxUtil/target/site/apidocs/org/gluu/util/io/class-use/FileUploadWrapper.html...
Generating /home/jenkins/.jenkins/jobs/oxCore/workspace/oxUtil/target/site/apidocs/org/gluu/util/io/class-use/HTTPFileDownloader.html...
Generating /home/jenkins/.jenkins/jobs/oxCore/workspace/oxUtil/target/site/apidocs/org/gluu/util/io/class-use/ReverseLineReader.html...
Generating /home/jenkins/.jenkins/jobs/oxCore/workspace/oxUtil/target/site/apidocs/org/gluu/util/process/class-use/ProcessHelper.html...
Generating /home/jenkins/.jenkins/jobs/oxCore/workspace/oxUtil/target/site/apidocs/org/gluu/util/properties/class-use/FileConfiguration.html...
Generating /home/jenkins/.jenkins/jobs/oxCore/workspace/oxUtil/target/site/apidocs/org/gluu/util/repository/class-use/RepositoryUtility.html...
Generating /home/jenkins/.jenkins/jobs/oxCore/workspace/oxUtil/target/site/apidocs/org/gluu/util/security/class-use/BCrypt.html...
Generating /home/jenkins/.jenkins/jobs/oxCore/workspace/oxUtil/target/site/apidocs/org/gluu/util/security/class-use/CertificateHelper.html...
Generating /home/jenkins/.jenkins/jobs/oxCore/workspace/oxUtil/target/site/apidocs/org/gluu/util/security/class-use/PropertiesDecrypter.html...
Generating /home/jenkins/.jenkins/jobs/oxCore/workspace/oxUtil/target/site/apidocs/org/gluu/util/security/class-use/StringDecrypter.html...
Generating /home/jenkins/.jenkins/jobs/oxCore/workspace/oxUtil/target/site/apidocs/org/gluu/util/security/class-use/StringEncrypter.html...
Generating /home/jenkins/.jenkins/jobs/oxCore/workspace/oxUtil/target/site/apidocs/org/gluu/util/security/class-use/StringEncrypter.EncryptionException.html...
Generating /home/jenkins/.jenkins/jobs/oxCore/workspace/oxUtil/target/site/apidocs/org/gluu/util/class-use/ArrayHelper.html...
Generating /home/jenkins/.jenkins/jobs/oxCore/workspace/oxUtil/target/site/apidocs/org/gluu/util/class-use/AssertionHelper.html...
Generating /home/jenkins/.jenkins/jobs/oxCore/workspace/oxUtil/target/site/apidocs/org/gluu/util/class-use/EasySSLProtocolSocketFactory.html...
Generating /home/jenkins/.jenkins/jobs/oxCore/workspace/oxUtil/target/site/apidocs/org/gluu/util/class-use/EasyX509TrustManager.html...
Generating /home/jenkins/.jenkins/jobs/oxCore/workspace/oxUtil/target/site/apidocs/org/gluu/util/class-use/FileUtil.html...
Generating /home/jenkins/.jenkins/jobs/oxCore/workspace/oxUtil/target/site/apidocs/org/gluu/util/class-use/INumGenerator.html...
Generating /home/jenkins/.jenkins/jobs/oxCore/workspace/oxUtil/target/site/apidocs/org/gluu/util/class-use/InterfaceRegistry.html...
Generating /home/jenkins/.jenkins/jobs/oxCore/workspace/oxUtil/target/site/apidocs/org/gluu/util/class-use/Pair.html...
Generating /home/jenkins/.jenkins/jobs/oxCore/workspace/oxUtil/target/site/apidocs/org/gluu/util/class-use/PropertiesHelper.html...
Generating /home/jenkins/.jenkins/jobs/oxCore/workspace/oxUtil/target/site/apidocs/org/gluu/util/class-use/StringHelper.html...
Generating /home/jenkins/.jenkins/jobs/oxCore/workspace/oxUtil/target/site/apidocs/org/gluu/util/class-use/Triple.html...
Generating /home/jenkins/.jenkins/jobs/oxCore/workspace/oxUtil/target/site/apidocs/org/gluu/util/class-use/Util.html...
Generating /home/jenkins/.jenkins/jobs/oxCore/workspace/oxUtil/target/site/apidocs/org/gluu/util/class-use/OxConstants.html...
Generating /home/jenkins/.jenkins/jobs/oxCore/workspace/oxUtil/target/site/apidocs/org/gluu/util/class-use/SelectableEntityHelper.html...
Generating /home/jenkins/.jenkins/jobs/oxCore/workspace/oxUtil/target/site/apidocs/org/gluu/util/ilocale/class-use/LocaleUtil.html...
Generating /home/jenkins/.jenkins/jobs/oxCore/workspace/oxUtil/target/site/apidocs/org/gluu/xml/class-use/GluuErrorHandler.html...
Generating /home/jenkins/.jenkins/jobs/oxCore/workspace/oxUtil/target/site/apidocs/org/gluu/xml/class-use/XMLValidator.html...
Generating /home/jenkins/.jenkins/jobs/oxCore/workspace/oxUtil/target/site/apidocs/org/gluu/zip/class-use/CompressionHelper.html...
Generating /home/jenkins/.jenkins/jobs/oxCore/workspace/oxUtil/target/site/apidocs/org/gluu/context/package-use.html...
Generating /home/jenkins/.jenkins/jobs/oxCore/workspace/oxUtil/target/site/apidocs/org/gluu/log/package-use.html...
Generating /home/jenkins/.jenkins/jobs/oxCore/workspace/oxUtil/target/site/apidocs/org/gluu/model/package-use.html...
Generating /home/jenkins/.jenkins/jobs/oxCore/workspace/oxUtil/target/site/apidocs/org/gluu/model/config/package-use.html...
Generating /home/jenkins/.jenkins/jobs/oxCore/workspace/oxUtil/target/site/apidocs/org/gluu/model/ldap/package-use.html...
Generating /home/jenkins/.jenkins/jobs/oxCore/workspace/oxUtil/target/site/apidocs/org/gluu/net/package-use.html...
Generating /home/jenkins/.jenkins/jobs/oxCore/workspace/oxUtil/target/site/apidocs/org/gluu/util/package-use.html...
Generating /home/jenkins/.jenkins/jobs/oxCore/workspace/oxUtil/target/site/apidocs/org/gluu/util/exception/package-use.html...
Generating /home/jenkins/.jenkins/jobs/oxCore/workspace/oxUtil/target/site/apidocs/org/gluu/util/ilocale/package-use.html...
Generating /home/jenkins/.jenkins/jobs/oxCore/workspace/oxUtil/target/site/apidocs/org/gluu/util/image/package-use.html...
Generating /home/jenkins/.jenkins/jobs/oxCore/workspace/oxUtil/target/site/apidocs/org/gluu/util/init/package-use.html...
Generating /home/jenkins/.jenkins/jobs/oxCore/workspace/oxUtil/target/site/apidocs/org/gluu/util/io/package-use.html...
Generating /home/jenkins/.jenkins/jobs/oxCore/workspace/oxUtil/target/site/apidocs/org/gluu/util/process/package-use.html...
Generating /home/jenkins/.jenkins/jobs/oxCore/workspace/oxUtil/target/site/apidocs/org/gluu/util/properties/package-use.html...
Generating /home/jenkins/.jenkins/jobs/oxCore/workspace/oxUtil/target/site/apidocs/org/gluu/util/repository/package-use.html...
Generating /home/jenkins/.jenkins/jobs/oxCore/workspace/oxUtil/target/site/apidocs/org/gluu/util/security/package-use.html...
Generating /home/jenkins/.jenkins/jobs/oxCore/workspace/oxUtil/target/site/apidocs/org/gluu/xml/package-use.html...
Generating /home/jenkins/.jenkins/jobs/oxCore/workspace/oxUtil/target/site/apidocs/org/gluu/zip/package-use.html...
Building index for all the packages and classes...
Generating /home/jenkins/.jenkins/jobs/oxCore/workspace/oxUtil/target/site/apidocs/overview-tree.html...
Generating /home/jenkins/.jenkins/jobs/oxCore/workspace/oxUtil/target/site/apidocs/index-all.html...
Building index for all classes...
Generating /home/jenkins/.jenkins/jobs/oxCore/workspace/oxUtil/target/site/apidocs/allclasses-index.html...
Generating /home/jenkins/.jenkins/jobs/oxCore/workspace/oxUtil/target/site/apidocs/allpackages-index.html...
Generating /home/jenkins/.jenkins/jobs/oxCore/workspace/oxUtil/target/site/apidocs/deprecated-list.html...
Building index for all classes...
Generating /home/jenkins/.jenkins/jobs/oxCore/workspace/oxUtil/target/site/apidocs/allclasses.html...
Generating /home/jenkins/.jenkins/jobs/oxCore/workspace/oxUtil/target/site/apidocs/allclasses.html...
Generating /home/jenkins/.jenkins/jobs/oxCore/workspace/oxUtil/target/site/apidocs/index.html...
Generating /home/jenkins/.jenkins/jobs/oxCore/workspace/oxUtil/target/site/apidocs/overview-summary.html...
Generating /home/jenkins/.jenkins/jobs/oxCore/workspace/oxUtil/target/site/apidocs/help-doc.html...
26 errors
65 warnings
[ERROR] Error while creating javadoc report: 
Exit code: 1 - javadoc: error - The code being documented uses modules but the packages defined in https://docs.oracle.com/javase/8/docs/api/ are in the unnamed module.
/home/jenkins/.jenkins/jobs/oxCore/workspace/oxUtil/src/main/java/org/gluu/util/io/ByteDataInputStream.java:16: error: unknown tag: author:
 * @author: Yuriy Movchan Date: 05/20/2015
   ^
/home/jenkins/.jenkins/jobs/oxCore/workspace/oxUtil/src/main/java/org/gluu/util/io/DownloadWrapper.java:13: error: unknown tag: author:
 * @author: Yuriy Movchan Date: 11.20.2010
   ^
/home/jenkins/.jenkins/jobs/oxCore/workspace/oxUtil/src/main/java/org/gluu/util/io/FileDownloader.java:21: error: unknown tag: author:
 * @author: Yuriy Movchan Date: 11.20.2010
   ^
/home/jenkins/.jenkins/jobs/oxCore/workspace/oxUtil/src/main/java/org/gluu/util/io/FileUploadWrapper.java:13: error: unknown tag: author:
 * @author: Yuriy Movchan Date: 11.21.2010
   ^
/home/jenkins/.jenkins/jobs/oxCore/workspace/oxUtil/src/main/java/org/gluu/util/io/HTTPFileDownloader.java:23: error: unknown tag: author:
 * @author: Yuriy Movchan Date: 11.21.2010
   ^
/home/jenkins/.jenkins/jobs/oxCore/workspace/oxUtil/src/main/java/org/gluu/util/security/BCrypt.java:53: error: self-closing element not allowed
 * String pw_hash = BCrypt.hashpw(plain_password, BCrypt.gensalt()); <br />
                                                                     ^
/home/jenkins/.jenkins/jobs/oxCore/workspace/oxUtil/src/main/java/org/gluu/util/security/BCrypt.java:60: error: self-closing element not allowed
 * if (BCrypt.checkpw(candidate_password, stored_hash))<br />
                                                       ^
/home/jenkins/.jenkins/jobs/oxCore/workspace/oxUtil/src/main/java/org/gluu/util/security/BCrypt.java:61: error: self-closing element not allowed
 * &nbsp;&nbsp;&nbsp;&nbsp;System.out.println("It matches");<br />
                                                            ^
/home/jenkins/.jenkins/jobs/oxCore/workspace/oxUtil/src/main/java/org/gluu/util/security/BCrypt.java:62: error: self-closing element not allowed
 * else<br />
       ^
/home/jenkins/.jenkins/jobs/oxCore/workspace/oxUtil/src/main/java/org/gluu/util/security/BCrypt.java:63: error: self-closing element not allowed
 * &nbsp;&nbsp;&nbsp;&nbsp;System.out.println("It does not match");<br />
                                                                   ^
/home/jenkins/.jenkins/jobs/oxCore/workspace/oxUtil/src/main/java/org/gluu/util/security/BCrypt.java:70: error: self-closing element not allowed
 * String strong_salt = BCrypt.gensalt(10)<br />
                                          ^
/home/jenkins/.jenkins/jobs/oxCore/workspace/oxUtil/src/main/java/org/gluu/util/security/BCrypt.java:71: error: self-closing element not allowed
 * String stronger_salt = BCrypt.gensalt(12)<br />
                                            ^
/home/jenkins/.jenkins/jobs/oxCore/workspace/oxUtil/src/main/java/org/gluu/util/EasySSLProtocolSocketFactory.java:53: error: unexpected end tag: </p>
 * </p>
   ^
/home/jenkins/.jenkins/jobs/oxCore/workspace/oxUtil/src/main/java/org/gluu/util/EasySSLProtocolSocketFactory.java:67: error: unexpected end tag: </p>
 * </p>
   ^
/home/jenkins/.jenkins/jobs/oxCore/workspace/oxUtil/src/main/java/org/gluu/util/EasySSLProtocolSocketFactory.java:69: error: invalid uri: "mailto:oleg -at- ural.ru"
 * @author <a href="mailto:oleg -at- ural.ru">Oleg Kalnichevski</a>
              ^
/home/jenkins/.jenkins/jobs/oxCore/workspace/oxUtil/src/main/java/org/gluu/context/WebContext.java:23: warning: no description for @param
     * @param name
       ^
/home/jenkins/.jenkins/jobs/oxCore/workspace/oxUtil/src/main/java/org/gluu/context/WebContext.java:38: warning: no description for @param
     * @param name
       ^
/home/jenkins/.jenkins/jobs/oxCore/workspace/oxUtil/src/main/java/org/gluu/context/WebContext.java:46: warning: no description for @param
     * @param name
       ^
/home/jenkins/.jenkins/jobs/oxCore/workspace/oxUtil/src/main/java/org/gluu/context/WebContext.java:47: warning: no description for @param
     * @param value
       ^
/home/jenkins/.jenkins/jobs/oxCore/workspace/oxUtil/src/main/java/org/gluu/context/WebContext.java:54: warning: no description for @param
     * @param name
       ^
/home/jenkins/.jenkins/jobs/oxCore/workspace/oxUtil/src/main/java/org/gluu/context/WebContext.java:62: warning: no description for @param
     * @param name
       ^
/home/jenkins/.jenkins/jobs/oxCore/workspace/oxUtil/src/main/java/org/gluu/context/WebContext.java:63: warning: no description for @param
     * @param value
       ^
/home/jenkins/.jenkins/jobs/oxCore/workspace/oxUtil/src/main/java/org/gluu/context/WebContext.java:70: warning: no description for @param
     * @param name
       ^
/home/jenkins/.jenkins/jobs/oxCore/workspace/oxUtil/src/main/java/org/gluu/context/WebContext.java:85: warning: no description for @param
     * @param content
       ^
/home/jenkins/.jenkins/jobs/oxCore/workspace/oxUtil/src/main/java/org/gluu/context/WebContext.java:87: warning: no @throws for java.io.IOException
    void writeResponseContent(String content) throws IOException;
         ^
/home/jenkins/.jenkins/jobs/oxCore/workspace/oxUtil/src/main/java/org/gluu/context/WebContext.java:92: warning: no description for @param
     * @param name
       ^
/home/jenkins/.jenkins/jobs/oxCore/workspace/oxUtil/src/main/java/org/gluu/context/WebContext.java:93: warning: no description for @param
     * @param value
       ^
/home/jenkins/.jenkins/jobs/oxCore/workspace/oxUtil/src/main/java/org/gluu/context/J2EContext.java:28: warning: no description for @param
     * @param request
       ^
/home/jenkins/.jenkins/jobs/oxCore/workspace/oxUtil/src/main/java/org/gluu/context/J2EContext.java:29: warning: no description for @param
     * @param response
       ^
/home/jenkins/.jenkins/jobs/oxCore/workspace/oxUtil/src/main/java/org/gluu/net/InetAddressUtility.java:33: warning: no @param for ipAddress
    public static boolean isIpAddress(String ipAddress) {
                          ^
/home/jenkins/.jenkins/jobs/oxCore/workspace/oxUtil/src/main/java/org/gluu/net/InetAddressUtility.java:33: warning: no @return
    public static boolean isIpAddress(String ipAddress) {
                          ^
/home/jenkins/.jenkins/jobs/oxCore/workspace/oxUtil/src/main/java/org/gluu/util/EasySSLProtocolSocketFactory.java:111: error: reference not found
     * @see SecureProtocolSocketFactory#createSocket(java.lang.String,int,java.net.InetAddress,int)
            ^
/home/jenkins/.jenkins/jobs/oxCore/workspace/oxUtil/src/main/java/org/gluu/util/EasySSLProtocolSocketFactory.java:168: error: reference not found
     * @see SecureProtocolSocketFactory#createSocket(java.lang.String,int)
            ^
/home/jenkins/.jenkins/jobs/oxCore/workspace/oxUtil/src/main/java/org/gluu/util/EasySSLProtocolSocketFactory.java:175: error: reference not found
     * @see SecureProtocolSocketFactory#createSocket(java.net.Socket,java.lang.String,int,boolean)
            ^
/home/jenkins/.jenkins/jobs/oxCore/workspace/oxUtil/src/main/java/org/gluu/util/EasySSLProtocolSocketFactory.java:177: warning: no @param for socket
    public Socket createSocket(Socket socket, String host, int port, boolean autoClose)
                  ^
/home/jenkins/.jenkins/jobs/oxCore/workspace/oxUtil/src/main/java/org/gluu/util/EasySSLProtocolSocketFactory.java:177: warning: no @param for host
    public Socket createSocket(Socket socket, String host, int port, boolean autoClose)
                  ^
/home/jenkins/.jenkins/jobs/oxCore/workspace/oxUtil/src/main/java/org/gluu/util/EasySSLProtocolSocketFactory.java:177: warning: no @param for port
    public Socket createSocket(Socket socket, String host, int port, boolean autoClose)
                  ^
/home/jenkins/.jenkins/jobs/oxCore/workspace/oxUtil/src/main/java/org/gluu/util/EasySSLProtocolSocketFactory.java:177: warning: no @param for autoClose
    public Socket createSocket(Socket socket, String host, int port, boolean autoClose)
                  ^
/home/jenkins/.jenkins/jobs/oxCore/workspace/oxUtil/src/main/java/org/gluu/util/EasySSLProtocolSocketFactory.java:177: warning: no @return
    public Socket createSocket(Socket socket, String host, int port, boolean autoClose)
                  ^
/home/jenkins/.jenkins/jobs/oxCore/workspace/oxUtil/src/main/java/org/gluu/util/EasySSLProtocolSocketFactory.java:177: warning: no @throws for java.io.IOException
    public Socket createSocket(Socket socket, String host, int port, boolean autoClose)
                  ^
/home/jenkins/.jenkins/jobs/oxCore/workspace/oxUtil/src/main/java/org/gluu/util/EasySSLProtocolSocketFactory.java:177: warning: no @throws for java.net.UnknownHostException
    public Socket createSocket(Socket socket, String host, int port, boolean autoClose)
                  ^
/home/jenkins/.jenkins/jobs/oxCore/workspace/oxUtil/src/main/java/org/gluu/util/EasyX509TrustManager.java:57: warning: no @param for keystore
    public EasyX509TrustManager(KeyStore keystore) throws NoSuchAlgorithmException, KeyStoreException {
           ^
/home/jenkins/.jenkins/jobs/oxCore/workspace/oxUtil/src/main/java/org/gluu/util/EasyX509TrustManager.java:57: warning: no @throws for java.security.NoSuchAlgorithmException
    public EasyX509TrustManager(KeyStore keystore) throws NoSuchAlgorithmException, KeyStoreException {
           ^
/home/jenkins/.jenkins/jobs/oxCore/workspace/oxUtil/src/main/java/org/gluu/util/EasyX509TrustManager.java:57: warning: no @throws for java.security.KeyStoreException
    public EasyX509TrustManager(KeyStore keystore) throws NoSuchAlgorithmException, KeyStoreException {
           ^
/home/jenkins/.jenkins/jobs/oxCore/workspace/oxUtil/src/main/java/org/gluu/util/FileUtil.java:36: warning: no description for @param
     * @param filePath
       ^
/home/jenkins/.jenkins/jobs/oxCore/workspace/oxUtil/src/main/java/org/gluu/util/FileUtil.java:37: warning: no description for @param
     * @param position
       ^
/home/jenkins/.jenkins/jobs/oxCore/workspace/oxUtil/src/main/java/org/gluu/util/FileUtil.java:38: warning: no description for @param
     * @param data
       ^
/home/jenkins/.jenkins/jobs/oxCore/workspace/oxUtil/src/main/java/org/gluu/util/FileUtil.java:39: warning: no description for @return
     * @return
       ^
/home/jenkins/.jenkins/jobs/oxCore/workspace/oxUtil/src/main/java/org/gluu/util/FileUtil.java:69: warning: no description for @param
     * @param filePath
       ^
/home/jenkins/.jenkins/jobs/oxCore/workspace/oxUtil/src/main/java/org/gluu/util/FileUtil.java:70: warning: no description for @param
     * @param position
       ^
/home/jenkins/.jenkins/jobs/oxCore/workspace/oxUtil/src/main/java/org/gluu/util/FileUtil.java:71: warning: no description for @param
     * @param data
       ^
/home/jenkins/.jenkins/jobs/oxCore/workspace/oxUtil/src/main/java/org/gluu/util/FileUtil.java:72: warning: no description for @return
     * @return
       ^
/home/jenkins/.jenkins/jobs/oxCore/workspace/oxUtil/src/main/java/org/gluu/util/FileUtil.java:92: warning: no description for @param
     * @param filePath
       ^
/home/jenkins/.jenkins/jobs/oxCore/workspace/oxUtil/src/main/java/org/gluu/util/FileUtil.java:93: warning: no description for @param
     * @param searchStr
       ^
/home/jenkins/.jenkins/jobs/oxCore/workspace/oxUtil/src/main/java/org/gluu/util/FileUtil.java:94: warning: no description for @return
     * @return
       ^
/home/jenkins/.jenkins/jobs/oxCore/workspace/oxUtil/src/main/java/org/gluu/util/FileUtil.java:145: warning: no description for @param
     * @param url
       ^
/home/jenkins/.jenkins/jobs/oxCore/workspace/oxUtil/src/main/java/org/gluu/util/FileUtil.java:146: warning: no description for @return
     * @return
       ^
/home/jenkins/.jenkins/jobs/oxCore/workspace/oxUtil/src/main/java/org/gluu/util/FileUtil.java:175: warning: no description for @param
     * @param filePath
       ^
/home/jenkins/.jenkins/jobs/oxCore/workspace/oxUtil/src/main/java/org/gluu/util/FileUtil.java:176: warning: no description for @return
     * @return
       ^
/home/jenkins/.jenkins/jobs/oxCore/workspace/oxUtil/src/main/java/org/gluu/util/InterfaceRegistry.java:43: warning: no @param for <T>
    public static synchronized <T> T get(Class classInterface) {
                                     ^
/home/jenkins/.jenkins/jobs/oxCore/workspace/oxUtil/src/main/java/org/gluu/util/Util.java:31: error: unknown tag: T
     * @return An ArrayList<T> of the same values *
                           ^
/home/jenkins/.jenkins/jobs/oxCore/workspace/oxUtil/src/main/java/org/gluu/util/Util.java:42: error: unknown tag: String
     * Convert a list of unknown type to a List<String> in a type-safe way
                                               ^
/home/jenkins/.jenkins/jobs/oxCore/workspace/oxUtil/src/main/java/org/gluu/util/Util.java:46: error: unknown tag: String
     * @return List<String> of the items in list
                   ^
/home/jenkins/.jenkins/jobs/oxCore/workspace/oxUtil/src/main/java/org/gluu/util/Util.java:57: error: unknown tag: String
     * Convert a single String to a List<String>
                                        ^
/home/jenkins/.jenkins/jobs/oxCore/workspace/oxUtil/src/main/java/org/gluu/util/Util.java:70: error: unknown tag: String
     * Convert a String array to an List<String>
                                        ^
/home/jenkins/.jenkins/jobs/oxCore/workspace/oxUtil/src/main/java/org/gluu/util/Util.java:74: error: unknown tag: String
     * @return List<String> of the items in the array
                   ^
/home/jenkins/.jenkins/jobs/oxCore/workspace/oxUtil/src/main/java/org/gluu/util/Util.java:100: warning: no description for @throws
     * @throws IOException
       ^
/home/jenkins/.jenkins/jobs/oxCore/workspace/oxUtil/src/main/java/org/gluu/util/Util.java:113: warning: no description for @throws
     * @throws IOException
       ^
/home/jenkins/.jenkins/jobs/oxCore/workspace/oxUtil/src/main/java/org/gluu/util/Util.java:159: warning: no description for @param
     * @param dn
       ^
/home/jenkins/.jenkins/jobs/oxCore/workspace/oxUtil/src/main/java/org/gluu/util/process/ProcessHelper.java:99: warning: no description for @param
     * @param streamHandler
       ^
/home/jenkins/.jenkins/jobs/oxCore/workspace/oxUtil/src/main/java/org/gluu/util/process/ProcessHelper.java:104: warning: no @param for commandLine
    public static PrintResultHandler executeProgram(CommandLine commandLine, long printJobTimeout,
                                     ^
/home/jenkins/.jenkins/jobs/oxCore/workspace/oxUtil/src/main/java/org/gluu/util/process/ProcessHelper.java:104: warning: no @param for successExitValue
    public static PrintResultHandler executeProgram(CommandLine commandLine, long printJobTimeout,
                                     ^
/home/jenkins/.jenkins/jobs/oxCore/workspace/oxUtil/src/main/java/org/gluu/util/process/ProcessHelper.java:116: warning: no description for @param
     * @param streamHandler
       ^
/home/jenkins/.jenkins/jobs/oxCore/workspace/oxUtil/src/main/java/org/gluu/util/process/ProcessHelper.java:121: warning: no @param for commandLine
    public static PrintResultHandler executeProgram(CommandLine commandLine, String workingDirectory,
                                     ^
/home/jenkins/.jenkins/jobs/oxCore/workspace/oxUtil/src/main/java/org/gluu/util/process/ProcessHelper.java:121: warning: no @param for workingDirectory
    public static PrintResultHandler executeProgram(CommandLine commandLine, String workingDirectory,
                                     ^
/home/jenkins/.jenkins/jobs/oxCore/workspace/oxUtil/src/main/java/org/gluu/util/process/ProcessHelper.java:121: warning: no @param for successExitValue
    public static PrintResultHandler executeProgram(CommandLine commandLine, String workingDirectory,
                                     ^
/home/jenkins/.jenkins/jobs/oxCore/workspace/oxUtil/src/main/java/org/gluu/util/security/StringEncrypter.java:137: error: @param name not found
     * @param encryptionKey
              ^
/home/jenkins/.jenkins/jobs/oxCore/workspace/oxUtil/src/main/java/org/gluu/util/security/StringEncrypter.java:139: warning: no description for @throws
     * @throws EncryptionException
       ^
/home/jenkins/.jenkins/jobs/oxCore/workspace/oxUtil/src/main/java/org/gluu/util/security/StringEncrypter.java:159: warning: no description for @throws
     * @throws EncryptionException
       ^
/home/jenkins/.jenkins/jobs/oxCore/workspace/oxUtil/src/main/java/org/gluu/util/security/StringEncrypter.java:225: warning: no description for @throws
     * @throws EncryptionException
       ^
/home/jenkins/.jenkins/jobs/oxCore/workspace/oxUtil/src/main/java/org/gluu/util/security/StringEncrypter.java:246: warning: no description for @throws
     * @throws EncryptionException
       ^
/home/jenkins/.jenkins/jobs/oxCore/workspace/oxUtil/src/main/java/org/gluu/util/security/StringEncrypter.java:248: warning: no @param for encryptionKey
    public String decrypt(final String encryptedString, String encryptionKey) throws EncryptionException {
                  ^
/home/jenkins/.jenkins/jobs/oxCore/workspace/oxUtil/src/main/java/org/gluu/util/security/StringEncrypter.java:300: warning: no description for @throws
     * @throws EncryptionException
       ^
/home/jenkins/.jenkins/jobs/oxCore/workspace/oxUtil/src/main/java/org/gluu/util/security/StringEncrypter.java:317: warning: no description for @throws
     * @throws EncryptionException
       ^
/home/jenkins/.jenkins/jobs/oxCore/workspace/oxUtil/src/main/java/org/gluu/util/security/StringEncrypter.java:319: warning: no @param for encryptionKey
    public String encrypt(final String unencryptedString, String encryptionKey) throws EncryptionException {
                  ^
/home/jenkins/.jenkins/jobs/oxCore/workspace/oxUtil/src/main/java/org/gluu/xml/XMLValidator.java:31: warning: no description for @param
     * @param stream
       ^
/home/jenkins/.jenkins/jobs/oxCore/workspace/oxUtil/src/main/java/org/gluu/xml/XMLValidator.java:32: warning: no description for @param
     * @param validationSchema
       ^
/home/jenkins/.jenkins/jobs/oxCore/workspace/oxUtil/src/main/java/org/gluu/xml/XMLValidator.java:33: warning: no description for @throws
     * @throws IOException
       ^
/home/jenkins/.jenkins/jobs/oxCore/workspace/oxUtil/src/main/java/org/gluu/xml/XMLValidator.java:34: warning: no description for @throws
     * @throws SAXException
       ^
/home/jenkins/.jenkins/jobs/oxCore/workspace/oxUtil/src/main/java/org/gluu/xml/XMLValidator.java:35: warning: no description for @throws
     * @throws ParserConfigurationException
       ^

Command line was: /opt/java/amazon-corretto-11.0.7.10.1-linux-x64/bin/javadoc @options @packages

Refer to the generated Javadoc files in '/home/jenkins/.jenkins/jobs/oxCore/workspace/oxUtil/target/site/apidocs' dir.

org.apache.maven.reporting.MavenReportException: 
Exit code: 1 - javadoc: error - The code being documented uses modules but the packages defined in https://docs.oracle.com/javase/8/docs/api/ are in the unnamed module.
/home/jenkins/.jenkins/jobs/oxCore/workspace/oxUtil/src/main/java/org/gluu/util/io/ByteDataInputStream.java:16: error: unknown tag: author:
 * @author: Yuriy Movchan Date: 05/20/2015
   ^
/home/jenkins/.jenkins/jobs/oxCore/workspace/oxUtil/src/main/java/org/gluu/util/io/DownloadWrapper.java:13: error: unknown tag: author:
 * @author: Yuriy Movchan Date: 11.20.2010
   ^
/home/jenkins/.jenkins/jobs/oxCore/workspace/oxUtil/src/main/java/org/gluu/util/io/FileDownloader.java:21: error: unknown tag: author:
 * @author: Yuriy Movchan Date: 11.20.2010
   ^
/home/jenkins/.jenkins/jobs/oxCore/workspace/oxUtil/src/main/java/org/gluu/util/io/FileUploadWrapper.java:13: error: unknown tag: author:
 * @author: Yuriy Movchan Date: 11.21.2010
   ^
/home/jenkins/.jenkins/jobs/oxCore/workspace/oxUtil/src/main/java/org/gluu/util/io/HTTPFileDownloader.java:23: error: unknown tag: author:
 * @author: Yuriy Movchan Date: 11.21.2010
   ^
/home/jenkins/.jenkins/jobs/oxCore/workspace/oxUtil/src/main/java/org/gluu/util/security/BCrypt.java:53: error: self-closing element not allowed
 * String pw_hash = BCrypt.hashpw(plain_password, BCrypt.gensalt()); <br />
                                                                     ^
/home/jenkins/.jenkins/jobs/oxCore/workspace/oxUtil/src/main/java/org/gluu/util/security/BCrypt.java:60: error: self-closing element not allowed
 * if (BCrypt.checkpw(candidate_password, stored_hash))<br />
                                                       ^
/home/jenkins/.jenkins/jobs/oxCore/workspace/oxUtil/src/main/java/org/gluu/util/security/BCrypt.java:61: error: self-closing element not allowed
 * &nbsp;&nbsp;&nbsp;&nbsp;System.out.println("It matches");<br />
                                                            ^
/home/jenkins/.jenkins/jobs/oxCore/workspace/oxUtil/src/main/java/org/gluu/util/security/BCrypt.java:62: error: self-closing element not allowed
 * else<br />
       ^
/home/jenkins/.jenkins/jobs/oxCore/workspace/oxUtil/src/main/java/org/gluu/util/security/BCrypt.java:63: error: self-closing element not allowed
 * &nbsp;&nbsp;&nbsp;&nbsp;System.out.println("It does not match");<br />
                                                                   ^
/home/jenkins/.jenkins/jobs/oxCore/workspace/oxUtil/src/main/java/org/gluu/util/security/BCrypt.java:70: error: self-closing element not allowed
 * String strong_salt = BCrypt.gensalt(10)<br />
                                          ^
/home/jenkins/.jenkins/jobs/oxCore/workspace/oxUtil/src/main/java/org/gluu/util/security/BCrypt.java:71: error: self-closing element not allowed
 * String stronger_salt = BCrypt.gensalt(12)<br />
                                            ^
/home/jenkins/.jenkins/jobs/oxCore/workspace/oxUtil/src/main/java/org/gluu/util/EasySSLProtocolSocketFactory.java:53: error: unexpected end tag: </p>
 * </p>
   ^
/home/jenkins/.jenkins/jobs/oxCore/workspace/oxUtil/src/main/java/org/gluu/util/EasySSLProtocolSocketFactory.java:67: error: unexpected end tag: </p>
 * </p>
   ^
/home/jenkins/.jenkins/jobs/oxCore/workspace/oxUtil/src/main/java/org/gluu/util/EasySSLProtocolSocketFactory.java:69: error: invalid uri: "mailto:oleg -at- ural.ru"
 * @author <a href="mailto:oleg -at- ural.ru">Oleg Kalnichevski</a>
              ^
/home/jenkins/.jenkins/jobs/oxCore/workspace/oxUtil/src/main/java/org/gluu/context/WebContext.java:23: warning: no description for @param
     * @param name
       ^
/home/jenkins/.jenkins/jobs/oxCore/workspace/oxUtil/src/main/java/org/gluu/context/WebContext.java:38: warning: no description for @param
     * @param name
       ^
/home/jenkins/.jenkins/jobs/oxCore/workspace/oxUtil/src/main/java/org/gluu/context/WebContext.java:46: warning: no description for @param
     * @param name
       ^
/home/jenkins/.jenkins/jobs/oxCore/workspace/oxUtil/src/main/java/org/gluu/context/WebContext.java:47: warning: no description for @param
     * @param value
       ^
/home/jenkins/.jenkins/jobs/oxCore/workspace/oxUtil/src/main/java/org/gluu/context/WebContext.java:54: warning: no description for @param
     * @param name
       ^
/home/jenkins/.jenkins/jobs/oxCore/workspace/oxUtil/src/main/java/org/gluu/context/WebContext.java:62: warning: no description for @param
     * @param name
       ^
/home/jenkins/.jenkins/jobs/oxCore/workspace/oxUtil/src/main/java/org/gluu/context/WebContext.java:63: warning: no description for @param
     * @param value
       ^
/home/jenkins/.jenkins/jobs/oxCore/workspace/oxUtil/src/main/java/org/gluu/context/WebContext.java:70: warning: no description for @param
     * @param name
       ^
/home/jenkins/.jenkins/jobs/oxCore/workspace/oxUtil/src/main/java/org/gluu/context/WebContext.java:85: warning: no description for @param
     * @param content
       ^
/home/jenkins/.jenkins/jobs/oxCore/workspace/oxUtil/src/main/java/org/gluu/context/WebContext.java:87: warning: no @throws for java.io.IOException
    void writeResponseContent(String content) throws IOException;
         ^
/home/jenkins/.jenkins/jobs/oxCore/workspace/oxUtil/src/main/java/org/gluu/context/WebContext.java:92: warning: no description for @param
     * @param name
       ^
/home/jenkins/.jenkins/jobs/oxCore/workspace/oxUtil/src/main/java/org/gluu/context/WebContext.java:93: warning: no description for @param
     * @param value
       ^
/home/jenkins/.jenkins/jobs/oxCore/workspace/oxUtil/src/main/java/org/gluu/context/J2EContext.java:28: warning: no description for @param
     * @param request
       ^
/home/jenkins/.jenkins/jobs/oxCore/workspace/oxUtil/src/main/java/org/gluu/context/J2EContext.java:29: warning: no description for @param
     * @param response
       ^
/home/jenkins/.jenkins/jobs/oxCore/workspace/oxUtil/src/main/java/org/gluu/net/InetAddressUtility.java:33: warning: no @param for ipAddress
    public static boolean isIpAddress(String ipAddress) {
                          ^
/home/jenkins/.jenkins/jobs/oxCore/workspace/oxUtil/src/main/java/org/gluu/net/InetAddressUtility.java:33: warning: no @return
    public static boolean isIpAddress(String ipAddress) {
                          ^
/home/jenkins/.jenkins/jobs/oxCore/workspace/oxUtil/src/main/java/org/gluu/util/EasySSLProtocolSocketFactory.java:111: error: reference not found
     * @see SecureProtocolSocketFactory#createSocket(java.lang.String,int,java.net.InetAddress,int)
            ^
/home/jenkins/.jenkins/jobs/oxCore/workspace/oxUtil/src/main/java/org/gluu/util/EasySSLProtocolSocketFactory.java:168: error: reference not found
     * @see SecureProtocolSocketFactory#createSocket(java.lang.String,int)
            ^
/home/jenkins/.jenkins/jobs/oxCore/workspace/oxUtil/src/main/java/org/gluu/util/EasySSLProtocolSocketFactory.java:175: error: reference not found
     * @see SecureProtocolSocketFactory#createSocket(java.net.Socket,java.lang.String,int,boolean)
            ^
/home/jenkins/.jenkins/jobs/oxCore/workspace/oxUtil/src/main/java/org/gluu/util/EasySSLProtocolSocketFactory.java:177: warning: no @param for socket
    public Socket createSocket(Socket socket, String host, int port, boolean autoClose)
                  ^
/home/jenkins/.jenkins/jobs/oxCore/workspace/oxUtil/src/main/java/org/gluu/util/EasySSLProtocolSocketFactory.java:177: warning: no @param for host
    public Socket createSocket(Socket socket, String host, int port, boolean autoClose)
                  ^
/home/jenkins/.jenkins/jobs/oxCore/workspace/oxUtil/src/main/java/org/gluu/util/EasySSLProtocolSocketFactory.java:177: warning: no @param for port
    public Socket createSocket(Socket socket, String host, int port, boolean autoClose)
                  ^
/home/jenkins/.jenkins/jobs/oxCore/workspace/oxUtil/src/main/java/org/gluu/util/EasySSLProtocolSocketFactory.java:177: warning: no @param for autoClose
    public Socket createSocket(Socket socket, String host, int port, boolean autoClose)
                  ^
/home/jenkins/.jenkins/jobs/oxCore/workspace/oxUtil/src/main/java/org/gluu/util/EasySSLProtocolSocketFactory.java:177: warning: no @return
    public Socket createSocket(Socket socket, String host, int port, boolean autoClose)
                  ^
/home/jenkins/.jenkins/jobs/oxCore/workspace/oxUtil/src/main/java/org/gluu/util/EasySSLProtocolSocketFactory.java:177: warning: no @throws for java.io.IOException
    public Socket createSocket(Socket socket, String host, int port, boolean autoClose)
                  ^
/home/jenkins/.jenkins/jobs/oxCore/workspace/oxUtil/src/main/java/org/gluu/util/EasySSLProtocolSocketFactory.java:177: warning: no @throws for java.net.UnknownHostException
    public Socket createSocket(Socket socket, String host, int port, boolean autoClose)
                  ^
/home/jenkins/.jenkins/jobs/oxCore/workspace/oxUtil/src/main/java/org/gluu/util/EasyX509TrustManager.java:57: warning: no @param for keystore
    public EasyX509TrustManager(KeyStore keystore) throws NoSuchAlgorithmException, KeyStoreException {
           ^
/home/jenkins/.jenkins/jobs/oxCore/workspace/oxUtil/src/main/java/org/gluu/util/EasyX509TrustManager.java:57: warning: no @throws for java.security.NoSuchAlgorithmException
    public EasyX509TrustManager(KeyStore keystore) throws NoSuchAlgorithmException, KeyStoreException {
           ^
/home/jenkins/.jenkins/jobs/oxCore/workspace/oxUtil/src/main/java/org/gluu/util/EasyX509TrustManager.java:57: warning: no @throws for java.security.KeyStoreException
    public EasyX509TrustManager(KeyStore keystore) throws NoSuchAlgorithmException, KeyStoreException {
           ^
/home/jenkins/.jenkins/jobs/oxCore/workspace/oxUtil/src/main/java/org/gluu/util/FileUtil.java:36: warning: no description for @param
     * @param filePath
       ^
/home/jenkins/.jenkins/jobs/oxCore/workspace/oxUtil/src/main/java/org/gluu/util/FileUtil.java:37: warning: no description for @param
     * @param position
       ^
/home/jenkins/.jenkins/jobs/oxCore/workspace/oxUtil/src/main/java/org/gluu/util/FileUtil.java:38: warning: no description for @param
     * @param data
       ^
/home/jenkins/.jenkins/jobs/oxCore/workspace/oxUtil/src/main/java/org/gluu/util/FileUtil.java:39: warning: no description for @return
     * @return
       ^
/home/jenkins/.jenkins/jobs/oxCore/workspace/oxUtil/src/main/java/org/gluu/util/FileUtil.java:69: warning: no description for @param
     * @param filePath
       ^
/home/jenkins/.jenkins/jobs/oxCore/workspace/oxUtil/src/main/java/org/gluu/util/FileUtil.java:70: warning: no description for @param
     * @param position
       ^
/home/jenkins/.jenkins/jobs/oxCore/workspace/oxUtil/src/main/java/org/gluu/util/FileUtil.java:71: warning: no description for @param
     * @param data
       ^
/home/jenkins/.jenkins/jobs/oxCore/workspace/oxUtil/src/main/java/org/gluu/util/FileUtil.java:72: warning: no description for @return
     * @return
       ^
/home/jenkins/.jenkins/jobs/oxCore/workspace/oxUtil/src/main/java/org/gluu/util/FileUtil.java:92: warning: no description for @param
     * @param filePath
       ^
/home/jenkins/.jenkins/jobs/oxCore/workspace/oxUtil/src/main/java/org/gluu/util/FileUtil.java:93: warning: no description for @param
     * @param searchStr
       ^
/home/jenkins/.jenkins/jobs/oxCore/workspace/oxUtil/src/main/java/org/gluu/util/FileUtil.java:94: warning: no description for @return
     * @return
       ^
/home/jenkins/.jenkins/jobs/oxCore/workspace/oxUtil/src/main/java/org/gluu/util/FileUtil.java:145: warning: no description for @param
     * @param url
       ^
/home/jenkins/.jenkins/jobs/oxCore/workspace/oxUtil/src/main/java/org/gluu/util/FileUtil.java:146: warning: no description for @return
     * @return
       ^
/home/jenkins/.jenkins/jobs/oxCore/workspace/oxUtil/src/main/java/org/gluu/util/FileUtil.java:175: warning: no description for @param
     * @param filePath
       ^
/home/jenkins/.jenkins/jobs/oxCore/workspace/oxUtil/src/main/java/org/gluu/util/FileUtil.java:176: warning: no description for @return
     * @return
       ^
/home/jenkins/.jenkins/jobs/oxCore/workspace/oxUtil/src/main/java/org/gluu/util/InterfaceRegistry.java:43: warning: no @param for <T>
    public static synchronized <T> T get(Class classInterface) {
                                     ^
/home/jenkins/.jenkins/jobs/oxCore/workspace/oxUtil/src/main/java/org/gluu/util/Util.java:31: error: unknown tag: T
     * @return An ArrayList<T> of the same values *
                           ^
/home/jenkins/.jenkins/jobs/oxCore/workspace/oxUtil/src/main/java/org/gluu/util/Util.java:42: error: unknown tag: String
     * Convert a list of unknown type to a List<String> in a type-safe way
                                               ^
/home/jenkins/.jenkins/jobs/oxCore/workspace/oxUtil/src/main/java/org/gluu/util/Util.java:46: error: unknown tag: String
     * @return List<String> of the items in list
                   ^
/home/jenkins/.jenkins/jobs/oxCore/workspace/oxUtil/src/main/java/org/gluu/util/Util.java:57: error: unknown tag: String
     * Convert a single String to a List<String>
                                        ^
/home/jenkins/.jenkins/jobs/oxCore/workspace/oxUtil/src/main/java/org/gluu/util/Util.java:70: error: unknown tag: String
     * Convert a String array to an List<String>
                                        ^
/home/jenkins/.jenkins/jobs/oxCore/workspace/oxUtil/src/main/java/org/gluu/util/Util.java:74: error: unknown tag: String
     * @return List<String> of the items in the array
                   ^
/home/jenkins/.jenkins/jobs/oxCore/workspace/oxUtil/src/main/java/org/gluu/util/Util.java:100: warning: no description for @throws
     * @throws IOException
       ^
/home/jenkins/.jenkins/jobs/oxCore/workspace/oxUtil/src/main/java/org/gluu/util/Util.java:113: warning: no description for @throws
     * @throws IOException
       ^
/home/jenkins/.jenkins/jobs/oxCore/workspace/oxUtil/src/main/java/org/gluu/util/Util.java:159: warning: no description for @param
     * @param dn
       ^
/home/jenkins/.jenkins/jobs/oxCore/workspace/oxUtil/src/main/java/org/gluu/util/process/ProcessHelper.java:99: warning: no description for @param
     * @param streamHandler
       ^
/home/jenkins/.jenkins/jobs/oxCore/workspace/oxUtil/src/main/java/org/gluu/util/process/ProcessHelper.java:104: warning: no @param for commandLine
    public static PrintResultHandler executeProgram(CommandLine commandLine, long printJobTimeout,
                                     ^
/home/jenkins/.jenkins/jobs/oxCore/workspace/oxUtil/src/main/java/org/gluu/util/process/ProcessHelper.java:104: warning: no @param for successExitValue
    public static PrintResultHandler executeProgram(CommandLine commandLine, long printJobTimeout,
                                     ^
/home/jenkins/.jenkins/jobs/oxCore/workspace/oxUtil/src/main/java/org/gluu/util/process/ProcessHelper.java:116: warning: no description for @param
     * @param streamHandler
       ^
/home/jenkins/.jenkins/jobs/oxCore/workspace/oxUtil/src/main/java/org/gluu/util/process/ProcessHelper.java:121: warning: no @param for commandLine
    public static PrintResultHandler executeProgram(CommandLine commandLine, String workingDirectory,
                                     ^
/home/jenkins/.jenkins/jobs/oxCore/workspace/oxUtil/src/main/java/org/gluu/util/process/ProcessHelper.java:121: warning: no @param for workingDirectory
    public static PrintResultHandler executeProgram(CommandLine commandLine, String workingDirectory,
                                     ^
/home/jenkins/.jenkins/jobs/oxCore/workspace/oxUtil/src/main/java/org/gluu/util/process/ProcessHelper.java:121: warning: no @param for successExitValue
    public static PrintResultHandler executeProgram(CommandLine commandLine, String workingDirectory,
                                     ^
/home/jenkins/.jenkins/jobs/oxCore/workspace/oxUtil/src/main/java/org/gluu/util/security/StringEncrypter.java:137: error: @param name not found
     * @param encryptionKey
              ^
/home/jenkins/.jenkins/jobs/oxCore/workspace/oxUtil/src/main/java/org/gluu/util/security/StringEncrypter.java:139: warning: no description for @throws
     * @throws EncryptionException
       ^
/home/jenkins/.jenkins/jobs/oxCore/workspace/oxUtil/src/main/java/org/gluu/util/security/StringEncrypter.java:159: warning: no description for @throws
     * @throws EncryptionException
       ^
/home/jenkins/.jenkins/jobs/oxCore/workspace/oxUtil/src/main/java/org/gluu/util/security/StringEncrypter.java:225: warning: no description for @throws
     * @throws EncryptionException
       ^
/home/jenkins/.jenkins/jobs/oxCore/workspace/oxUtil/src/main/java/org/gluu/util/security/StringEncrypter.java:246: warning: no description for @throws
     * @throws EncryptionException
       ^
/home/jenkins/.jenkins/jobs/oxCore/workspace/oxUtil/src/main/java/org/gluu/util/security/StringEncrypter.java:248: warning: no @param for encryptionKey
    public String decrypt(final String encryptedString, String encryptionKey) throws EncryptionException {
                  ^
/home/jenkins/.jenkins/jobs/oxCore/workspace/oxUtil/src/main/java/org/gluu/util/security/StringEncrypter.java:300: warning: no description for @throws
     * @throws EncryptionException
       ^
/home/jenkins/.jenkins/jobs/oxCore/workspace/oxUtil/src/main/java/org/gluu/util/security/StringEncrypter.java:317: warning: no description for @throws
     * @throws EncryptionException
       ^
/home/jenkins/.jenkins/jobs/oxCore/workspace/oxUtil/src/main/java/org/gluu/util/security/StringEncrypter.java:319: warning: no @param for encryptionKey
    public String encrypt(final String unencryptedString, String encryptionKey) throws EncryptionException {
                  ^
/home/jenkins/.jenkins/jobs/oxCore/workspace/oxUtil/src/main/java/org/gluu/xml/XMLValidator.java:31: warning: no description for @param
     * @param stream
       ^
/home/jenkins/.jenkins/jobs/oxCore/workspace/oxUtil/src/main/java/org/gluu/xml/XMLValidator.java:32: warning: no description for @param
     * @param validationSchema
       ^
/home/jenkins/.jenkins/jobs/oxCore/workspace/oxUtil/src/main/java/org/gluu/xml/XMLValidator.java:33: warning: no description for @throws
     * @throws IOException
       ^
/home/jenkins/.jenkins/jobs/oxCore/workspace/oxUtil/src/main/java/org/gluu/xml/XMLValidator.java:34: warning: no description for @throws
     * @throws SAXException
       ^
/home/jenkins/.jenkins/jobs/oxCore/workspace/oxUtil/src/main/java/org/gluu/xml/XMLValidator.java:35: warning: no description for @throws
     * @throws ParserConfigurationException
       ^

Command line was: /opt/java/amazon-corretto-11.0.7.10.1-linux-x64/bin/javadoc @options @packages

Refer to the generated Javadoc files in '/home/jenkins/.jenkins/jobs/oxCore/workspace/oxUtil/target/site/apidocs' dir.

	at org.apache.maven.plugins.javadoc.AbstractJavadocMojo.executeJavadocCommandLine(AbstractJavadocMojo.java:5298)
	at org.apache.maven.plugins.javadoc.AbstractJavadocMojo.executeReport(AbstractJavadocMojo.java:2134)
	at org.apache.maven.plugins.javadoc.JavadocReport.generate(JavadocReport.java:134)
	at org.apache.maven.plugins.javadoc.JavadocReport.doExecute(JavadocReport.java:329)
	at org.apache.maven.plugins.javadoc.AbstractJavadocMojo.execute(AbstractJavadocMojo.java:1912)
	at org.apache.maven.plugin.DefaultBuildPluginManager.executeMojo(DefaultBuildPluginManager.java:134)
	at org.apache.maven.lifecycle.internal.MojoExecutor.execute(MojoExecutor.java:207)
	at org.apache.maven.lifecycle.internal.MojoExecutor.execute(MojoExecutor.java:153)
	at org.apache.maven.lifecycle.internal.MojoExecutor.execute(MojoExecutor.java:145)
	at org.apache.maven.lifecycle.internal.LifecycleModuleBuilder.buildProject(LifecycleModuleBuilder.java:116)
	at org.apache.maven.lifecycle.internal.LifecycleModuleBuilder.buildProject(LifecycleModuleBuilder.java:80)
	at org.apache.maven.lifecycle.internal.builder.singlethreaded.SingleThreadedBuilder.build(SingleThreadedBuilder.java:51)
	at org.apache.maven.lifecycle.internal.LifecycleStarter.execute(LifecycleStarter.java:128)
	at org.apache.maven.DefaultMaven.doExecute(DefaultMaven.java:307)
	at org.apache.maven.DefaultMaven.doExecute(DefaultMaven.java:193)
	at org.apache.maven.DefaultMaven.execute(DefaultMaven.java:106)
	at org.apache.maven.cli.MavenCli.execute(MavenCli.java:863)
	at org.apache.maven.cli.MavenCli.doMain(MavenCli.java:288)
	at org.apache.maven.cli.MavenCli.main(MavenCli.java:199)
	at java.base/jdk.internal.reflect.NativeMethodAccessorImpl.invoke0(Native Method)
	at java.base/jdk.internal.reflect.NativeMethodAccessorImpl.invoke(NativeMethodAccessorImpl.java:62)
	at java.base/jdk.internal.reflect.DelegatingMethodAccessorImpl.invoke(DelegatingMethodAccessorImpl.java:43)
	at java.base/java.lang.reflect.Method.invoke(Method.java:566)
	at org.codehaus.plexus.classworlds.launcher.Launcher.launchEnhanced(Launcher.java:289)
	at org.codehaus.plexus.classworlds.launcher.Launcher.launch(Launcher.java:229)
	at org.codehaus.plexus.classworlds.launcher.Launcher.mainWithExitCode(Launcher.java:415)
	at org.codehaus.plexus.classworlds.launcher.Launcher.main(Launcher.java:356)
[INFO] 
[INFO] --- maven-site-plugin:2.1.1:site (default-site) @ oxcore-util ---
[INFO]                                                                         
[INFO] ------------------------------------------------------------------------
[INFO] Building oxModel 4.3.1-SNAPSHOT
[INFO] ------------------------------------------------------------------------
[INFO] 
[INFO] --- maven-clean-plugin:2.4.1:clean (default-clean) @ oxcore-model ---
[INFO] Deleting /home/jenkins/.jenkins/jobs/oxCore/workspace/oxModel/target
[INFO] 
[INFO] --- maven-resources-plugin:2.4:resources (default-resources) @ oxcore-model ---
[INFO] Using 'UTF-8' encoding to copy filtered resources.
[INFO] skip non existing resourceDirectory /home/jenkins/.jenkins/jobs/oxCore/workspace/oxModel/src/main/resources
[INFO] 
[INFO] --- maven-compiler-plugin:2.3.2:compile (default-compile) @ oxcore-model ---
[INFO] Compiling 18 source files to /home/jenkins/.jenkins/jobs/oxCore/workspace/oxModel/target/classes
[INFO] 
[INFO] --- maven-resources-plugin:2.4:resources (default-resources) @ oxcore-model ---
[INFO] Using 'UTF-8' encoding to copy filtered resources.
[INFO] skip non existing resourceDirectory /home/jenkins/.jenkins/jobs/oxCore/workspace/oxModel/src/main/resources
[INFO] 
[INFO] --- maven-compiler-plugin:2.3.2:compile (default-compile) @ oxcore-model ---
[INFO] Nothing to compile - all classes are up to date
[INFO] 
[INFO] --- maven-resources-plugin:2.4:testResources (default-testResources) @ oxcore-model ---
[INFO] Using 'UTF-8' encoding to copy filtered resources.
[INFO] skip non existing resourceDirectory /home/jenkins/.jenkins/jobs/oxCore/workspace/oxModel/src/test/resources
[INFO] 
[INFO] --- maven-compiler-plugin:2.3.2:testCompile (default-testCompile) @ oxcore-model ---
[INFO] No sources to compile
[INFO] 
[INFO] --- maven-surefire-plugin:2.7.2:test (default-test) @ oxcore-model ---
[INFO] No tests to run.
[INFO] Surefire report directory: /home/jenkins/.jenkins/jobs/oxCore/workspace/oxModel/target/surefire-reports

-------------------------------------------------------
 T E S T S
-------------------------------------------------------
There are no tests to run.

Results :

Tests run: 0, Failures: 0, Errors: 0, Skipped: 0

[INFO] 
[INFO] --- maven-jar-plugin:2.4:jar (default-jar) @ oxcore-model ---
[INFO] Building jar: /home/jenkins/.jenkins/jobs/oxCore/workspace/oxModel/target/oxcore-model-4.3.1-SNAPSHOT.jar
[INFO] 
[INFO] --- maven-install-plugin:2.3.1:install (default-install) @ oxcore-model ---
[INFO] Installing /home/jenkins/.jenkins/jobs/oxCore/workspace/oxModel/target/oxcore-model-4.3.1-SNAPSHOT.jar to /var/www/html/maven/org/gluu/oxcore-model/4.3.1-SNAPSHOT/oxcore-model-4.3.1-SNAPSHOT.jar
[INFO] Installing /home/jenkins/.jenkins/jobs/oxCore/workspace/oxModel/pom.xml to /var/www/html/maven/org/gluu/oxcore-model/4.3.1-SNAPSHOT/oxcore-model-4.3.1-SNAPSHOT.pom
[INFO] 
[INFO] >>> maven-javadoc-plugin:3.0.1:javadoc (default-cli) > generate-sources @ oxcore-model >>>
[INFO] 
[INFO] <<< maven-javadoc-plugin:3.0.1:javadoc (default-cli) < generate-sources @ oxcore-model <<<
[INFO] 
[INFO] --- maven-javadoc-plugin:3.0.1:javadoc (default-cli) @ oxcore-model ---
[INFO] 
Loading source files for package org.gluu.model.attribute...
Loading source files for package org.gluu.model.metric.counter...
Loading source files for package org.gluu.model.metric.ldap...
Loading source files for package org.gluu.model.metric.timer...
Loading source files for package org.gluu.model.metric...
Loading source files for package org.gluu.model.uma...
Loading source files for package org.gluu.model.user...
Loading source files for package org.gluu.model...
Loading source files for package org.gluu.model.types...
Constructing Javadoc information...
Standard Doclet version 11.0.7
Building tree for all the packages and classes...
Generating /home/jenkins/.jenkins/jobs/oxCore/workspace/oxModel/target/site/apidocs/org/gluu/model/ApplicationType.html...
Generating /home/jenkins/.jenkins/jobs/oxCore/workspace/oxModel/target/site/apidocs/org/gluu/model/GluuStatus.html...
Generating /home/jenkins/.jenkins/jobs/oxCore/workspace/oxModel/target/site/apidocs/org/gluu/model/attribute/Attribute.html...
Generating /home/jenkins/.jenkins/jobs/oxCore/workspace/oxModel/target/site/apidocs/org/gluu/model/attribute/AttributeDataType.html...
Generating /home/jenkins/.jenkins/jobs/oxCore/workspace/oxModel/target/site/apidocs/org/gluu/model/attribute/AttributeUsageType.html...
Generating /home/jenkins/.jenkins/jobs/oxCore/workspace/oxModel/target/site/apidocs/org/gluu/model/attribute/AttributeValidation.html...
Generating /home/jenkins/.jenkins/jobs/oxCore/workspace/oxModel/target/site/apidocs/org/gluu/model/metric/MetricData.html...
Generating /home/jenkins/.jenkins/jobs/oxCore/workspace/oxModel/target/site/apidocs/org/gluu/model/metric/MetricType.html...
Generating /home/jenkins/.jenkins/jobs/oxCore/workspace/oxModel/target/site/apidocs/org/gluu/model/metric/counter/CounterMetricData.html...
Generating /home/jenkins/.jenkins/jobs/oxCore/workspace/oxModel/target/site/apidocs/org/gluu/model/metric/counter/CounterMetricEntry.html...
Generating /home/jenkins/.jenkins/jobs/oxCore/workspace/oxModel/target/site/apidocs/org/gluu/model/metric/ldap/MetricEntry.html...
Generating /home/jenkins/.jenkins/jobs/oxCore/workspace/oxModel/target/site/apidocs/org/gluu/model/metric/ldap/MetricReport.html...
Generating /home/jenkins/.jenkins/jobs/oxCore/workspace/oxModel/target/site/apidocs/org/gluu/model/metric/timer/TimerMetricData.html...
Generating /home/jenkins/.jenkins/jobs/oxCore/workspace/oxModel/target/site/apidocs/org/gluu/model/metric/timer/TimerMetricEntry.html...
Generating /home/jenkins/.jenkins/jobs/oxCore/workspace/oxModel/target/site/apidocs/org/gluu/model/types/LoggingLayoutType.html...
Generating /home/jenkins/.jenkins/jobs/oxCore/workspace/oxModel/target/site/apidocs/org/gluu/model/uma/ClaimDefinition.html...
Generating /home/jenkins/.jenkins/jobs/oxCore/workspace/oxModel/target/site/apidocs/org/gluu/model/uma/ClaimDefinitionList.html...
Generating /home/jenkins/.jenkins/jobs/oxCore/workspace/oxModel/target/site/apidocs/org/gluu/model/user/UserRole.html...
Generating /home/jenkins/.jenkins/jobs/oxCore/workspace/oxModel/target/site/apidocs/org/gluu/model/package-summary.html...
Generating /home/jenkins/.jenkins/jobs/oxCore/workspace/oxModel/target/site/apidocs/org/gluu/model/package-tree.html...
Generating /home/jenkins/.jenkins/jobs/oxCore/workspace/oxModel/target/site/apidocs/org/gluu/model/attribute/package-summary.html...
Generating /home/jenkins/.jenkins/jobs/oxCore/workspace/oxModel/target/site/apidocs/org/gluu/model/attribute/package-tree.html...
Generating /home/jenkins/.jenkins/jobs/oxCore/workspace/oxModel/target/site/apidocs/org/gluu/model/metric/package-summary.html...
Generating /home/jenkins/.jenkins/jobs/oxCore/workspace/oxModel/target/site/apidocs/org/gluu/model/metric/package-tree.html...
Generating /home/jenkins/.jenkins/jobs/oxCore/workspace/oxModel/target/site/apidocs/org/gluu/model/metric/counter/package-summary.html...
Generating /home/jenkins/.jenkins/jobs/oxCore/workspace/oxModel/target/site/apidocs/org/gluu/model/metric/counter/package-tree.html...
Generating /home/jenkins/.jenkins/jobs/oxCore/workspace/oxModel/target/site/apidocs/org/gluu/model/metric/ldap/package-summary.html...
Generating /home/jenkins/.jenkins/jobs/oxCore/workspace/oxModel/target/site/apidocs/org/gluu/model/metric/ldap/package-tree.html...
Generating /home/jenkins/.jenkins/jobs/oxCore/workspace/oxModel/target/site/apidocs/org/gluu/model/metric/timer/package-summary.html...
Generating /home/jenkins/.jenkins/jobs/oxCore/workspace/oxModel/target/site/apidocs/org/gluu/model/metric/timer/package-tree.html...
Generating /home/jenkins/.jenkins/jobs/oxCore/workspace/oxModel/target/site/apidocs/org/gluu/model/types/package-summary.html...
Generating /home/jenkins/.jenkins/jobs/oxCore/workspace/oxModel/target/site/apidocs/org/gluu/model/types/package-tree.html...
Generating /home/jenkins/.jenkins/jobs/oxCore/workspace/oxModel/target/site/apidocs/org/gluu/model/uma/package-summary.html...
Generating /home/jenkins/.jenkins/jobs/oxCore/workspace/oxModel/target/site/apidocs/org/gluu/model/uma/package-tree.html...
Generating /home/jenkins/.jenkins/jobs/oxCore/workspace/oxModel/target/site/apidocs/org/gluu/model/user/package-summary.html...
Generating /home/jenkins/.jenkins/jobs/oxCore/workspace/oxModel/target/site/apidocs/org/gluu/model/user/package-tree.html...
Generating /home/jenkins/.jenkins/jobs/oxCore/workspace/oxModel/target/site/apidocs/constant-values.html...
Generating /home/jenkins/.jenkins/jobs/oxCore/workspace/oxModel/target/site/apidocs/serialized-form.html...
Generating /home/jenkins/.jenkins/jobs/oxCore/workspace/oxModel/target/site/apidocs/org/gluu/model/attribute/class-use/AttributeDataType.html...
Generating /home/jenkins/.jenkins/jobs/oxCore/workspace/oxModel/target/site/apidocs/org/gluu/model/attribute/class-use/AttributeUsageType.html...
Generating /home/jenkins/.jenkins/jobs/oxCore/workspace/oxModel/target/site/apidocs/org/gluu/model/attribute/class-use/AttributeValidation.html...
Generating /home/jenkins/.jenkins/jobs/oxCore/workspace/oxModel/target/site/apidocs/org/gluu/model/attribute/class-use/Attribute.html...
Generating /home/jenkins/.jenkins/jobs/oxCore/workspace/oxModel/target/site/apidocs/org/gluu/model/metric/counter/class-use/CounterMetricData.html...
Generating /home/jenkins/.jenkins/jobs/oxCore/workspace/oxModel/target/site/apidocs/org/gluu/model/metric/counter/class-use/CounterMetricEntry.html...
Generating /home/jenkins/.jenkins/jobs/oxCore/workspace/oxModel/target/site/apidocs/org/gluu/model/metric/ldap/class-use/MetricReport.html...
Generating /home/jenkins/.jenkins/jobs/oxCore/workspace/oxModel/target/site/apidocs/org/gluu/model/metric/ldap/class-use/MetricEntry.html...
Generating /home/jenkins/.jenkins/jobs/oxCore/workspace/oxModel/target/site/apidocs/org/gluu/model/metric/timer/class-use/TimerMetricData.html...
Generating /home/jenkins/.jenkins/jobs/oxCore/workspace/oxModel/target/site/apidocs/org/gluu/model/metric/timer/class-use/TimerMetricEntry.html...
Generating /home/jenkins/.jenkins/jobs/oxCore/workspace/oxModel/target/site/apidocs/org/gluu/model/metric/class-use/MetricData.html...
Generating /home/jenkins/.jenkins/jobs/oxCore/workspace/oxModel/target/site/apidocs/org/gluu/model/metric/class-use/MetricType.html...
Generating /home/jenkins/.jenkins/jobs/oxCore/workspace/oxModel/target/site/apidocs/org/gluu/model/uma/class-use/ClaimDefinition.html...
Generating /home/jenkins/.jenkins/jobs/oxCore/workspace/oxModel/target/site/apidocs/org/gluu/model/uma/class-use/ClaimDefinitionList.html...
Generating /home/jenkins/.jenkins/jobs/oxCore/workspace/oxModel/target/site/apidocs/org/gluu/model/user/class-use/UserRole.html...
Generating /home/jenkins/.jenkins/jobs/oxCore/workspace/oxModel/target/site/apidocs/org/gluu/model/class-use/GluuStatus.html...
Generating /home/jenkins/.jenkins/jobs/oxCore/workspace/oxModel/target/site/apidocs/org/gluu/model/class-use/ApplicationType.html...
Generating /home/jenkins/.jenkins/jobs/oxCore/workspace/oxModel/target/site/apidocs/org/gluu/model/types/class-use/LoggingLayoutType.html...
Generating /home/jenkins/.jenkins/jobs/oxCore/workspace/oxModel/target/site/apidocs/org/gluu/model/package-use.html...
Generating /home/jenkins/.jenkins/jobs/oxCore/workspace/oxModel/target/site/apidocs/org/gluu/model/attribute/package-use.html...
Generating /home/jenkins/.jenkins/jobs/oxCore/workspace/oxModel/target/site/apidocs/org/gluu/model/metric/package-use.html...
Generating /home/jenkins/.jenkins/jobs/oxCore/workspace/oxModel/target/site/apidocs/org/gluu/model/metric/counter/package-use.html...
Generating /home/jenkins/.jenkins/jobs/oxCore/workspace/oxModel/target/site/apidocs/org/gluu/model/metric/ldap/package-use.html...
Generating /home/jenkins/.jenkins/jobs/oxCore/workspace/oxModel/target/site/apidocs/org/gluu/model/metric/timer/package-use.html...
Generating /home/jenkins/.jenkins/jobs/oxCore/workspace/oxModel/target/site/apidocs/org/gluu/model/types/package-use.html...
Generating /home/jenkins/.jenkins/jobs/oxCore/workspace/oxModel/target/site/apidocs/org/gluu/model/uma/package-use.html...
Generating /home/jenkins/.jenkins/jobs/oxCore/workspace/oxModel/target/site/apidocs/org/gluu/model/user/package-use.html...
Building index for all the packages and classes...
Generating /home/jenkins/.jenkins/jobs/oxCore/workspace/oxModel/target/site/apidocs/overview-tree.html...
Generating /home/jenkins/.jenkins/jobs/oxCore/workspace/oxModel/target/site/apidocs/index-all.html...
Building index for all classes...
Generating /home/jenkins/.jenkins/jobs/oxCore/workspace/oxModel/target/site/apidocs/allclasses-index.html...
Generating /home/jenkins/.jenkins/jobs/oxCore/workspace/oxModel/target/site/apidocs/allpackages-index.html...
Generating /home/jenkins/.jenkins/jobs/oxCore/workspace/oxModel/target/site/apidocs/deprecated-list.html...
Building index for all classes...
Generating /home/jenkins/.jenkins/jobs/oxCore/workspace/oxModel/target/site/apidocs/allclasses.html...
Generating /home/jenkins/.jenkins/jobs/oxCore/workspace/oxModel/target/site/apidocs/allclasses.html...
Generating /home/jenkins/.jenkins/jobs/oxCore/workspace/oxModel/target/site/apidocs/index.html...
Generating /home/jenkins/.jenkins/jobs/oxCore/workspace/oxModel/target/site/apidocs/overview-summary.html...
Generating /home/jenkins/.jenkins/jobs/oxCore/workspace/oxModel/target/site/apidocs/help-doc.html...
1 error
[ERROR] Error while creating javadoc report: 
Exit code: 1 - javadoc: error - The code being documented uses modules but the packages defined in https://docs.oracle.com/javase/8/docs/api/ are in the unnamed module.

Command line was: /opt/java/amazon-corretto-11.0.7.10.1-linux-x64/bin/javadoc @options @packages

Refer to the generated Javadoc files in '/home/jenkins/.jenkins/jobs/oxCore/workspace/oxModel/target/site/apidocs' dir.

org.apache.maven.reporting.MavenReportException: 
Exit code: 1 - javadoc: error - The code being documented uses modules but the packages defined in https://docs.oracle.com/javase/8/docs/api/ are in the unnamed module.

Command line was: /opt/java/amazon-corretto-11.0.7.10.1-linux-x64/bin/javadoc @options @packages

Refer to the generated Javadoc files in '/home/jenkins/.jenkins/jobs/oxCore/workspace/oxModel/target/site/apidocs' dir.

	at org.apache.maven.plugins.javadoc.AbstractJavadocMojo.executeJavadocCommandLine(AbstractJavadocMojo.java:5298)
	at org.apache.maven.plugins.javadoc.AbstractJavadocMojo.executeReport(AbstractJavadocMojo.java:2134)
	at org.apache.maven.plugins.javadoc.JavadocReport.generate(JavadocReport.java:134)
	at org.apache.maven.plugins.javadoc.JavadocReport.doExecute(JavadocReport.java:329)
	at org.apache.maven.plugins.javadoc.AbstractJavadocMojo.execute(AbstractJavadocMojo.java:1912)
	at org.apache.maven.plugin.DefaultBuildPluginManager.executeMojo(DefaultBuildPluginManager.java:134)
	at org.apache.maven.lifecycle.internal.MojoExecutor.execute(MojoExecutor.java:207)
	at org.apache.maven.lifecycle.internal.MojoExecutor.execute(MojoExecutor.java:153)
	at org.apache.maven.lifecycle.internal.MojoExecutor.execute(MojoExecutor.java:145)
	at org.apache.maven.lifecycle.internal.LifecycleModuleBuilder.buildProject(LifecycleModuleBuilder.java:116)
	at org.apache.maven.lifecycle.internal.LifecycleModuleBuilder.buildProject(LifecycleModuleBuilder.java:80)
	at org.apache.maven.lifecycle.internal.builder.singlethreaded.SingleThreadedBuilder.build(SingleThreadedBuilder.java:51)
	at org.apache.maven.lifecycle.internal.LifecycleStarter.execute(LifecycleStarter.java:128)
	at org.apache.maven.DefaultMaven.doExecute(DefaultMaven.java:307)
	at org.apache.maven.DefaultMaven.doExecute(DefaultMaven.java:193)
	at org.apache.maven.DefaultMaven.execute(DefaultMaven.java:106)
	at org.apache.maven.cli.MavenCli.execute(MavenCli.java:863)
	at org.apache.maven.cli.MavenCli.doMain(MavenCli.java:288)
	at org.apache.maven.cli.MavenCli.main(MavenCli.java:199)
	at java.base/jdk.internal.reflect.NativeMethodAccessorImpl.invoke0(Native Method)
	at java.base/jdk.internal.reflect.NativeMethodAccessorImpl.invoke(NativeMethodAccessorImpl.java:62)
	at java.base/jdk.internal.reflect.DelegatingMethodAccessorImpl.invoke(DelegatingMethodAccessorImpl.java:43)
	at java.base/java.lang.reflect.Method.invoke(Method.java:566)
	at org.codehaus.plexus.classworlds.launcher.Launcher.launchEnhanced(Launcher.java:289)
	at org.codehaus.plexus.classworlds.launcher.Launcher.launch(Launcher.java:229)
	at org.codehaus.plexus.classworlds.launcher.Launcher.mainWithExitCode(Launcher.java:415)
	at org.codehaus.plexus.classworlds.launcher.Launcher.main(Launcher.java:356)
[INFO] 
[INFO] --- maven-site-plugin:2.1.1:site (default-site) @ oxcore-model ---
[INFO]                                                                         
[INFO] ------------------------------------------------------------------------
[INFO] Building Caches support 4.3.1-SNAPSHOT
[INFO] ------------------------------------------------------------------------
[INFO] 
[INFO] --- maven-clean-plugin:2.4.1:clean (default-clean) @ oxcore-cache ---
[INFO] Deleting /home/jenkins/.jenkins/jobs/oxCore/workspace/core-cache/target
[INFO] 
[INFO] --- maven-resources-plugin:2.4:resources (default-resources) @ oxcore-cache ---
[INFO] Using 'UTF-8' encoding to copy filtered resources.
[INFO] Copying 1 resource
[INFO] 
[INFO] --- maven-compiler-plugin:2.3.2:compile (default-compile) @ oxcore-cache ---
[INFO] Compiling 28 source files to /home/jenkins/.jenkins/jobs/oxCore/workspace/core-cache/target/classes
[INFO] 
[INFO] --- maven-resources-plugin:2.4:resources (default-resources) @ oxcore-cache ---
[INFO] Using 'UTF-8' encoding to copy filtered resources.
[INFO] Copying 1 resource
[INFO] 
[INFO] --- maven-compiler-plugin:2.3.2:compile (default-compile) @ oxcore-cache ---
[INFO] Nothing to compile - all classes are up to date
[INFO] 
[INFO] --- maven-resources-plugin:2.4:testResources (default-testResources) @ oxcore-cache ---
[INFO] Using 'UTF-8' encoding to copy filtered resources.
[INFO] skip non existing resourceDirectory /home/jenkins/.jenkins/jobs/oxCore/workspace/core-cache/src/test/resources
[INFO] 
[INFO] --- maven-compiler-plugin:2.3.2:testCompile (default-testCompile) @ oxcore-cache ---
[INFO] No sources to compile
[INFO] 
[INFO] --- maven-surefire-plugin:2.7.2:test (default-test) @ oxcore-cache ---
[INFO] No tests to run.
[INFO] Surefire report directory: /home/jenkins/.jenkins/jobs/oxCore/workspace/core-cache/target/surefire-reports
There are no tests to run.
[INFO] 
[INFO] --- maven-jar-plugin:2.4:jar (default-jar) @ oxcore-cache ---
[INFO] Building jar: /home/jenkins/.jenkins/jobs/oxCore/workspace/core-cache/target/oxcore-cache-4.3.1-SNAPSHOT.jar
[INFO] 
[INFO] --- maven-install-plugin:2.3.1:install (default-install) @ oxcore-cache ---
[INFO] Installing /home/jenkins/.jenkins/jobs/oxCore/workspace/core-cache/target/oxcore-cache-4.3.1-SNAPSHOT.jar to /var/www/html/maven/org/gluu/oxcore-cache/4.3.1-SNAPSHOT/oxcore-cache-4.3.1-SNAPSHOT.jar
[INFO] Installing /home/jenkins/.jenkins/jobs/oxCore/workspace/core-cache/pom.xml to /var/www/html/maven/org/gluu/oxcore-cache/4.3.1-SNAPSHOT/oxcore-cache-4.3.1-SNAPSHOT.pom
[INFO] 
[INFO] >>> maven-javadoc-plugin:3.0.1:javadoc (default-cli) > generate-sources @ oxcore-cache >>>
[INFO] 
[INFO] <<< maven-javadoc-plugin:3.0.1:javadoc (default-cli) < generate-sources @ oxcore-cache <<<
[INFO] 
[INFO] --- maven-javadoc-plugin:3.0.1:javadoc (default-cli) @ oxcore-cache ---
[ERROR] Error fetching link: /home/jenkins/.jenkins/jobs/oxCore/workspace/oxUtil/target/site/apidocs/package-list. Ignored it.
[INFO] 
Loading source files for package org.gluu.service.cache...
Loading source files for package org.gluu.service...
Constructing Javadoc information...
Standard Doclet version 11.0.7
Building tree for all the packages and classes...
Generating /home/jenkins/.jenkins/jobs/oxCore/workspace/core-cache/target/site/apidocs/org/gluu/service/BaseCacheService.html...
Generating /home/jenkins/.jenkins/jobs/oxCore/workspace/core-cache/target/site/apidocs/org/gluu/service/CacheService.html...
Generating /home/jenkins/.jenkins/jobs/oxCore/workspace/core-cache/target/site/apidocs/org/gluu/service/cache/AbstractCacheProvider.html...
Generating /home/jenkins/.jenkins/jobs/oxCore/workspace/core-cache/target/site/apidocs/org/gluu/service/cache/AbstractRedisProvider.html...
Generating /home/jenkins/.jenkins/jobs/oxCore/workspace/core-cache/target/site/apidocs/org/gluu/service/cache/CacheConfiguration.html...
Generating /home/jenkins/.jenkins/jobs/oxCore/workspace/core-cache/target/site/apidocs/org/gluu/service/cache/CacheInterface.html...
Generating /home/jenkins/.jenkins/jobs/oxCore/workspace/core-cache/target/site/apidocs/org/gluu/service/cache/CacheProvider.html...
Generating /home/jenkins/.jenkins/jobs/oxCore/workspace/core-cache/target/site/apidocs/org/gluu/service/cache/CacheProviderFactory.html...
Generating /home/jenkins/.jenkins/jobs/oxCore/workspace/core-cache/target/site/apidocs/org/gluu/service/cache/CacheProviderType.html...
Generating /home/jenkins/.jenkins/jobs/oxCore/workspace/core-cache/target/site/apidocs/org/gluu/service/cache/InMemoryCacheProvider.html...
Generating /home/jenkins/.jenkins/jobs/oxCore/workspace/core-cache/target/site/apidocs/org/gluu/service/cache/InMemoryConfiguration.html...
Generating /home/jenkins/.jenkins/jobs/oxCore/workspace/core-cache/target/site/apidocs/org/gluu/service/cache/LocalCache.html...
Generating /home/jenkins/.jenkins/jobs/oxCore/workspace/core-cache/target/site/apidocs/org/gluu/service/cache/LocalCache.Literal.html...
Generating /home/jenkins/.jenkins/jobs/oxCore/workspace/core-cache/target/site/apidocs/org/gluu/service/cache/MemcachedConfiguration.html...
Generating /home/jenkins/.jenkins/jobs/oxCore/workspace/core-cache/target/site/apidocs/org/gluu/service/cache/MemcachedConnectionFactoryType.html...
Generating /home/jenkins/.jenkins/jobs/oxCore/workspace/core-cache/target/site/apidocs/org/gluu/service/cache/MemcachedProvider.html...
Generating /home/jenkins/.jenkins/jobs/oxCore/workspace/core-cache/target/site/apidocs/org/gluu/service/cache/NativePersistenceCacheEntity.html...
Generating /home/jenkins/.jenkins/jobs/oxCore/workspace/core-cache/target/site/apidocs/org/gluu/service/cache/NativePersistenceCacheProvider.html...
Generating /home/jenkins/.jenkins/jobs/oxCore/workspace/core-cache/target/site/apidocs/org/gluu/service/cache/NativePersistenceConfiguration.html...
Generating /home/jenkins/.jenkins/jobs/oxCore/workspace/core-cache/target/site/apidocs/org/gluu/service/cache/RedisClusterProvider.html...
Generating /home/jenkins/.jenkins/jobs/oxCore/workspace/core-cache/target/site/apidocs/org/gluu/service/cache/RedisConfiguration.html...
Generating /home/jenkins/.jenkins/jobs/oxCore/workspace/core-cache/target/site/apidocs/org/gluu/service/cache/RedisProvider.html...
Generating /home/jenkins/.jenkins/jobs/oxCore/workspace/core-cache/target/site/apidocs/org/gluu/service/cache/RedisProviderFactory.html...
Generating /home/jenkins/.jenkins/jobs/oxCore/workspace/core-cache/target/site/apidocs/org/gluu/service/cache/RedisProviderType.html...
Generating /home/jenkins/.jenkins/jobs/oxCore/workspace/core-cache/target/site/apidocs/org/gluu/service/cache/RedisSentinelProvider.html...
Generating /home/jenkins/.jenkins/jobs/oxCore/workspace/core-cache/target/site/apidocs/org/gluu/service/cache/RedisSetParams.html...
Generating /home/jenkins/.jenkins/jobs/oxCore/workspace/core-cache/target/site/apidocs/org/gluu/service/cache/RedisShardedProvider.html...
Generating /home/jenkins/.jenkins/jobs/oxCore/workspace/core-cache/target/site/apidocs/org/gluu/service/cache/RedisStandaloneProvider.html...
Generating /home/jenkins/.jenkins/jobs/oxCore/workspace/core-cache/target/site/apidocs/org/gluu/service/cache/StandaloneCacheProviderFactory.html...
Generating /home/jenkins/.jenkins/jobs/oxCore/workspace/core-cache/target/site/apidocs/org/gluu/service/package-summary.html...
Generating /home/jenkins/.jenkins/jobs/oxCore/workspace/core-cache/target/site/apidocs/org/gluu/service/package-tree.html...
Generating /home/jenkins/.jenkins/jobs/oxCore/workspace/core-cache/target/site/apidocs/org/gluu/service/cache/package-summary.html...
Generating /home/jenkins/.jenkins/jobs/oxCore/workspace/core-cache/target/site/apidocs/org/gluu/service/cache/package-tree.html...
Generating /home/jenkins/.jenkins/jobs/oxCore/workspace/core-cache/target/site/apidocs/constant-values.html...
Generating /home/jenkins/.jenkins/jobs/oxCore/workspace/core-cache/target/site/apidocs/serialized-form.html...
Generating /home/jenkins/.jenkins/jobs/oxCore/workspace/core-cache/target/site/apidocs/org/gluu/service/cache/class-use/AbstractCacheProvider.html...
Generating /home/jenkins/.jenkins/jobs/oxCore/workspace/core-cache/target/site/apidocs/org/gluu/service/cache/class-use/CacheConfiguration.html...
Generating /home/jenkins/.jenkins/jobs/oxCore/workspace/core-cache/target/site/apidocs/org/gluu/service/cache/class-use/CacheInterface.html...
Generating /home/jenkins/.jenkins/jobs/oxCore/workspace/core-cache/target/site/apidocs/org/gluu/service/cache/class-use/CacheProviderFactory.html...
Generating /home/jenkins/.jenkins/jobs/oxCore/workspace/core-cache/target/site/apidocs/org/gluu/service/cache/class-use/CacheProviderType.html...
Generating /home/jenkins/.jenkins/jobs/oxCore/workspace/core-cache/target/site/apidocs/org/gluu/service/cache/class-use/InMemoryConfiguration.html...
Generating /home/jenkins/.jenkins/jobs/oxCore/workspace/core-cache/target/site/apidocs/org/gluu/service/cache/class-use/LocalCache.html...
Generating /home/jenkins/.jenkins/jobs/oxCore/workspace/core-cache/target/site/apidocs/org/gluu/service/cache/class-use/LocalCache.Literal.html...
Generating /home/jenkins/.jenkins/jobs/oxCore/workspace/core-cache/target/site/apidocs/org/gluu/service/cache/class-use/MemcachedConfiguration.html...
Generating /home/jenkins/.jenkins/jobs/oxCore/workspace/core-cache/target/site/apidocs/org/gluu/service/cache/class-use/MemcachedConnectionFactoryType.html...
Generating /home/jenkins/.jenkins/jobs/oxCore/workspace/core-cache/target/site/apidocs/org/gluu/service/cache/class-use/NativePersistenceConfiguration.html...
Generating /home/jenkins/.jenkins/jobs/oxCore/workspace/core-cache/target/site/apidocs/org/gluu/service/cache/class-use/RedisProviderFactory.html...
Generating /home/jenkins/.jenkins/jobs/oxCore/workspace/core-cache/target/site/apidocs/org/gluu/service/cache/class-use/RedisProviderType.html...
Generating /home/jenkins/.jenkins/jobs/oxCore/workspace/core-cache/target/site/apidocs/org/gluu/service/cache/class-use/RedisSetParams.html...
Generating /home/jenkins/.jenkins/jobs/oxCore/workspace/core-cache/target/site/apidocs/org/gluu/service/cache/class-use/StandaloneCacheProviderFactory.html...
Generating /home/jenkins/.jenkins/jobs/oxCore/workspace/core-cache/target/site/apidocs/org/gluu/service/cache/class-use/AbstractRedisProvider.html...
Generating /home/jenkins/.jenkins/jobs/oxCore/workspace/core-cache/target/site/apidocs/org/gluu/service/cache/class-use/CacheProvider.html...
Generating /home/jenkins/.jenkins/jobs/oxCore/workspace/core-cache/target/site/apidocs/org/gluu/service/cache/class-use/InMemoryCacheProvider.html...
Generating /home/jenkins/.jenkins/jobs/oxCore/workspace/core-cache/target/site/apidocs/org/gluu/service/cache/class-use/MemcachedProvider.html...
Generating /home/jenkins/.jenkins/jobs/oxCore/workspace/core-cache/target/site/apidocs/org/gluu/service/cache/class-use/NativePersistenceCacheEntity.html...
Generating /home/jenkins/.jenkins/jobs/oxCore/workspace/core-cache/target/site/apidocs/org/gluu/service/cache/class-use/RedisClusterProvider.html...
Generating /home/jenkins/.jenkins/jobs/oxCore/workspace/core-cache/target/site/apidocs/org/gluu/service/cache/class-use/RedisConfiguration.html...
Generating /home/jenkins/.jenkins/jobs/oxCore/workspace/core-cache/target/site/apidocs/org/gluu/service/cache/class-use/RedisProvider.html...
Generating /home/jenkins/.jenkins/jobs/oxCore/workspace/core-cache/target/site/apidocs/org/gluu/service/cache/class-use/RedisSentinelProvider.html...
Generating /home/jenkins/.jenkins/jobs/oxCore/workspace/core-cache/target/site/apidocs/org/gluu/service/cache/class-use/RedisShardedProvider.html...
Generating /home/jenkins/.jenkins/jobs/oxCore/workspace/core-cache/target/site/apidocs/org/gluu/service/cache/class-use/RedisStandaloneProvider.html...
Generating /home/jenkins/.jenkins/jobs/oxCore/workspace/core-cache/target/site/apidocs/org/gluu/service/cache/class-use/NativePersistenceCacheProvider.html...
Generating /home/jenkins/.jenkins/jobs/oxCore/workspace/core-cache/target/site/apidocs/org/gluu/service/class-use/BaseCacheService.html...
Generating /home/jenkins/.jenkins/jobs/oxCore/workspace/core-cache/target/site/apidocs/org/gluu/service/class-use/CacheService.html...
Generating /home/jenkins/.jenkins/jobs/oxCore/workspace/core-cache/target/site/apidocs/org/gluu/service/package-use.html...
Generating /home/jenkins/.jenkins/jobs/oxCore/workspace/core-cache/target/site/apidocs/org/gluu/service/cache/package-use.html...
Building index for all the packages and classes...
Generating /home/jenkins/.jenkins/jobs/oxCore/workspace/core-cache/target/site/apidocs/overview-tree.html...
Generating /home/jenkins/.jenkins/jobs/oxCore/workspace/core-cache/target/site/apidocs/index-all.html...
Building index for all classes...
Generating /home/jenkins/.jenkins/jobs/oxCore/workspace/core-cache/target/site/apidocs/allclasses-index.html...
Generating /home/jenkins/.jenkins/jobs/oxCore/workspace/core-cache/target/site/apidocs/allpackages-index.html...
Generating /home/jenkins/.jenkins/jobs/oxCore/workspace/core-cache/target/site/apidocs/deprecated-list.html...
Building index for all classes...
Generating /home/jenkins/.jenkins/jobs/oxCore/workspace/core-cache/target/site/apidocs/allclasses.html...
Generating /home/jenkins/.jenkins/jobs/oxCore/workspace/core-cache/target/site/apidocs/allclasses.html...
Generating /home/jenkins/.jenkins/jobs/oxCore/workspace/core-cache/target/site/apidocs/index.html...
Generating /home/jenkins/.jenkins/jobs/oxCore/workspace/core-cache/target/site/apidocs/overview-summary.html...
Generating /home/jenkins/.jenkins/jobs/oxCore/workspace/core-cache/target/site/apidocs/help-doc.html...
2 errors
2 warnings
[ERROR] Error while creating javadoc report: 
Exit code: 1 - javadoc: error - The code being documented uses modules but the packages defined in https://docs.oracle.com/javase/8/docs/api/ are in the unnamed module.
/home/jenkins/.jenkins/jobs/oxCore/workspace/core-cache/src/main/java/org/gluu/service/cache/RedisSetParams.java:29: warning: no description for @param
     * @param secondsToExpire
       ^
/home/jenkins/.jenkins/jobs/oxCore/workspace/core-cache/src/main/java/org/gluu/service/cache/RedisSetParams.java:40: warning: no description for @param
     * @param millisecondsToExpire
       ^
/home/jenkins/.jenkins/jobs/oxCore/workspace/core-cache/src/main/java/org/gluu/service/cache/RedisConfiguration.java:48: error: bad use of '>'
     * The option must be enabled prior to entering the blocking operation to have effect. The timeout must be > 0.
                                                                                                               ^

Command line was: /opt/java/amazon-corretto-11.0.7.10.1-linux-x64/bin/javadoc @options @packages

Refer to the generated Javadoc files in '/home/jenkins/.jenkins/jobs/oxCore/workspace/core-cache/target/site/apidocs' dir.

org.apache.maven.reporting.MavenReportException: 
Exit code: 1 - javadoc: error - The code being documented uses modules but the packages defined in https://docs.oracle.com/javase/8/docs/api/ are in the unnamed module.
/home/jenkins/.jenkins/jobs/oxCore/workspace/core-cache/src/main/java/org/gluu/service/cache/RedisSetParams.java:29: warning: no description for @param
     * @param secondsToExpire
       ^
/home/jenkins/.jenkins/jobs/oxCore/workspace/core-cache/src/main/java/org/gluu/service/cache/RedisSetParams.java:40: warning: no description for @param
     * @param millisecondsToExpire
       ^
/home/jenkins/.jenkins/jobs/oxCore/workspace/core-cache/src/main/java/org/gluu/service/cache/RedisConfiguration.java:48: error: bad use of '>'
     * The option must be enabled prior to entering the blocking operation to have effect. The timeout must be > 0.
                                                                                                               ^

Command line was: /opt/java/amazon-corretto-11.0.7.10.1-linux-x64/bin/javadoc @options @packages

Refer to the generated Javadoc files in '/home/jenkins/.jenkins/jobs/oxCore/workspace/core-cache/target/site/apidocs' dir.

	at org.apache.maven.plugins.javadoc.AbstractJavadocMojo.executeJavadocCommandLine(AbstractJavadocMojo.java:5298)
	at org.apache.maven.plugins.javadoc.AbstractJavadocMojo.executeReport(AbstractJavadocMojo.java:2134)
	at org.apache.maven.plugins.javadoc.JavadocReport.generate(JavadocReport.java:134)
	at org.apache.maven.plugins.javadoc.JavadocReport.doExecute(JavadocReport.java:329)
	at org.apache.maven.plugins.javadoc.AbstractJavadocMojo.execute(AbstractJavadocMojo.java:1912)
	at org.apache.maven.plugin.DefaultBuildPluginManager.executeMojo(DefaultBuildPluginManager.java:134)
	at org.apache.maven.lifecycle.internal.MojoExecutor.execute(MojoExecutor.java:207)
	at org.apache.maven.lifecycle.internal.MojoExecutor.execute(MojoExecutor.java:153)
	at org.apache.maven.lifecycle.internal.MojoExecutor.execute(MojoExecutor.java:145)
	at org.apache.maven.lifecycle.internal.LifecycleModuleBuilder.buildProject(LifecycleModuleBuilder.java:116)
	at org.apache.maven.lifecycle.internal.LifecycleModuleBuilder.buildProject(LifecycleModuleBuilder.java:80)
	at org.apache.maven.lifecycle.internal.builder.singlethreaded.SingleThreadedBuilder.build(SingleThreadedBuilder.java:51)
	at org.apache.maven.lifecycle.internal.LifecycleStarter.execute(LifecycleStarter.java:128)
	at org.apache.maven.DefaultMaven.doExecute(DefaultMaven.java:307)
	at org.apache.maven.DefaultMaven.doExecute(DefaultMaven.java:193)
	at org.apache.maven.DefaultMaven.execute(DefaultMaven.java:106)
	at org.apache.maven.cli.MavenCli.execute(MavenCli.java:863)
	at org.apache.maven.cli.MavenCli.doMain(MavenCli.java:288)
	at org.apache.maven.cli.MavenCli.main(MavenCli.java:199)
	at java.base/jdk.internal.reflect.NativeMethodAccessorImpl.invoke0(Native Method)
	at java.base/jdk.internal.reflect.NativeMethodAccessorImpl.invoke(NativeMethodAccessorImpl.java:62)
	at java.base/jdk.internal.reflect.DelegatingMethodAccessorImpl.invoke(DelegatingMethodAccessorImpl.java:43)
	at java.base/java.lang.reflect.Method.invoke(Method.java:566)
	at org.codehaus.plexus.classworlds.launcher.Launcher.launchEnhanced(Launcher.java:289)
	at org.codehaus.plexus.classworlds.launcher.Launcher.launch(Launcher.java:229)
	at org.codehaus.plexus.classworlds.launcher.Launcher.mainWithExitCode(Launcher.java:415)
	at org.codehaus.plexus.classworlds.launcher.Launcher.main(Launcher.java:356)
[INFO] 
[INFO] --- maven-site-plugin:2.1.1:site (default-site) @ oxcore-cache ---
[INFO]                                                                         
[INFO] ------------------------------------------------------------------------
[INFO] Building Caches support 4.3.1-SNAPSHOT
[INFO] ------------------------------------------------------------------------
[INFO] 
[INFO] --- maven-clean-plugin:2.4.1:clean (default-clean) @ oxcore-document-store ---
[INFO] Deleting /home/jenkins/.jenkins/jobs/oxCore/workspace/core-document-store/target
[INFO] 
[INFO] --- maven-resources-plugin:2.4:resources (default-resources) @ oxcore-document-store ---
[INFO] Using 'UTF-8' encoding to copy filtered resources.
[INFO] Copying 1 resource
[INFO] 
[INFO] --- maven-compiler-plugin:2.3.2:compile (default-compile) @ oxcore-document-store ---
[INFO] Compiling 16 source files to /home/jenkins/.jenkins/jobs/oxCore/workspace/core-document-store/target/classes
[INFO] 
[INFO] --- maven-resources-plugin:2.4:resources (default-resources) @ oxcore-document-store ---
[INFO] Using 'UTF-8' encoding to copy filtered resources.
[INFO] Copying 1 resource
[INFO] 
[INFO] --- maven-compiler-plugin:2.3.2:compile (default-compile) @ oxcore-document-store ---
[INFO] Nothing to compile - all classes are up to date
[INFO] 
[INFO] --- maven-resources-plugin:2.4:testResources (default-testResources) @ oxcore-document-store ---
[INFO] Using 'UTF-8' encoding to copy filtered resources.
[INFO] skip non existing resourceDirectory /home/jenkins/.jenkins/jobs/oxCore/workspace/core-document-store/src/test/resources
[INFO] 
[INFO] --- maven-compiler-plugin:2.3.2:testCompile (default-testCompile) @ oxcore-document-store ---
[INFO] Compiling 2 source files to /home/jenkins/.jenkins/jobs/oxCore/workspace/core-document-store/target/test-classes
[INFO] 
[INFO] --- maven-surefire-plugin:2.7.2:test (default-test) @ oxcore-document-store ---
[INFO] Surefire report directory: /home/jenkins/.jenkins/jobs/oxCore/workspace/core-document-store/target/surefire-reports

-------------------------------------------------------
 T E S T S
-------------------------------------------------------
Running TestSuite
Tests run: 0, Failures: 0, Errors: 0, Skipped: 0, Time elapsed: 0.488 sec
There are no tests to run.

Results :

Tests run: 0, Failures: 0, Errors: 0, Skipped: 0

[INFO] 
[INFO] --- maven-jar-plugin:2.4:jar (default-jar) @ oxcore-document-store ---
[INFO] Building jar: /home/jenkins/.jenkins/jobs/oxCore/workspace/core-document-store/target/oxcore-document-store-4.3.1-SNAPSHOT.jar
[INFO] 
[INFO] --- maven-install-plugin:2.3.1:install (default-install) @ oxcore-document-store ---
[INFO] Installing /home/jenkins/.jenkins/jobs/oxCore/workspace/core-document-store/target/oxcore-document-store-4.3.1-SNAPSHOT.jar to /var/www/html/maven/org/gluu/oxcore-document-store/4.3.1-SNAPSHOT/oxcore-document-store-4.3.1-SNAPSHOT.jar
[INFO] Installing /home/jenkins/.jenkins/jobs/oxCore/workspace/core-document-store/pom.xml to /var/www/html/maven/org/gluu/oxcore-document-store/4.3.1-SNAPSHOT/oxcore-document-store-4.3.1-SNAPSHOT.pom
[INFO] 
[INFO] >>> maven-javadoc-plugin:3.0.1:javadoc (default-cli) > generate-sources @ oxcore-document-store >>>
[INFO] 
[INFO] <<< maven-javadoc-plugin:3.0.1:javadoc (default-cli) < generate-sources @ oxcore-document-store <<<
[INFO] 
[INFO] --- maven-javadoc-plugin:3.0.1:javadoc (default-cli) @ oxcore-document-store ---
[ERROR] Error fetching link: /home/jenkins/.jenkins/jobs/oxCore/workspace/oxUtil/target/site/apidocs/package-list. Ignored it.
[INFO] 
Loading source files for package org.gluu.service.document.store...
Loading source files for package org.gluu.service.document.store.conf...
Loading source files for package org.gluu.service.document.store.provider...
Loading source files for package org.gluu.service.document.store.service...
Constructing Javadoc information...
Standard Doclet version 11.0.7
Building tree for all the packages and classes...
Generating /home/jenkins/.jenkins/jobs/oxCore/workspace/core-document-store/target/site/apidocs/org/gluu/service/document/store/LocalDocumentStore.html...
Generating /home/jenkins/.jenkins/jobs/oxCore/workspace/core-document-store/target/site/apidocs/org/gluu/service/document/store/LocalDocumentStore.Literal.html...
Generating /home/jenkins/.jenkins/jobs/oxCore/workspace/core-document-store/target/site/apidocs/org/gluu/service/document/store/StandaloneDocumentStoreProviderFactory.html...
Generating /home/jenkins/.jenkins/jobs/oxCore/workspace/core-document-store/target/site/apidocs/org/gluu/service/document/store/conf/DocumentStoreConfiguration.html...
Generating /home/jenkins/.jenkins/jobs/oxCore/workspace/core-document-store/target/site/apidocs/org/gluu/service/document/store/conf/DocumentStoreType.html...
Generating /home/jenkins/.jenkins/jobs/oxCore/workspace/core-document-store/target/site/apidocs/org/gluu/service/document/store/conf/JcaDocumentStoreConfiguration.html...
Generating /home/jenkins/.jenkins/jobs/oxCore/workspace/core-document-store/target/site/apidocs/org/gluu/service/document/store/conf/LocalDocumentStoreConfiguration.html...
Generating /home/jenkins/.jenkins/jobs/oxCore/workspace/core-document-store/target/site/apidocs/org/gluu/service/document/store/conf/WebDavDocumentStoreConfiguration.html...
Generating /home/jenkins/.jenkins/jobs/oxCore/workspace/core-document-store/target/site/apidocs/org/gluu/service/document/store/provider/DocumentStore.html...
Generating /home/jenkins/.jenkins/jobs/oxCore/workspace/core-document-store/target/site/apidocs/org/gluu/service/document/store/provider/DocumentStoreProvider.html...
Generating /home/jenkins/.jenkins/jobs/oxCore/workspace/core-document-store/target/site/apidocs/org/gluu/service/document/store/provider/DocumentStoreProviderFactory.html...
Generating /home/jenkins/.jenkins/jobs/oxCore/workspace/core-document-store/target/site/apidocs/org/gluu/service/document/store/provider/JcaDocumentStoreProvider.html...
Generating /home/jenkins/.jenkins/jobs/oxCore/workspace/core-document-store/target/site/apidocs/org/gluu/service/document/store/provider/LocalDocumentStoreProvider.html...
Generating /home/jenkins/.jenkins/jobs/oxCore/workspace/core-document-store/target/site/apidocs/org/gluu/service/document/store/provider/WebDavDocumentStoreProvider.html...
Generating /home/jenkins/.jenkins/jobs/oxCore/workspace/core-document-store/target/site/apidocs/org/gluu/service/document/store/service/BaseDocumentStoreService.html...
Generating /home/jenkins/.jenkins/jobs/oxCore/workspace/core-document-store/target/site/apidocs/org/gluu/service/document/store/service/DocumentStoreService.html...
Generating /home/jenkins/.jenkins/jobs/oxCore/workspace/core-document-store/target/site/apidocs/org/gluu/service/document/store/service/LocalDocumentStoreService.html...
Generating /home/jenkins/.jenkins/jobs/oxCore/workspace/core-document-store/target/site/apidocs/org/gluu/service/document/store/package-summary.html...
Generating /home/jenkins/.jenkins/jobs/oxCore/workspace/core-document-store/target/site/apidocs/org/gluu/service/document/store/package-tree.html...
Generating /home/jenkins/.jenkins/jobs/oxCore/workspace/core-document-store/target/site/apidocs/org/gluu/service/document/store/conf/package-summary.html...
Generating /home/jenkins/.jenkins/jobs/oxCore/workspace/core-document-store/target/site/apidocs/org/gluu/service/document/store/conf/package-tree.html...
Generating /home/jenkins/.jenkins/jobs/oxCore/workspace/core-document-store/target/site/apidocs/org/gluu/service/document/store/provider/package-summary.html...
Generating /home/jenkins/.jenkins/jobs/oxCore/workspace/core-document-store/target/site/apidocs/org/gluu/service/document/store/provider/package-tree.html...
Generating /home/jenkins/.jenkins/jobs/oxCore/workspace/core-document-store/target/site/apidocs/org/gluu/service/document/store/service/package-summary.html...
Generating /home/jenkins/.jenkins/jobs/oxCore/workspace/core-document-store/target/site/apidocs/org/gluu/service/document/store/service/package-tree.html...
Generating /home/jenkins/.jenkins/jobs/oxCore/workspace/core-document-store/target/site/apidocs/constant-values.html...
Generating /home/jenkins/.jenkins/jobs/oxCore/workspace/core-document-store/target/site/apidocs/serialized-form.html...
Generating /home/jenkins/.jenkins/jobs/oxCore/workspace/core-document-store/target/site/apidocs/org/gluu/service/document/store/class-use/LocalDocumentStore.html...
Generating /home/jenkins/.jenkins/jobs/oxCore/workspace/core-document-store/target/site/apidocs/org/gluu/service/document/store/class-use/LocalDocumentStore.Literal.html...
Generating /home/jenkins/.jenkins/jobs/oxCore/workspace/core-document-store/target/site/apidocs/org/gluu/service/document/store/class-use/StandaloneDocumentStoreProviderFactory.html...
Generating /home/jenkins/.jenkins/jobs/oxCore/workspace/core-document-store/target/site/apidocs/org/gluu/service/document/store/conf/class-use/DocumentStoreType.html...
Generating /home/jenkins/.jenkins/jobs/oxCore/workspace/core-document-store/target/site/apidocs/org/gluu/service/document/store/conf/class-use/LocalDocumentStoreConfiguration.html...
Generating /home/jenkins/.jenkins/jobs/oxCore/workspace/core-document-store/target/site/apidocs/org/gluu/service/document/store/conf/class-use/DocumentStoreConfiguration.html...
Generating /home/jenkins/.jenkins/jobs/oxCore/workspace/core-document-store/target/site/apidocs/org/gluu/service/document/store/conf/class-use/JcaDocumentStoreConfiguration.html...
Generating /home/jenkins/.jenkins/jobs/oxCore/workspace/core-document-store/target/site/apidocs/org/gluu/service/document/store/conf/class-use/WebDavDocumentStoreConfiguration.html...
Generating /home/jenkins/.jenkins/jobs/oxCore/workspace/core-document-store/target/site/apidocs/org/gluu/service/document/store/provider/class-use/DocumentStoreProvider.html...
Generating /home/jenkins/.jenkins/jobs/oxCore/workspace/core-document-store/target/site/apidocs/org/gluu/service/document/store/provider/class-use/DocumentStoreProviderFactory.html...
Generating /home/jenkins/.jenkins/jobs/oxCore/workspace/core-document-store/target/site/apidocs/org/gluu/service/document/store/provider/class-use/DocumentStore.html...
Generating /home/jenkins/.jenkins/jobs/oxCore/workspace/core-document-store/target/site/apidocs/org/gluu/service/document/store/provider/class-use/LocalDocumentStoreProvider.html...
Generating /home/jenkins/.jenkins/jobs/oxCore/workspace/core-document-store/target/site/apidocs/org/gluu/service/document/store/provider/class-use/JcaDocumentStoreProvider.html...
Generating /home/jenkins/.jenkins/jobs/oxCore/workspace/core-document-store/target/site/apidocs/org/gluu/service/document/store/provider/class-use/WebDavDocumentStoreProvider.html...
Generating /home/jenkins/.jenkins/jobs/oxCore/workspace/core-document-store/target/site/apidocs/org/gluu/service/document/store/service/class-use/DocumentStoreService.html...
Generating /home/jenkins/.jenkins/jobs/oxCore/workspace/core-document-store/target/site/apidocs/org/gluu/service/document/store/service/class-use/LocalDocumentStoreService.html...
Generating /home/jenkins/.jenkins/jobs/oxCore/workspace/core-document-store/target/site/apidocs/org/gluu/service/document/store/service/class-use/BaseDocumentStoreService.html...
Generating /home/jenkins/.jenkins/jobs/oxCore/workspace/core-document-store/target/site/apidocs/org/gluu/service/document/store/package-use.html...
Generating /home/jenkins/.jenkins/jobs/oxCore/workspace/core-document-store/target/site/apidocs/org/gluu/service/document/store/conf/package-use.html...
Generating /home/jenkins/.jenkins/jobs/oxCore/workspace/core-document-store/target/site/apidocs/org/gluu/service/document/store/provider/package-use.html...
Generating /home/jenkins/.jenkins/jobs/oxCore/workspace/core-document-store/target/site/apidocs/org/gluu/service/document/store/service/package-use.html...
Building index for all the packages and classes...
Generating /home/jenkins/.jenkins/jobs/oxCore/workspace/core-document-store/target/site/apidocs/overview-tree.html...
Generating /home/jenkins/.jenkins/jobs/oxCore/workspace/core-document-store/target/site/apidocs/index-all.html...
Building index for all classes...
Generating /home/jenkins/.jenkins/jobs/oxCore/workspace/core-document-store/target/site/apidocs/allclasses-index.html...
Generating /home/jenkins/.jenkins/jobs/oxCore/workspace/core-document-store/target/site/apidocs/allpackages-index.html...
Generating /home/jenkins/.jenkins/jobs/oxCore/workspace/core-document-store/target/site/apidocs/deprecated-list.html...
Building index for all classes...
Generating /home/jenkins/.jenkins/jobs/oxCore/workspace/core-document-store/target/site/apidocs/allclasses.html...
Generating /home/jenkins/.jenkins/jobs/oxCore/workspace/core-document-store/target/site/apidocs/allclasses.html...
Generating /home/jenkins/.jenkins/jobs/oxCore/workspace/core-document-store/target/site/apidocs/index.html...
Generating /home/jenkins/.jenkins/jobs/oxCore/workspace/core-document-store/target/site/apidocs/overview-summary.html...
Generating /home/jenkins/.jenkins/jobs/oxCore/workspace/core-document-store/target/site/apidocs/help-doc.html...
1 error
19 warnings
[ERROR] Error while creating javadoc report: 
Exit code: 1 - javadoc: error - The code being documented uses modules but the packages defined in https://docs.oracle.com/javase/8/docs/api/ are in the unnamed module.
/home/jenkins/.jenkins/jobs/oxCore/workspace/core-document-store/src/main/java/org/gluu/service/document/store/provider/DocumentStore.java:17: warning: no @param for path
	boolean hasDocument(String path);
	        ^
/home/jenkins/.jenkins/jobs/oxCore/workspace/core-document-store/src/main/java/org/gluu/service/document/store/provider/DocumentStore.java:17: warning: no @return
	boolean hasDocument(String path);
	        ^
/home/jenkins/.jenkins/jobs/oxCore/workspace/core-document-store/src/main/java/org/gluu/service/document/store/provider/DocumentStore.java:22: warning: no @param for path
	boolean saveDocument(String path, String documentContent, Charset charset);
	        ^
/home/jenkins/.jenkins/jobs/oxCore/workspace/core-document-store/src/main/java/org/gluu/service/document/store/provider/DocumentStore.java:22: warning: no @param for documentContent
	boolean saveDocument(String path, String documentContent, Charset charset);
	        ^
/home/jenkins/.jenkins/jobs/oxCore/workspace/core-document-store/src/main/java/org/gluu/service/document/store/provider/DocumentStore.java:22: warning: no @param for charset
	boolean saveDocument(String path, String documentContent, Charset charset);
	        ^
/home/jenkins/.jenkins/jobs/oxCore/workspace/core-document-store/src/main/java/org/gluu/service/document/store/provider/DocumentStore.java:22: warning: no @return
	boolean saveDocument(String path, String documentContent, Charset charset);
	        ^
/home/jenkins/.jenkins/jobs/oxCore/workspace/core-document-store/src/main/java/org/gluu/service/document/store/provider/DocumentStore.java:27: warning: no @param for path
	boolean saveDocumentStream(String path, InputStream documentStream);
	        ^
/home/jenkins/.jenkins/jobs/oxCore/workspace/core-document-store/src/main/java/org/gluu/service/document/store/provider/DocumentStore.java:27: warning: no @param for documentStream
	boolean saveDocumentStream(String path, InputStream documentStream);
	        ^
/home/jenkins/.jenkins/jobs/oxCore/workspace/core-document-store/src/main/java/org/gluu/service/document/store/provider/DocumentStore.java:27: warning: no @return
	boolean saveDocumentStream(String path, InputStream documentStream);
	        ^
/home/jenkins/.jenkins/jobs/oxCore/workspace/core-document-store/src/main/java/org/gluu/service/document/store/provider/DocumentStore.java:32: warning: no @param for path
	String readDocument(String path, Charset charset);
	       ^
/home/jenkins/.jenkins/jobs/oxCore/workspace/core-document-store/src/main/java/org/gluu/service/document/store/provider/DocumentStore.java:32: warning: no @param for charset
	String readDocument(String path, Charset charset);
	       ^
/home/jenkins/.jenkins/jobs/oxCore/workspace/core-document-store/src/main/java/org/gluu/service/document/store/provider/DocumentStore.java:32: warning: no @return
	String readDocument(String path, Charset charset);
	       ^
/home/jenkins/.jenkins/jobs/oxCore/workspace/core-document-store/src/main/java/org/gluu/service/document/store/provider/DocumentStore.java:37: warning: no @param for path
	public InputStream readDocumentAsStream(String path) ;
	                   ^
/home/jenkins/.jenkins/jobs/oxCore/workspace/core-document-store/src/main/java/org/gluu/service/document/store/provider/DocumentStore.java:37: warning: no @return
	public InputStream readDocumentAsStream(String path) ;
	                   ^
/home/jenkins/.jenkins/jobs/oxCore/workspace/core-document-store/src/main/java/org/gluu/service/document/store/provider/DocumentStore.java:42: warning: no @param for path
	boolean removeDocument(String path);
	        ^
/home/jenkins/.jenkins/jobs/oxCore/workspace/core-document-store/src/main/java/org/gluu/service/document/store/provider/DocumentStore.java:42: warning: no @return
	boolean removeDocument(String path);
	        ^
/home/jenkins/.jenkins/jobs/oxCore/workspace/core-document-store/src/main/java/org/gluu/service/document/store/provider/DocumentStore.java:47: warning: no @param for currentPath
	boolean renameDocument(String currentPath, String destinationPath);
	        ^
/home/jenkins/.jenkins/jobs/oxCore/workspace/core-document-store/src/main/java/org/gluu/service/document/store/provider/DocumentStore.java:47: warning: no @param for destinationPath
	boolean renameDocument(String currentPath, String destinationPath);
	        ^
/home/jenkins/.jenkins/jobs/oxCore/workspace/core-document-store/src/main/java/org/gluu/service/document/store/provider/DocumentStore.java:47: warning: no @return
	boolean renameDocument(String currentPath, String destinationPath);
	        ^

Command line was: /opt/java/amazon-corretto-11.0.7.10.1-linux-x64/bin/javadoc @options @packages

Refer to the generated Javadoc files in '/home/jenkins/.jenkins/jobs/oxCore/workspace/core-document-store/target/site/apidocs' dir.

org.apache.maven.reporting.MavenReportException: 
Exit code: 1 - javadoc: error - The code being documented uses modules but the packages defined in https://docs.oracle.com/javase/8/docs/api/ are in the unnamed module.
/home/jenkins/.jenkins/jobs/oxCore/workspace/core-document-store/src/main/java/org/gluu/service/document/store/provider/DocumentStore.java:17: warning: no @param for path
	boolean hasDocument(String path);
	        ^
/home/jenkins/.jenkins/jobs/oxCore/workspace/core-document-store/src/main/java/org/gluu/service/document/store/provider/DocumentStore.java:17: warning: no @return
	boolean hasDocument(String path);
	        ^
/home/jenkins/.jenkins/jobs/oxCore/workspace/core-document-store/src/main/java/org/gluu/service/document/store/provider/DocumentStore.java:22: warning: no @param for path
	boolean saveDocument(String path, String documentContent, Charset charset);
	        ^
/home/jenkins/.jenkins/jobs/oxCore/workspace/core-document-store/src/main/java/org/gluu/service/document/store/provider/DocumentStore.java:22: warning: no @param for documentContent
	boolean saveDocument(String path, String documentContent, Charset charset);
	        ^
/home/jenkins/.jenkins/jobs/oxCore/workspace/core-document-store/src/main/java/org/gluu/service/document/store/provider/DocumentStore.java:22: warning: no @param for charset
	boolean saveDocument(String path, String documentContent, Charset charset);
	        ^
/home/jenkins/.jenkins/jobs/oxCore/workspace/core-document-store/src/main/java/org/gluu/service/document/store/provider/DocumentStore.java:22: warning: no @return
	boolean saveDocument(String path, String documentContent, Charset charset);
	        ^
/home/jenkins/.jenkins/jobs/oxCore/workspace/core-document-store/src/main/java/org/gluu/service/document/store/provider/DocumentStore.java:27: warning: no @param for path
	boolean saveDocumentStream(String path, InputStream documentStream);
	        ^
/home/jenkins/.jenkins/jobs/oxCore/workspace/core-document-store/src/main/java/org/gluu/service/document/store/provider/DocumentStore.java:27: warning: no @param for documentStream
	boolean saveDocumentStream(String path, InputStream documentStream);
	        ^
/home/jenkins/.jenkins/jobs/oxCore/workspace/core-document-store/src/main/java/org/gluu/service/document/store/provider/DocumentStore.java:27: warning: no @return
	boolean saveDocumentStream(String path, InputStream documentStream);
	        ^
/home/jenkins/.jenkins/jobs/oxCore/workspace/core-document-store/src/main/java/org/gluu/service/document/store/provider/DocumentStore.java:32: warning: no @param for path
	String readDocument(String path, Charset charset);
	       ^
/home/jenkins/.jenkins/jobs/oxCore/workspace/core-document-store/src/main/java/org/gluu/service/document/store/provider/DocumentStore.java:32: warning: no @param for charset
	String readDocument(String path, Charset charset);
	       ^
/home/jenkins/.jenkins/jobs/oxCore/workspace/core-document-store/src/main/java/org/gluu/service/document/store/provider/DocumentStore.java:32: warning: no @return
	String readDocument(String path, Charset charset);
	       ^
/home/jenkins/.jenkins/jobs/oxCore/workspace/core-document-store/src/main/java/org/gluu/service/document/store/provider/DocumentStore.java:37: warning: no @param for path
	public InputStream readDocumentAsStream(String path) ;
	                   ^
/home/jenkins/.jenkins/jobs/oxCore/workspace/core-document-store/src/main/java/org/gluu/service/document/store/provider/DocumentStore.java:37: warning: no @return
	public InputStream readDocumentAsStream(String path) ;
	                   ^
/home/jenkins/.jenkins/jobs/oxCore/workspace/core-document-store/src/main/java/org/gluu/service/document/store/provider/DocumentStore.java:42: warning: no @param for path
	boolean removeDocument(String path);
	        ^
/home/jenkins/.jenkins/jobs/oxCore/workspace/core-document-store/src/main/java/org/gluu/service/document/store/provider/DocumentStore.java:42: warning: no @return
	boolean removeDocument(String path);
	        ^
/home/jenkins/.jenkins/jobs/oxCore/workspace/core-document-store/src/main/java/org/gluu/service/document/store/provider/DocumentStore.java:47: warning: no @param for currentPath
	boolean renameDocument(String currentPath, String destinationPath);
	        ^
/home/jenkins/.jenkins/jobs/oxCore/workspace/core-document-store/src/main/java/org/gluu/service/document/store/provider/DocumentStore.java:47: warning: no @param for destinationPath
	boolean renameDocument(String currentPath, String destinationPath);
	        ^
/home/jenkins/.jenkins/jobs/oxCore/workspace/core-document-store/src/main/java/org/gluu/service/document/store/provider/DocumentStore.java:47: warning: no @return
	boolean renameDocument(String currentPath, String destinationPath);
	        ^

Command line was: /opt/java/amazon-corretto-11.0.7.10.1-linux-x64/bin/javadoc @options @packages

Refer to the generated Javadoc files in '/home/jenkins/.jenkins/jobs/oxCore/workspace/core-document-store/target/site/apidocs' dir.

	at org.apache.maven.plugins.javadoc.AbstractJavadocMojo.executeJavadocCommandLine(AbstractJavadocMojo.java:5298)
	at org.apache.maven.plugins.javadoc.AbstractJavadocMojo.executeReport(AbstractJavadocMojo.java:2134)
	at org.apache.maven.plugins.javadoc.JavadocReport.generate(JavadocReport.java:134)
	at org.apache.maven.plugins.javadoc.JavadocReport.doExecute(JavadocReport.java:329)
	at org.apache.maven.plugins.javadoc.AbstractJavadocMojo.execute(AbstractJavadocMojo.java:1912)
	at org.apache.maven.plugin.DefaultBuildPluginManager.executeMojo(DefaultBuildPluginManager.java:134)
	at org.apache.maven.lifecycle.internal.MojoExecutor.execute(MojoExecutor.java:207)
	at org.apache.maven.lifecycle.internal.MojoExecutor.execute(MojoExecutor.java:153)
	at org.apache.maven.lifecycle.internal.MojoExecutor.execute(MojoExecutor.java:145)
	at org.apache.maven.lifecycle.internal.LifecycleModuleBuilder.buildProject(LifecycleModuleBuilder.java:116)
	at org.apache.maven.lifecycle.internal.LifecycleModuleBuilder.buildProject(LifecycleModuleBuilder.java:80)
	at org.apache.maven.lifecycle.internal.builder.singlethreaded.SingleThreadedBuilder.build(SingleThreadedBuilder.java:51)
	at org.apache.maven.lifecycle.internal.LifecycleStarter.execute(LifecycleStarter.java:128)
	at org.apache.maven.DefaultMaven.doExecute(DefaultMaven.java:307)
	at org.apache.maven.DefaultMaven.doExecute(DefaultMaven.java:193)
	at org.apache.maven.DefaultMaven.execute(DefaultMaven.java:106)
	at org.apache.maven.cli.MavenCli.execute(MavenCli.java:863)
	at org.apache.maven.cli.MavenCli.doMain(MavenCli.java:288)
	at org.apache.maven.cli.MavenCli.main(MavenCli.java:199)
	at java.base/jdk.internal.reflect.NativeMethodAccessorImpl.invoke0(Native Method)
	at java.base/jdk.internal.reflect.NativeMethodAccessorImpl.invoke(NativeMethodAccessorImpl.java:62)
	at java.base/jdk.internal.reflect.DelegatingMethodAccessorImpl.invoke(DelegatingMethodAccessorImpl.java:43)
	at java.base/java.lang.reflect.Method.invoke(Method.java:566)
	at org.codehaus.plexus.classworlds.launcher.Launcher.launchEnhanced(Launcher.java:289)
	at org.codehaus.plexus.classworlds.launcher.Launcher.launch(Launcher.java:229)
	at org.codehaus.plexus.classworlds.launcher.Launcher.mainWithExitCode(Launcher.java:415)
	at org.codehaus.plexus.classworlds.launcher.Launcher.main(Launcher.java:356)
[INFO] 
[INFO] --- maven-site-plugin:2.1.1:site (default-site) @ oxcore-document-store ---
[INFO]                                                                         
[INFO] ------------------------------------------------------------------------
[INFO] Building Configuration factories for standalone applications 4.3.1-SNAPSHOT
[INFO] ------------------------------------------------------------------------
[WARNING] The POM for org.gluu:gluu-orm-cdi:jar:4.3.1-SNAPSHOT is missing, no dependency information available
[WARNING] The POM for org.gluu:gluu-orm-standalone:jar:4.3.1-SNAPSHOT is missing, no dependency information available
[INFO] ------------------------------------------------------------------------
[INFO] Reactor Summary:
[INFO] 
[INFO] oxCore ............................................. SUCCESS [  1.705 s]
[INFO] oxUtil ............................................. SUCCESS [ 11.022 s]
[INFO] oxModel ............................................ SUCCESS [  5.339 s]
[INFO] Caches support ..................................... SUCCESS [  9.235 s]
[INFO] Caches support ..................................... SUCCESS [  7.562 s]
[INFO] Configuration factories for standalone applications  FAILURE [  0.030 s]
[INFO] oxSaml ............................................. SKIPPED
[INFO] Reusable CDI classes which not depend on specific framework SKIPPED
[INFO] Reusable CDI Script implementation ................. SKIPPED
[INFO] oxService .......................................... SKIPPED
[INFO] oxJsfUtil .......................................... SKIPPED
[INFO] Java extensions .................................... SKIPPED
[INFO] Weld CDI timer implementation ...................... SKIPPED
[INFO] Reusable CDI security extension .................... SKIPPED
[INFO] Reusable CDI exception handler extension ........... SKIPPED
[INFO] Web application specific classes ................... SKIPPED
[INFO] oxRadius ........................................... SKIPPED
[INFO] Demo CDI services .................................. SKIPPED
[INFO] ------------------------------------------------------------------------
[INFO] BUILD FAILURE
[INFO] ------------------------------------------------------------------------
[INFO] Total time: 36.931 s
[INFO] Finished at: 2021-10-05T09:56:16+00:00
[INFO] Final Memory: 44M/154M
[INFO] ------------------------------------------------------------------------
[ERROR] Failed to execute goal on project oxcore-standalone: Could not resolve dependencies for project org.gluu:oxcore-standalone:jar:4.3.1-SNAPSHOT: The following artifacts could not be resolved: org.gluu:gluu-orm-cdi:jar:4.3.1-SNAPSHOT, org.gluu:gluu-orm-standalone:jar:4.3.1-SNAPSHOT: Could not find artifact org.gluu:gluu-orm-cdi:jar:4.3.1-SNAPSHOT -> [Help 1]
[ERROR] 
[ERROR] To see the full stack trace of the errors, re-run Maven with the -e switch.
[ERROR] Re-run Maven using the -X switch to enable full debug logging.
[ERROR] 
[ERROR] For more information about the errors and possible solutions, please read the following articles:
[ERROR] [Help 1] http://cwiki.apache.org/confluence/display/MAVEN/DependencyResolutionException
[ERROR] 
[ERROR] After correcting the problems, you can resume the build with the command
[ERROR]   mvn <goals> -rf :oxcore-standalone
Build step 'Invoke top-level Maven targets' marked build as failure
[FINDBUGS] Skipping publisher since build result is FAILURE
TestNG Reports Processing: START
Looking for TestNG results report in workspace using pattern: **/testng-results.xml
testng-results.xml was last modified before this build started. Ignoring it.
testng-results.xml was last modified before this build started. Ignoring it.
Saving reports...
Processing '/home/jenkins/.jenkins/jobs/oxCore/builds/1365/testng/testng-results.xml'
TestNG Reports Processing: FINISH
Not sending mail to unregistered user yzabrovarniy@gmail.com
Not sending mail to unregistered user Yuriy.Movchan@gmail.com
Not sending mail to unregistered user noreply@github.com
Sending e-mails to: support@gluu.org
ERROR: Couldn't connect to host, port: webmail.gluu.org, 465; timeout 60000
com.sun.mail.util.MailConnectException: Couldn't connect to host, port: webmail.gluu.org, 465; timeout 60000;
  nested exception is:
	java.net.SocketTimeoutException: connect timed out
	at com.sun.mail.smtp.SMTPTransport.openServer(SMTPTransport.java:2210)
	at com.sun.mail.smtp.SMTPTransport.protocolConnect(SMTPTransport.java:722)
	at javax.mail.Service.connect(Service.java:310)
	at javax.mail.Service.connect(Service.java:169)
	at javax.mail.Service.connect(Service.java:118)
	at javax.mail.Transport.send0(Transport.java:188)
	at javax.mail.Transport.send(Transport.java:118)
	at hudson.tasks.MailSender.run(MailSender.java:130)
	at hudson.tasks.Mailer.perform(Mailer.java:176)
	at hudson.tasks.Mailer.perform(Mailer.java:139)
	at hudson.tasks.BuildStepMonitor$1.perform(BuildStepMonitor.java:20)
	at hudson.model.AbstractBuild$AbstractBuildExecution.perform(AbstractBuild.java:741)
	at hudson.model.AbstractBuild$AbstractBuildExecution.performAllBuildSteps(AbstractBuild.java:690)
	at hudson.model.Build$BuildExecution.post2(Build.java:186)
	at hudson.model.AbstractBuild$AbstractBuildExecution.post(AbstractBuild.java:635)
	at hudson.model.Run.execute(Run.java:1905)
	at hudson.model.FreeStyleBuild.run(FreeStyleBuild.java:43)
	at hudson.model.ResourceController.execute(ResourceController.java:97)
	at hudson.model.Executor.run(Executor.java:428)
Caused by: java.net.SocketTimeoutException: connect timed out
	at java.net.PlainSocketImpl.socketConnect(Native Method)
	at java.net.AbstractPlainSocketImpl.doConnect(AbstractPlainSocketImpl.java:350)
	at java.net.AbstractPlainSocketImpl.connectToAddress(AbstractPlainSocketImpl.java:206)
	at java.net.AbstractPlainSocketImpl.connect(AbstractPlainSocketImpl.java:188)
	at java.net.SocksSocketImpl.connect(SocksSocketImpl.java:392)
	at java.net.Socket.connect(Socket.java:589)
	at com.sun.mail.util.SocketFetcher.createSocket(SocketFetcher.java:333)
	at com.sun.mail.util.SocketFetcher.getSocket(SocketFetcher.java:193)
	at com.sun.mail.smtp.SMTPTransport.openServer(SMTPTransport.java:2160)
	... 18 more
Finished: FAILURE