FailedConsole Output

Skipping 98 KB.. Full Log
-resources-plugin:2.4:resources (default-resources) @ oxcore-cache ---
[INFO] Using 'UTF-8' encoding to copy filtered resources.
[INFO] Copying 1 resource
[INFO] 
[INFO] --- maven-compiler-plugin:2.3.2:compile (default-compile) @ oxcore-cache ---
[INFO] Nothing to compile - all classes are up to date
[INFO] 
[INFO] --- maven-resources-plugin:2.4:testResources (default-testResources) @ oxcore-cache ---
[INFO] Using 'UTF-8' encoding to copy filtered resources.
[INFO] skip non existing resourceDirectory /home/jenkins/.jenkins/jobs/oxCore/workspace/core-cache/src/test/resources
[INFO] 
[INFO] --- maven-compiler-plugin:2.3.2:testCompile (default-testCompile) @ oxcore-cache ---
[INFO] No sources to compile
[INFO] 
[INFO] --- maven-surefire-plugin:2.7.2:test (default-test) @ oxcore-cache ---
[INFO] No tests to run.
[INFO] Surefire report directory: /home/jenkins/.jenkins/jobs/oxCore/workspace/core-cache/target/surefire-reports
There are no tests to run.
[INFO] 
[INFO] --- maven-jar-plugin:2.4:jar (default-jar) @ oxcore-cache ---
[INFO] Building jar: /home/jenkins/.jenkins/jobs/oxCore/workspace/core-cache/target/oxcore-cache-4.3.0-SNAPSHOT.jar
[INFO] 
[INFO] --- maven-install-plugin:2.3.1:install (default-install) @ oxcore-cache ---
[INFO] Installing /home/jenkins/.jenkins/jobs/oxCore/workspace/core-cache/target/oxcore-cache-4.3.0-SNAPSHOT.jar to /var/www/html/maven/org/gluu/oxcore-cache/4.3.0-SNAPSHOT/oxcore-cache-4.3.0-SNAPSHOT.jar
[INFO] Installing /home/jenkins/.jenkins/jobs/oxCore/workspace/core-cache/pom.xml to /var/www/html/maven/org/gluu/oxcore-cache/4.3.0-SNAPSHOT/oxcore-cache-4.3.0-SNAPSHOT.pom
[INFO] 
[INFO] >>> maven-javadoc-plugin:3.0.1:javadoc (default-cli) > generate-sources @ oxcore-cache >>>
[INFO] 
[INFO] <<< maven-javadoc-plugin:3.0.1:javadoc (default-cli) < generate-sources @ oxcore-cache <<<
[INFO] 
[INFO] --- maven-javadoc-plugin:3.0.1:javadoc (default-cli) @ oxcore-cache ---
[ERROR] Error fetching link: /home/jenkins/.jenkins/jobs/oxCore/workspace/oxUtil/target/site/apidocs/package-list. Ignored it.
[INFO] 
Loading source files for package org.gluu.service.cache...
Loading source files for package org.gluu.service...
Constructing Javadoc information...
Standard Doclet version 11.0.7
Building tree for all the packages and classes...
Generating /home/jenkins/.jenkins/jobs/oxCore/workspace/core-cache/target/site/apidocs/org/gluu/service/BaseCacheService.html...
Generating /home/jenkins/.jenkins/jobs/oxCore/workspace/core-cache/target/site/apidocs/org/gluu/service/CacheService.html...
Generating /home/jenkins/.jenkins/jobs/oxCore/workspace/core-cache/target/site/apidocs/org/gluu/service/cache/AbstractCacheProvider.html...
Generating /home/jenkins/.jenkins/jobs/oxCore/workspace/core-cache/target/site/apidocs/org/gluu/service/cache/AbstractRedisProvider.html...
Generating /home/jenkins/.jenkins/jobs/oxCore/workspace/core-cache/target/site/apidocs/org/gluu/service/cache/CacheConfiguration.html...
Generating /home/jenkins/.jenkins/jobs/oxCore/workspace/core-cache/target/site/apidocs/org/gluu/service/cache/CacheInterface.html...
Generating /home/jenkins/.jenkins/jobs/oxCore/workspace/core-cache/target/site/apidocs/org/gluu/service/cache/CacheProvider.html...
Generating /home/jenkins/.jenkins/jobs/oxCore/workspace/core-cache/target/site/apidocs/org/gluu/service/cache/CacheProviderFactory.html...
Generating /home/jenkins/.jenkins/jobs/oxCore/workspace/core-cache/target/site/apidocs/org/gluu/service/cache/CacheProviderType.html...
Generating /home/jenkins/.jenkins/jobs/oxCore/workspace/core-cache/target/site/apidocs/org/gluu/service/cache/InMemoryCacheProvider.html...
Generating /home/jenkins/.jenkins/jobs/oxCore/workspace/core-cache/target/site/apidocs/org/gluu/service/cache/InMemoryConfiguration.html...
Generating /home/jenkins/.jenkins/jobs/oxCore/workspace/core-cache/target/site/apidocs/org/gluu/service/cache/LocalCache.html...
Generating /home/jenkins/.jenkins/jobs/oxCore/workspace/core-cache/target/site/apidocs/org/gluu/service/cache/LocalCache.Literal.html...
Generating /home/jenkins/.jenkins/jobs/oxCore/workspace/core-cache/target/site/apidocs/org/gluu/service/cache/MemcachedConfiguration.html...
Generating /home/jenkins/.jenkins/jobs/oxCore/workspace/core-cache/target/site/apidocs/org/gluu/service/cache/MemcachedConnectionFactoryType.html...
Generating /home/jenkins/.jenkins/jobs/oxCore/workspace/core-cache/target/site/apidocs/org/gluu/service/cache/MemcachedProvider.html...
Generating /home/jenkins/.jenkins/jobs/oxCore/workspace/core-cache/target/site/apidocs/org/gluu/service/cache/NativePersistenceCacheEntity.html...
Generating /home/jenkins/.jenkins/jobs/oxCore/workspace/core-cache/target/site/apidocs/org/gluu/service/cache/NativePersistenceCacheProvider.html...
Generating /home/jenkins/.jenkins/jobs/oxCore/workspace/core-cache/target/site/apidocs/org/gluu/service/cache/NativePersistenceConfiguration.html...
Generating /home/jenkins/.jenkins/jobs/oxCore/workspace/core-cache/target/site/apidocs/org/gluu/service/cache/RedisClusterProvider.html...
Generating /home/jenkins/.jenkins/jobs/oxCore/workspace/core-cache/target/site/apidocs/org/gluu/service/cache/RedisConfiguration.html...
Generating /home/jenkins/.jenkins/jobs/oxCore/workspace/core-cache/target/site/apidocs/org/gluu/service/cache/RedisProvider.html...
Generating /home/jenkins/.jenkins/jobs/oxCore/workspace/core-cache/target/site/apidocs/org/gluu/service/cache/RedisProviderFactory.html...
Generating /home/jenkins/.jenkins/jobs/oxCore/workspace/core-cache/target/site/apidocs/org/gluu/service/cache/RedisProviderType.html...
Generating /home/jenkins/.jenkins/jobs/oxCore/workspace/core-cache/target/site/apidocs/org/gluu/service/cache/RedisSentinelProvider.html...
Generating /home/jenkins/.jenkins/jobs/oxCore/workspace/core-cache/target/site/apidocs/org/gluu/service/cache/RedisSetParams.html...
Generating /home/jenkins/.jenkins/jobs/oxCore/workspace/core-cache/target/site/apidocs/org/gluu/service/cache/RedisShardedProvider.html...
Generating /home/jenkins/.jenkins/jobs/oxCore/workspace/core-cache/target/site/apidocs/org/gluu/service/cache/RedisStandaloneProvider.html...
Generating /home/jenkins/.jenkins/jobs/oxCore/workspace/core-cache/target/site/apidocs/org/gluu/service/cache/StandaloneCacheProviderFactory.html...
Generating /home/jenkins/.jenkins/jobs/oxCore/workspace/core-cache/target/site/apidocs/org/gluu/service/package-summary.html...
Generating /home/jenkins/.jenkins/jobs/oxCore/workspace/core-cache/target/site/apidocs/org/gluu/service/package-tree.html...
Generating /home/jenkins/.jenkins/jobs/oxCore/workspace/core-cache/target/site/apidocs/org/gluu/service/cache/package-summary.html...
Generating /home/jenkins/.jenkins/jobs/oxCore/workspace/core-cache/target/site/apidocs/org/gluu/service/cache/package-tree.html...
Generating /home/jenkins/.jenkins/jobs/oxCore/workspace/core-cache/target/site/apidocs/constant-values.html...
Generating /home/jenkins/.jenkins/jobs/oxCore/workspace/core-cache/target/site/apidocs/serialized-form.html...
Generating /home/jenkins/.jenkins/jobs/oxCore/workspace/core-cache/target/site/apidocs/org/gluu/service/cache/class-use/AbstractCacheProvider.html...
Generating /home/jenkins/.jenkins/jobs/oxCore/workspace/core-cache/target/site/apidocs/org/gluu/service/cache/class-use/CacheConfiguration.html...
Generating /home/jenkins/.jenkins/jobs/oxCore/workspace/core-cache/target/site/apidocs/org/gluu/service/cache/class-use/CacheInterface.html...
Generating /home/jenkins/.jenkins/jobs/oxCore/workspace/core-cache/target/site/apidocs/org/gluu/service/cache/class-use/CacheProviderFactory.html...
Generating /home/jenkins/.jenkins/jobs/oxCore/workspace/core-cache/target/site/apidocs/org/gluu/service/cache/class-use/CacheProviderType.html...
Generating /home/jenkins/.jenkins/jobs/oxCore/workspace/core-cache/target/site/apidocs/org/gluu/service/cache/class-use/InMemoryConfiguration.html...
Generating /home/jenkins/.jenkins/jobs/oxCore/workspace/core-cache/target/site/apidocs/org/gluu/service/cache/class-use/LocalCache.html...
Generating /home/jenkins/.jenkins/jobs/oxCore/workspace/core-cache/target/site/apidocs/org/gluu/service/cache/class-use/LocalCache.Literal.html...
Generating /home/jenkins/.jenkins/jobs/oxCore/workspace/core-cache/target/site/apidocs/org/gluu/service/cache/class-use/MemcachedConfiguration.html...
Generating /home/jenkins/.jenkins/jobs/oxCore/workspace/core-cache/target/site/apidocs/org/gluu/service/cache/class-use/MemcachedConnectionFactoryType.html...
Generating /home/jenkins/.jenkins/jobs/oxCore/workspace/core-cache/target/site/apidocs/org/gluu/service/cache/class-use/NativePersistenceConfiguration.html...
Generating /home/jenkins/.jenkins/jobs/oxCore/workspace/core-cache/target/site/apidocs/org/gluu/service/cache/class-use/RedisProviderFactory.html...
Generating /home/jenkins/.jenkins/jobs/oxCore/workspace/core-cache/target/site/apidocs/org/gluu/service/cache/class-use/RedisProviderType.html...
Generating /home/jenkins/.jenkins/jobs/oxCore/workspace/core-cache/target/site/apidocs/org/gluu/service/cache/class-use/RedisSetParams.html...
Generating /home/jenkins/.jenkins/jobs/oxCore/workspace/core-cache/target/site/apidocs/org/gluu/service/cache/class-use/StandaloneCacheProviderFactory.html...
Generating /home/jenkins/.jenkins/jobs/oxCore/workspace/core-cache/target/site/apidocs/org/gluu/service/cache/class-use/AbstractRedisProvider.html...
Generating /home/jenkins/.jenkins/jobs/oxCore/workspace/core-cache/target/site/apidocs/org/gluu/service/cache/class-use/CacheProvider.html...
Generating /home/jenkins/.jenkins/jobs/oxCore/workspace/core-cache/target/site/apidocs/org/gluu/service/cache/class-use/InMemoryCacheProvider.html...
Generating /home/jenkins/.jenkins/jobs/oxCore/workspace/core-cache/target/site/apidocs/org/gluu/service/cache/class-use/MemcachedProvider.html...
Generating /home/jenkins/.jenkins/jobs/oxCore/workspace/core-cache/target/site/apidocs/org/gluu/service/cache/class-use/NativePersistenceCacheEntity.html...
Generating /home/jenkins/.jenkins/jobs/oxCore/workspace/core-cache/target/site/apidocs/org/gluu/service/cache/class-use/RedisClusterProvider.html...
Generating /home/jenkins/.jenkins/jobs/oxCore/workspace/core-cache/target/site/apidocs/org/gluu/service/cache/class-use/RedisConfiguration.html...
Generating /home/jenkins/.jenkins/jobs/oxCore/workspace/core-cache/target/site/apidocs/org/gluu/service/cache/class-use/RedisProvider.html...
Generating /home/jenkins/.jenkins/jobs/oxCore/workspace/core-cache/target/site/apidocs/org/gluu/service/cache/class-use/RedisSentinelProvider.html...
Generating /home/jenkins/.jenkins/jobs/oxCore/workspace/core-cache/target/site/apidocs/org/gluu/service/cache/class-use/RedisShardedProvider.html...
Generating /home/jenkins/.jenkins/jobs/oxCore/workspace/core-cache/target/site/apidocs/org/gluu/service/cache/class-use/RedisStandaloneProvider.html...
Generating /home/jenkins/.jenkins/jobs/oxCore/workspace/core-cache/target/site/apidocs/org/gluu/service/cache/class-use/NativePersistenceCacheProvider.html...
Generating /home/jenkins/.jenkins/jobs/oxCore/workspace/core-cache/target/site/apidocs/org/gluu/service/class-use/BaseCacheService.html...
Generating /home/jenkins/.jenkins/jobs/oxCore/workspace/core-cache/target/site/apidocs/org/gluu/service/class-use/CacheService.html...
Generating /home/jenkins/.jenkins/jobs/oxCore/workspace/core-cache/target/site/apidocs/org/gluu/service/package-use.html...
Generating /home/jenkins/.jenkins/jobs/oxCore/workspace/core-cache/target/site/apidocs/org/gluu/service/cache/package-use.html...
Building index for all the packages and classes...
Generating /home/jenkins/.jenkins/jobs/oxCore/workspace/core-cache/target/site/apidocs/overview-tree.html...
Generating /home/jenkins/.jenkins/jobs/oxCore/workspace/core-cache/target/site/apidocs/index-all.html...
Building index for all classes...
Generating /home/jenkins/.jenkins/jobs/oxCore/workspace/core-cache/target/site/apidocs/allclasses-index.html...
Generating /home/jenkins/.jenkins/jobs/oxCore/workspace/core-cache/target/site/apidocs/allpackages-index.html...
Generating /home/jenkins/.jenkins/jobs/oxCore/workspace/core-cache/target/site/apidocs/deprecated-list.html...
Building index for all classes...
Generating /home/jenkins/.jenkins/jobs/oxCore/workspace/core-cache/target/site/apidocs/allclasses.html...
Generating /home/jenkins/.jenkins/jobs/oxCore/workspace/core-cache/target/site/apidocs/allclasses.html...
Generating /home/jenkins/.jenkins/jobs/oxCore/workspace/core-cache/target/site/apidocs/index.html...
Generating /home/jenkins/.jenkins/jobs/oxCore/workspace/core-cache/target/site/apidocs/overview-summary.html...
Generating /home/jenkins/.jenkins/jobs/oxCore/workspace/core-cache/target/site/apidocs/help-doc.html...
2 errors
2 warnings
[ERROR] Error while creating javadoc report: 
Exit code: 1 - javadoc: error - The code being documented uses modules but the packages defined in https://docs.oracle.com/javase/8/docs/api/ are in the unnamed module.
/home/jenkins/.jenkins/jobs/oxCore/workspace/core-cache/src/main/java/org/gluu/service/cache/RedisSetParams.java:29: warning: no description for @param
     * @param secondsToExpire
       ^
/home/jenkins/.jenkins/jobs/oxCore/workspace/core-cache/src/main/java/org/gluu/service/cache/RedisSetParams.java:40: warning: no description for @param
     * @param millisecondsToExpire
       ^
/home/jenkins/.jenkins/jobs/oxCore/workspace/core-cache/src/main/java/org/gluu/service/cache/RedisConfiguration.java:48: error: bad use of '>'
     * The option must be enabled prior to entering the blocking operation to have effect. The timeout must be > 0.
                                                                                                               ^

Command line was: /opt/java/amazon-corretto-11.0.7.10.1-linux-x64/bin/javadoc @options @packages

Refer to the generated Javadoc files in '/home/jenkins/.jenkins/jobs/oxCore/workspace/core-cache/target/site/apidocs' dir.

org.apache.maven.reporting.MavenReportException: 
Exit code: 1 - javadoc: error - The code being documented uses modules but the packages defined in https://docs.oracle.com/javase/8/docs/api/ are in the unnamed module.
/home/jenkins/.jenkins/jobs/oxCore/workspace/core-cache/src/main/java/org/gluu/service/cache/RedisSetParams.java:29: warning: no description for @param
     * @param secondsToExpire
       ^
/home/jenkins/.jenkins/jobs/oxCore/workspace/core-cache/src/main/java/org/gluu/service/cache/RedisSetParams.java:40: warning: no description for @param
     * @param millisecondsToExpire
       ^
/home/jenkins/.jenkins/jobs/oxCore/workspace/core-cache/src/main/java/org/gluu/service/cache/RedisConfiguration.java:48: error: bad use of '>'
     * The option must be enabled prior to entering the blocking operation to have effect. The timeout must be > 0.
                                                                                                               ^

Command line was: /opt/java/amazon-corretto-11.0.7.10.1-linux-x64/bin/javadoc @options @packages

Refer to the generated Javadoc files in '/home/jenkins/.jenkins/jobs/oxCore/workspace/core-cache/target/site/apidocs' dir.

	at org.apache.maven.plugins.javadoc.AbstractJavadocMojo.executeJavadocCommandLine(AbstractJavadocMojo.java:5298)
	at org.apache.maven.plugins.javadoc.AbstractJavadocMojo.executeReport(AbstractJavadocMojo.java:2134)
	at org.apache.maven.plugins.javadoc.JavadocReport.generate(JavadocReport.java:134)
	at org.apache.maven.plugins.javadoc.JavadocReport.doExecute(JavadocReport.java:329)
	at org.apache.maven.plugins.javadoc.AbstractJavadocMojo.execute(AbstractJavadocMojo.java:1912)
	at org.apache.maven.plugin.DefaultBuildPluginManager.executeMojo(DefaultBuildPluginManager.java:134)
	at org.apache.maven.lifecycle.internal.MojoExecutor.execute(MojoExecutor.java:207)
	at org.apache.maven.lifecycle.internal.MojoExecutor.execute(MojoExecutor.java:153)
	at org.apache.maven.lifecycle.internal.MojoExecutor.execute(MojoExecutor.java:145)
	at org.apache.maven.lifecycle.internal.LifecycleModuleBuilder.buildProject(LifecycleModuleBuilder.java:116)
	at org.apache.maven.lifecycle.internal.LifecycleModuleBuilder.buildProject(LifecycleModuleBuilder.java:80)
	at org.apache.maven.lifecycle.internal.builder.singlethreaded.SingleThreadedBuilder.build(SingleThreadedBuilder.java:51)
	at org.apache.maven.lifecycle.internal.LifecycleStarter.execute(LifecycleStarter.java:128)
	at org.apache.maven.DefaultMaven.doExecute(DefaultMaven.java:307)
	at org.apache.maven.DefaultMaven.doExecute(DefaultMaven.java:193)
	at org.apache.maven.DefaultMaven.execute(DefaultMaven.java:106)
	at org.apache.maven.cli.MavenCli.execute(MavenCli.java:863)
	at org.apache.maven.cli.MavenCli.doMain(MavenCli.java:288)
	at org.apache.maven.cli.MavenCli.main(MavenCli.java:199)
	at java.base/jdk.internal.reflect.NativeMethodAccessorImpl.invoke0(Native Method)
	at java.base/jdk.internal.reflect.NativeMethodAccessorImpl.invoke(NativeMethodAccessorImpl.java:62)
	at java.base/jdk.internal.reflect.DelegatingMethodAccessorImpl.invoke(DelegatingMethodAccessorImpl.java:43)
	at java.base/java.lang.reflect.Method.invoke(Method.java:566)
	at org.codehaus.plexus.classworlds.launcher.Launcher.launchEnhanced(Launcher.java:289)
	at org.codehaus.plexus.classworlds.launcher.Launcher.launch(Launcher.java:229)
	at org.codehaus.plexus.classworlds.launcher.Launcher.mainWithExitCode(Launcher.java:415)
	at org.codehaus.plexus.classworlds.launcher.Launcher.main(Launcher.java:356)
[INFO] 
[INFO] --- maven-site-plugin:2.1.1:site (default-site) @ oxcore-cache ---
[INFO]                                                                         
[INFO] ------------------------------------------------------------------------
[INFO] Building Caches support 4.3.0-SNAPSHOT
[INFO] ------------------------------------------------------------------------
[INFO] 
[INFO] --- maven-clean-plugin:2.4.1:clean (default-clean) @ oxcore-document-store ---
[INFO] Deleting /home/jenkins/.jenkins/jobs/oxCore/workspace/core-document-store/target
[INFO] 
[INFO] --- maven-resources-plugin:2.4:resources (default-resources) @ oxcore-document-store ---
[INFO] Using 'UTF-8' encoding to copy filtered resources.
[INFO] Copying 1 resource
[INFO] 
[INFO] --- maven-compiler-plugin:2.3.2:compile (default-compile) @ oxcore-document-store ---
[INFO] Compiling 16 source files to /home/jenkins/.jenkins/jobs/oxCore/workspace/core-document-store/target/classes
[INFO] 
[INFO] --- maven-resources-plugin:2.4:resources (default-resources) @ oxcore-document-store ---
[INFO] Using 'UTF-8' encoding to copy filtered resources.
[INFO] Copying 1 resource
[INFO] 
[INFO] --- maven-compiler-plugin:2.3.2:compile (default-compile) @ oxcore-document-store ---
[INFO] Nothing to compile - all classes are up to date
[INFO] 
[INFO] --- maven-resources-plugin:2.4:testResources (default-testResources) @ oxcore-document-store ---
[INFO] Using 'UTF-8' encoding to copy filtered resources.
[INFO] skip non existing resourceDirectory /home/jenkins/.jenkins/jobs/oxCore/workspace/core-document-store/src/test/resources
[INFO] 
[INFO] --- maven-compiler-plugin:2.3.2:testCompile (default-testCompile) @ oxcore-document-store ---
[INFO] Compiling 2 source files to /home/jenkins/.jenkins/jobs/oxCore/workspace/core-document-store/target/test-classes
[INFO] 
[INFO] --- maven-surefire-plugin:2.7.2:test (default-test) @ oxcore-document-store ---
[INFO] Surefire report directory: /home/jenkins/.jenkins/jobs/oxCore/workspace/core-document-store/target/surefire-reports

-------------------------------------------------------
 T E S T S
-------------------------------------------------------
Running TestSuite
Tests run: 0, Failures: 0, Errors: 0, Skipped: 0, Time elapsed: 0.382 sec
There are no tests to run.

Results :

Tests run: 0, Failures: 0, Errors: 0, Skipped: 0

[INFO] 
[INFO] --- maven-jar-plugin:2.4:jar (default-jar) @ oxcore-document-store ---
[INFO] Building jar: /home/jenkins/.jenkins/jobs/oxCore/workspace/core-document-store/target/oxcore-document-store-4.3.0-SNAPSHOT.jar
[INFO] 
[INFO] --- maven-install-plugin:2.3.1:install (default-install) @ oxcore-document-store ---
[INFO] Installing /home/jenkins/.jenkins/jobs/oxCore/workspace/core-document-store/target/oxcore-document-store-4.3.0-SNAPSHOT.jar to /var/www/html/maven/org/gluu/oxcore-document-store/4.3.0-SNAPSHOT/oxcore-document-store-4.3.0-SNAPSHOT.jar
[INFO] Installing /home/jenkins/.jenkins/jobs/oxCore/workspace/core-document-store/pom.xml to /var/www/html/maven/org/gluu/oxcore-document-store/4.3.0-SNAPSHOT/oxcore-document-store-4.3.0-SNAPSHOT.pom
[INFO] 
[INFO] >>> maven-javadoc-plugin:3.0.1:javadoc (default-cli) > generate-sources @ oxcore-document-store >>>
[INFO] 
[INFO] <<< maven-javadoc-plugin:3.0.1:javadoc (default-cli) < generate-sources @ oxcore-document-store <<<
[INFO] 
[INFO] --- maven-javadoc-plugin:3.0.1:javadoc (default-cli) @ oxcore-document-store ---
[ERROR] Error fetching link: /home/jenkins/.jenkins/jobs/oxCore/workspace/oxUtil/target/site/apidocs/package-list. Ignored it.
[INFO] 
Loading source files for package org.gluu.service.document.store...
Loading source files for package org.gluu.service.document.store.conf...
Loading source files for package org.gluu.service.document.store.provider...
Loading source files for package org.gluu.service.document.store.service...
Constructing Javadoc information...
Standard Doclet version 11.0.7
Building tree for all the packages and classes...
Generating /home/jenkins/.jenkins/jobs/oxCore/workspace/core-document-store/target/site/apidocs/org/gluu/service/document/store/LocalDocumentStore.html...
Generating /home/jenkins/.jenkins/jobs/oxCore/workspace/core-document-store/target/site/apidocs/org/gluu/service/document/store/LocalDocumentStore.Literal.html...
Generating /home/jenkins/.jenkins/jobs/oxCore/workspace/core-document-store/target/site/apidocs/org/gluu/service/document/store/StandaloneDocumentStoreProviderFactory.html...
Generating /home/jenkins/.jenkins/jobs/oxCore/workspace/core-document-store/target/site/apidocs/org/gluu/service/document/store/conf/DocumentStoreConfiguration.html...
Generating /home/jenkins/.jenkins/jobs/oxCore/workspace/core-document-store/target/site/apidocs/org/gluu/service/document/store/conf/DocumentStoreType.html...
Generating /home/jenkins/.jenkins/jobs/oxCore/workspace/core-document-store/target/site/apidocs/org/gluu/service/document/store/conf/JcaDocumentStoreConfiguration.html...
Generating /home/jenkins/.jenkins/jobs/oxCore/workspace/core-document-store/target/site/apidocs/org/gluu/service/document/store/conf/LocalDocumentStoreConfiguration.html...
Generating /home/jenkins/.jenkins/jobs/oxCore/workspace/core-document-store/target/site/apidocs/org/gluu/service/document/store/conf/WebDavDocumentStoreConfiguration.html...
Generating /home/jenkins/.jenkins/jobs/oxCore/workspace/core-document-store/target/site/apidocs/org/gluu/service/document/store/provider/DocumentStore.html...
Generating /home/jenkins/.jenkins/jobs/oxCore/workspace/core-document-store/target/site/apidocs/org/gluu/service/document/store/provider/DocumentStoreProvider.html...
Generating /home/jenkins/.jenkins/jobs/oxCore/workspace/core-document-store/target/site/apidocs/org/gluu/service/document/store/provider/DocumentStoreProviderFactory.html...
Generating /home/jenkins/.jenkins/jobs/oxCore/workspace/core-document-store/target/site/apidocs/org/gluu/service/document/store/provider/JcaDocumentStoreProvider.html...
Generating /home/jenkins/.jenkins/jobs/oxCore/workspace/core-document-store/target/site/apidocs/org/gluu/service/document/store/provider/LocalDocumentStoreProvider.html...
Generating /home/jenkins/.jenkins/jobs/oxCore/workspace/core-document-store/target/site/apidocs/org/gluu/service/document/store/provider/WebDavDocumentStoreProvider.html...
Generating /home/jenkins/.jenkins/jobs/oxCore/workspace/core-document-store/target/site/apidocs/org/gluu/service/document/store/service/BaseDocumentStoreService.html...
Generating /home/jenkins/.jenkins/jobs/oxCore/workspace/core-document-store/target/site/apidocs/org/gluu/service/document/store/service/DocumentStoreService.html...
Generating /home/jenkins/.jenkins/jobs/oxCore/workspace/core-document-store/target/site/apidocs/org/gluu/service/document/store/service/LocalDocumentStoreService.html...
Generating /home/jenkins/.jenkins/jobs/oxCore/workspace/core-document-store/target/site/apidocs/org/gluu/service/document/store/package-summary.html...
Generating /home/jenkins/.jenkins/jobs/oxCore/workspace/core-document-store/target/site/apidocs/org/gluu/service/document/store/package-tree.html...
Generating /home/jenkins/.jenkins/jobs/oxCore/workspace/core-document-store/target/site/apidocs/org/gluu/service/document/store/conf/package-summary.html...
Generating /home/jenkins/.jenkins/jobs/oxCore/workspace/core-document-store/target/site/apidocs/org/gluu/service/document/store/conf/package-tree.html...
Generating /home/jenkins/.jenkins/jobs/oxCore/workspace/core-document-store/target/site/apidocs/org/gluu/service/document/store/provider/package-summary.html...
Generating /home/jenkins/.jenkins/jobs/oxCore/workspace/core-document-store/target/site/apidocs/org/gluu/service/document/store/provider/package-tree.html...
Generating /home/jenkins/.jenkins/jobs/oxCore/workspace/core-document-store/target/site/apidocs/org/gluu/service/document/store/service/package-summary.html...
Generating /home/jenkins/.jenkins/jobs/oxCore/workspace/core-document-store/target/site/apidocs/org/gluu/service/document/store/service/package-tree.html...
Generating /home/jenkins/.jenkins/jobs/oxCore/workspace/core-document-store/target/site/apidocs/constant-values.html...
Generating /home/jenkins/.jenkins/jobs/oxCore/workspace/core-document-store/target/site/apidocs/serialized-form.html...
Generating /home/jenkins/.jenkins/jobs/oxCore/workspace/core-document-store/target/site/apidocs/org/gluu/service/document/store/class-use/LocalDocumentStore.html...
Generating /home/jenkins/.jenkins/jobs/oxCore/workspace/core-document-store/target/site/apidocs/org/gluu/service/document/store/class-use/LocalDocumentStore.Literal.html...
Generating /home/jenkins/.jenkins/jobs/oxCore/workspace/core-document-store/target/site/apidocs/org/gluu/service/document/store/class-use/StandaloneDocumentStoreProviderFactory.html...
Generating /home/jenkins/.jenkins/jobs/oxCore/workspace/core-document-store/target/site/apidocs/org/gluu/service/document/store/conf/class-use/DocumentStoreType.html...
Generating /home/jenkins/.jenkins/jobs/oxCore/workspace/core-document-store/target/site/apidocs/org/gluu/service/document/store/conf/class-use/LocalDocumentStoreConfiguration.html...
Generating /home/jenkins/.jenkins/jobs/oxCore/workspace/core-document-store/target/site/apidocs/org/gluu/service/document/store/conf/class-use/DocumentStoreConfiguration.html...
Generating /home/jenkins/.jenkins/jobs/oxCore/workspace/core-document-store/target/site/apidocs/org/gluu/service/document/store/conf/class-use/JcaDocumentStoreConfiguration.html...
Generating /home/jenkins/.jenkins/jobs/oxCore/workspace/core-document-store/target/site/apidocs/org/gluu/service/document/store/conf/class-use/WebDavDocumentStoreConfiguration.html...
Generating /home/jenkins/.jenkins/jobs/oxCore/workspace/core-document-store/target/site/apidocs/org/gluu/service/document/store/provider/class-use/DocumentStoreProvider.html...
Generating /home/jenkins/.jenkins/jobs/oxCore/workspace/core-document-store/target/site/apidocs/org/gluu/service/document/store/provider/class-use/DocumentStoreProviderFactory.html...
Generating /home/jenkins/.jenkins/jobs/oxCore/workspace/core-document-store/target/site/apidocs/org/gluu/service/document/store/provider/class-use/DocumentStore.html...
Generating /home/jenkins/.jenkins/jobs/oxCore/workspace/core-document-store/target/site/apidocs/org/gluu/service/document/store/provider/class-use/LocalDocumentStoreProvider.html...
Generating /home/jenkins/.jenkins/jobs/oxCore/workspace/core-document-store/target/site/apidocs/org/gluu/service/document/store/provider/class-use/JcaDocumentStoreProvider.html...
Generating /home/jenkins/.jenkins/jobs/oxCore/workspace/core-document-store/target/site/apidocs/org/gluu/service/document/store/provider/class-use/WebDavDocumentStoreProvider.html...
Generating /home/jenkins/.jenkins/jobs/oxCore/workspace/core-document-store/target/site/apidocs/org/gluu/service/document/store/service/class-use/DocumentStoreService.html...
Generating /home/jenkins/.jenkins/jobs/oxCore/workspace/core-document-store/target/site/apidocs/org/gluu/service/document/store/service/class-use/LocalDocumentStoreService.html...
Generating /home/jenkins/.jenkins/jobs/oxCore/workspace/core-document-store/target/site/apidocs/org/gluu/service/document/store/service/class-use/BaseDocumentStoreService.html...
Generating /home/jenkins/.jenkins/jobs/oxCore/workspace/core-document-store/target/site/apidocs/org/gluu/service/document/store/package-use.html...
Generating /home/jenkins/.jenkins/jobs/oxCore/workspace/core-document-store/target/site/apidocs/org/gluu/service/document/store/conf/package-use.html...
Generating /home/jenkins/.jenkins/jobs/oxCore/workspace/core-document-store/target/site/apidocs/org/gluu/service/document/store/provider/package-use.html...
Generating /home/jenkins/.jenkins/jobs/oxCore/workspace/core-document-store/target/site/apidocs/org/gluu/service/document/store/service/package-use.html...
Building index for all the packages and classes...
Generating /home/jenkins/.jenkins/jobs/oxCore/workspace/core-document-store/target/site/apidocs/overview-tree.html...
Generating /home/jenkins/.jenkins/jobs/oxCore/workspace/core-document-store/target/site/apidocs/index-all.html...
Building index for all classes...
Generating /home/jenkins/.jenkins/jobs/oxCore/workspace/core-document-store/target/site/apidocs/allclasses-index.html...
Generating /home/jenkins/.jenkins/jobs/oxCore/workspace/core-document-store/target/site/apidocs/allpackages-index.html...
Generating /home/jenkins/.jenkins/jobs/oxCore/workspace/core-document-store/target/site/apidocs/deprecated-list.html...
Building index for all classes...
Generating /home/jenkins/.jenkins/jobs/oxCore/workspace/core-document-store/target/site/apidocs/allclasses.html...
Generating /home/jenkins/.jenkins/jobs/oxCore/workspace/core-document-store/target/site/apidocs/allclasses.html...
Generating /home/jenkins/.jenkins/jobs/oxCore/workspace/core-document-store/target/site/apidocs/index.html...
Generating /home/jenkins/.jenkins/jobs/oxCore/workspace/core-document-store/target/site/apidocs/overview-summary.html...
Generating /home/jenkins/.jenkins/jobs/oxCore/workspace/core-document-store/target/site/apidocs/help-doc.html...
1 error
19 warnings
[ERROR] Error while creating javadoc report: 
Exit code: 1 - javadoc: error - The code being documented uses modules but the packages defined in https://docs.oracle.com/javase/8/docs/api/ are in the unnamed module.
/home/jenkins/.jenkins/jobs/oxCore/workspace/core-document-store/src/main/java/org/gluu/service/document/store/provider/DocumentStore.java:17: warning: no @param for path
	boolean hasDocument(String path);
	        ^
/home/jenkins/.jenkins/jobs/oxCore/workspace/core-document-store/src/main/java/org/gluu/service/document/store/provider/DocumentStore.java:17: warning: no @return
	boolean hasDocument(String path);
	        ^
/home/jenkins/.jenkins/jobs/oxCore/workspace/core-document-store/src/main/java/org/gluu/service/document/store/provider/DocumentStore.java:22: warning: no @param for path
	boolean saveDocument(String path, String documentContent, Charset charset);
	        ^
/home/jenkins/.jenkins/jobs/oxCore/workspace/core-document-store/src/main/java/org/gluu/service/document/store/provider/DocumentStore.java:22: warning: no @param for documentContent
	boolean saveDocument(String path, String documentContent, Charset charset);
	        ^
/home/jenkins/.jenkins/jobs/oxCore/workspace/core-document-store/src/main/java/org/gluu/service/document/store/provider/DocumentStore.java:22: warning: no @param for charset
	boolean saveDocument(String path, String documentContent, Charset charset);
	        ^
/home/jenkins/.jenkins/jobs/oxCore/workspace/core-document-store/src/main/java/org/gluu/service/document/store/provider/DocumentStore.java:22: warning: no @return
	boolean saveDocument(String path, String documentContent, Charset charset);
	        ^
/home/jenkins/.jenkins/jobs/oxCore/workspace/core-document-store/src/main/java/org/gluu/service/document/store/provider/DocumentStore.java:27: warning: no @param for path
	boolean saveDocumentStream(String path, InputStream documentStream);
	        ^
/home/jenkins/.jenkins/jobs/oxCore/workspace/core-document-store/src/main/java/org/gluu/service/document/store/provider/DocumentStore.java:27: warning: no @param for documentStream
	boolean saveDocumentStream(String path, InputStream documentStream);
	        ^
/home/jenkins/.jenkins/jobs/oxCore/workspace/core-document-store/src/main/java/org/gluu/service/document/store/provider/DocumentStore.java:27: warning: no @return
	boolean saveDocumentStream(String path, InputStream documentStream);
	        ^
/home/jenkins/.jenkins/jobs/oxCore/workspace/core-document-store/src/main/java/org/gluu/service/document/store/provider/DocumentStore.java:32: warning: no @param for path
	String readDocument(String path, Charset charset);
	       ^
/home/jenkins/.jenkins/jobs/oxCore/workspace/core-document-store/src/main/java/org/gluu/service/document/store/provider/DocumentStore.java:32: warning: no @param for charset
	String readDocument(String path, Charset charset);
	       ^
/home/jenkins/.jenkins/jobs/oxCore/workspace/core-document-store/src/main/java/org/gluu/service/document/store/provider/DocumentStore.java:32: warning: no @return
	String readDocument(String path, Charset charset);
	       ^
/home/jenkins/.jenkins/jobs/oxCore/workspace/core-document-store/src/main/java/org/gluu/service/document/store/provider/DocumentStore.java:37: warning: no @param for path
	public InputStream readDocumentAsStream(String path) ;
	                   ^
/home/jenkins/.jenkins/jobs/oxCore/workspace/core-document-store/src/main/java/org/gluu/service/document/store/provider/DocumentStore.java:37: warning: no @return
	public InputStream readDocumentAsStream(String path) ;
	                   ^
/home/jenkins/.jenkins/jobs/oxCore/workspace/core-document-store/src/main/java/org/gluu/service/document/store/provider/DocumentStore.java:42: warning: no @param for path
	boolean removeDocument(String path);
	        ^
/home/jenkins/.jenkins/jobs/oxCore/workspace/core-document-store/src/main/java/org/gluu/service/document/store/provider/DocumentStore.java:42: warning: no @return
	boolean removeDocument(String path);
	        ^
/home/jenkins/.jenkins/jobs/oxCore/workspace/core-document-store/src/main/java/org/gluu/service/document/store/provider/DocumentStore.java:47: warning: no @param for currentPath
	boolean renameDocument(String currentPath, String destinationPath);
	        ^
/home/jenkins/.jenkins/jobs/oxCore/workspace/core-document-store/src/main/java/org/gluu/service/document/store/provider/DocumentStore.java:47: warning: no @param for destinationPath
	boolean renameDocument(String currentPath, String destinationPath);
	        ^
/home/jenkins/.jenkins/jobs/oxCore/workspace/core-document-store/src/main/java/org/gluu/service/document/store/provider/DocumentStore.java:47: warning: no @return
	boolean renameDocument(String currentPath, String destinationPath);
	        ^

Command line was: /opt/java/amazon-corretto-11.0.7.10.1-linux-x64/bin/javadoc @options @packages

Refer to the generated Javadoc files in '/home/jenkins/.jenkins/jobs/oxCore/workspace/core-document-store/target/site/apidocs' dir.

org.apache.maven.reporting.MavenReportException: 
Exit code: 1 - javadoc: error - The code being documented uses modules but the packages defined in https://docs.oracle.com/javase/8/docs/api/ are in the unnamed module.
/home/jenkins/.jenkins/jobs/oxCore/workspace/core-document-store/src/main/java/org/gluu/service/document/store/provider/DocumentStore.java:17: warning: no @param for path
	boolean hasDocument(String path);
	        ^
/home/jenkins/.jenkins/jobs/oxCore/workspace/core-document-store/src/main/java/org/gluu/service/document/store/provider/DocumentStore.java:17: warning: no @return
	boolean hasDocument(String path);
	        ^
/home/jenkins/.jenkins/jobs/oxCore/workspace/core-document-store/src/main/java/org/gluu/service/document/store/provider/DocumentStore.java:22: warning: no @param for path
	boolean saveDocument(String path, String documentContent, Charset charset);
	        ^
/home/jenkins/.jenkins/jobs/oxCore/workspace/core-document-store/src/main/java/org/gluu/service/document/store/provider/DocumentStore.java:22: warning: no @param for documentContent
	boolean saveDocument(String path, String documentContent, Charset charset);
	        ^
/home/jenkins/.jenkins/jobs/oxCore/workspace/core-document-store/src/main/java/org/gluu/service/document/store/provider/DocumentStore.java:22: warning: no @param for charset
	boolean saveDocument(String path, String documentContent, Charset charset);
	        ^
/home/jenkins/.jenkins/jobs/oxCore/workspace/core-document-store/src/main/java/org/gluu/service/document/store/provider/DocumentStore.java:22: warning: no @return
	boolean saveDocument(String path, String documentContent, Charset charset);
	        ^
/home/jenkins/.jenkins/jobs/oxCore/workspace/core-document-store/src/main/java/org/gluu/service/document/store/provider/DocumentStore.java:27: warning: no @param for path
	boolean saveDocumentStream(String path, InputStream documentStream);
	        ^
/home/jenkins/.jenkins/jobs/oxCore/workspace/core-document-store/src/main/java/org/gluu/service/document/store/provider/DocumentStore.java:27: warning: no @param for documentStream
	boolean saveDocumentStream(String path, InputStream documentStream);
	        ^
/home/jenkins/.jenkins/jobs/oxCore/workspace/core-document-store/src/main/java/org/gluu/service/document/store/provider/DocumentStore.java:27: warning: no @return
	boolean saveDocumentStream(String path, InputStream documentStream);
	        ^
/home/jenkins/.jenkins/jobs/oxCore/workspace/core-document-store/src/main/java/org/gluu/service/document/store/provider/DocumentStore.java:32: warning: no @param for path
	String readDocument(String path, Charset charset);
	       ^
/home/jenkins/.jenkins/jobs/oxCore/workspace/core-document-store/src/main/java/org/gluu/service/document/store/provider/DocumentStore.java:32: warning: no @param for charset
	String readDocument(String path, Charset charset);
	       ^
/home/jenkins/.jenkins/jobs/oxCore/workspace/core-document-store/src/main/java/org/gluu/service/document/store/provider/DocumentStore.java:32: warning: no @return
	String readDocument(String path, Charset charset);
	       ^
/home/jenkins/.jenkins/jobs/oxCore/workspace/core-document-store/src/main/java/org/gluu/service/document/store/provider/DocumentStore.java:37: warning: no @param for path
	public InputStream readDocumentAsStream(String path) ;
	                   ^
/home/jenkins/.jenkins/jobs/oxCore/workspace/core-document-store/src/main/java/org/gluu/service/document/store/provider/DocumentStore.java:37: warning: no @return
	public InputStream readDocumentAsStream(String path) ;
	                   ^
/home/jenkins/.jenkins/jobs/oxCore/workspace/core-document-store/src/main/java/org/gluu/service/document/store/provider/DocumentStore.java:42: warning: no @param for path
	boolean removeDocument(String path);
	        ^
/home/jenkins/.jenkins/jobs/oxCore/workspace/core-document-store/src/main/java/org/gluu/service/document/store/provider/DocumentStore.java:42: warning: no @return
	boolean removeDocument(String path);
	        ^
/home/jenkins/.jenkins/jobs/oxCore/workspace/core-document-store/src/main/java/org/gluu/service/document/store/provider/DocumentStore.java:47: warning: no @param for currentPath
	boolean renameDocument(String currentPath, String destinationPath);
	        ^
/home/jenkins/.jenkins/jobs/oxCore/workspace/core-document-store/src/main/java/org/gluu/service/document/store/provider/DocumentStore.java:47: warning: no @param for destinationPath
	boolean renameDocument(String currentPath, String destinationPath);
	        ^
/home/jenkins/.jenkins/jobs/oxCore/workspace/core-document-store/src/main/java/org/gluu/service/document/store/provider/DocumentStore.java:47: warning: no @return
	boolean renameDocument(String currentPath, String destinationPath);
	        ^

Command line was: /opt/java/amazon-corretto-11.0.7.10.1-linux-x64/bin/javadoc @options @packages

Refer to the generated Javadoc files in '/home/jenkins/.jenkins/jobs/oxCore/workspace/core-document-store/target/site/apidocs' dir.

	at org.apache.maven.plugins.javadoc.AbstractJavadocMojo.executeJavadocCommandLine(AbstractJavadocMojo.java:5298)
	at org.apache.maven.plugins.javadoc.AbstractJavadocMojo.executeReport(AbstractJavadocMojo.java:2134)
	at org.apache.maven.plugins.javadoc.JavadocReport.generate(JavadocReport.java:134)
	at org.apache.maven.plugins.javadoc.JavadocReport.doExecute(JavadocReport.java:329)
	at org.apache.maven.plugins.javadoc.AbstractJavadocMojo.execute(AbstractJavadocMojo.java:1912)
	at org.apache.maven.plugin.DefaultBuildPluginManager.executeMojo(DefaultBuildPluginManager.java:134)
	at org.apache.maven.lifecycle.internal.MojoExecutor.execute(MojoExecutor.java:207)
	at org.apache.maven.lifecycle.internal.MojoExecutor.execute(MojoExecutor.java:153)
	at org.apache.maven.lifecycle.internal.MojoExecutor.execute(MojoExecutor.java:145)
	at org.apache.maven.lifecycle.internal.LifecycleModuleBuilder.buildProject(LifecycleModuleBuilder.java:116)
	at org.apache.maven.lifecycle.internal.LifecycleModuleBuilder.buildProject(LifecycleModuleBuilder.java:80)
	at org.apache.maven.lifecycle.internal.builder.singlethreaded.SingleThreadedBuilder.build(SingleThreadedBuilder.java:51)
	at org.apache.maven.lifecycle.internal.LifecycleStarter.execute(LifecycleStarter.java:128)
	at org.apache.maven.DefaultMaven.doExecute(DefaultMaven.java:307)
	at org.apache.maven.DefaultMaven.doExecute(DefaultMaven.java:193)
	at org.apache.maven.DefaultMaven.execute(DefaultMaven.java:106)
	at org.apache.maven.cli.MavenCli.execute(MavenCli.java:863)
	at org.apache.maven.cli.MavenCli.doMain(MavenCli.java:288)
	at org.apache.maven.cli.MavenCli.main(MavenCli.java:199)
	at java.base/jdk.internal.reflect.NativeMethodAccessorImpl.invoke0(Native Method)
	at java.base/jdk.internal.reflect.NativeMethodAccessorImpl.invoke(NativeMethodAccessorImpl.java:62)
	at java.base/jdk.internal.reflect.DelegatingMethodAccessorImpl.invoke(DelegatingMethodAccessorImpl.java:43)
	at java.base/java.lang.reflect.Method.invoke(Method.java:566)
	at org.codehaus.plexus.classworlds.launcher.Launcher.launchEnhanced(Launcher.java:289)
	at org.codehaus.plexus.classworlds.launcher.Launcher.launch(Launcher.java:229)
	at org.codehaus.plexus.classworlds.launcher.Launcher.mainWithExitCode(Launcher.java:415)
	at org.codehaus.plexus.classworlds.launcher.Launcher.main(Launcher.java:356)
[INFO] 
[INFO] --- maven-site-plugin:2.1.1:site (default-site) @ oxcore-document-store ---
[INFO]                                                                         
[INFO] ------------------------------------------------------------------------
[INFO] Building Configuration factories for standalone applications 4.3.0-SNAPSHOT
[INFO] ------------------------------------------------------------------------
[INFO] 
[INFO] --- maven-clean-plugin:2.4.1:clean (default-clean) @ oxcore-standalone ---
[INFO] Deleting /home/jenkins/.jenkins/jobs/oxCore/workspace/core-standalone/target
[INFO] 
[INFO] --- maven-resources-plugin:2.4:resources (default-resources) @ oxcore-standalone ---
[INFO] Using 'UTF-8' encoding to copy filtered resources.
[INFO] skip non existing resourceDirectory /home/jenkins/.jenkins/jobs/oxCore/workspace/core-standalone/src/main/resources
[INFO] 
[INFO] --- maven-compiler-plugin:2.3.2:compile (default-compile) @ oxcore-standalone ---
[INFO] Compiling 5 source files to /home/jenkins/.jenkins/jobs/oxCore/workspace/core-standalone/target/classes
[INFO] 
[INFO] --- maven-resources-plugin:2.4:resources (default-resources) @ oxcore-standalone ---
[INFO] Using 'UTF-8' encoding to copy filtered resources.
[INFO] skip non existing resourceDirectory /home/jenkins/.jenkins/jobs/oxCore/workspace/core-standalone/src/main/resources
[INFO] 
[INFO] --- maven-compiler-plugin:2.3.2:compile (default-compile) @ oxcore-standalone ---
[INFO] Nothing to compile - all classes are up to date
[INFO] 
[INFO] --- maven-resources-plugin:2.4:testResources (default-testResources) @ oxcore-standalone ---
[INFO] Using 'UTF-8' encoding to copy filtered resources.
[INFO] skip non existing resourceDirectory /home/jenkins/.jenkins/jobs/oxCore/workspace/core-standalone/src/test/resources
[INFO] 
[INFO] --- maven-compiler-plugin:2.3.2:testCompile (default-testCompile) @ oxcore-standalone ---
[INFO] Compiling 2 source files to /home/jenkins/.jenkins/jobs/oxCore/workspace/core-standalone/target/test-classes
[INFO] 
[INFO] --- maven-surefire-plugin:2.7.2:test (default-test) @ oxcore-standalone ---
[INFO] Surefire report directory: /home/jenkins/.jenkins/jobs/oxCore/workspace/core-standalone/target/surefire-reports

-------------------------------------------------------
 T E S T S
-------------------------------------------------------
Running TestSuite
Tests run: 0, Failures: 0, Errors: 0, Skipped: 0, Time elapsed: 0.359 sec
There are no tests to run.

Results :

Tests run: 0, Failures: 0, Errors: 0, Skipped: 0

[INFO] 
[INFO] --- maven-jar-plugin:2.4:jar (default-jar) @ oxcore-standalone ---
[INFO] Building jar: /home/jenkins/.jenkins/jobs/oxCore/workspace/core-standalone/target/oxcore-standalone-4.3.0-SNAPSHOT.jar
[INFO] 
[INFO] --- maven-install-plugin:2.3.1:install (default-install) @ oxcore-standalone ---
[INFO] Installing /home/jenkins/.jenkins/jobs/oxCore/workspace/core-standalone/target/oxcore-standalone-4.3.0-SNAPSHOT.jar to /var/www/html/maven/org/gluu/oxcore-standalone/4.3.0-SNAPSHOT/oxcore-standalone-4.3.0-SNAPSHOT.jar
[INFO] Installing /home/jenkins/.jenkins/jobs/oxCore/workspace/core-standalone/pom.xml to /var/www/html/maven/org/gluu/oxcore-standalone/4.3.0-SNAPSHOT/oxcore-standalone-4.3.0-SNAPSHOT.pom
[INFO] 
[INFO] >>> maven-javadoc-plugin:3.0.1:javadoc (default-cli) > generate-sources @ oxcore-standalone >>>
[INFO] 
[INFO] <<< maven-javadoc-plugin:3.0.1:javadoc (default-cli) < generate-sources @ oxcore-standalone <<<
[INFO] 
[INFO] --- maven-javadoc-plugin:3.0.1:javadoc (default-cli) @ oxcore-standalone ---
[ERROR] Error fetching link: /home/jenkins/.jenkins/jobs/oxCore/workspace/core-cache/target/site/apidocs/package-list. Ignored it.
[INFO] 
Loading source files for package org.gluu.conf.model...
Loading source files for package org.gluu.conf.service...
Constructing Javadoc information...
Standard Doclet version 11.0.7
Building tree for all the packages and classes...
Generating /home/jenkins/.jenkins/jobs/oxCore/workspace/core-standalone/target/site/apidocs/org/gluu/conf/model/AppConfiguration.html...
Generating /home/jenkins/.jenkins/jobs/oxCore/workspace/core-standalone/target/site/apidocs/org/gluu/conf/model/AppConfigurationEntry.html...
Generating /home/jenkins/.jenkins/jobs/oxCore/workspace/core-standalone/target/site/apidocs/org/gluu/conf/model/ClaimToAttributeMapping.html...
Generating /home/jenkins/.jenkins/jobs/oxCore/workspace/core-standalone/target/site/apidocs/org/gluu/conf/model/SharedConfigurationEntry.html...
Generating /home/jenkins/.jenkins/jobs/oxCore/workspace/core-standalone/target/site/apidocs/org/gluu/conf/service/ConfigurationFactory.html...
Generating /home/jenkins/.jenkins/jobs/oxCore/workspace/core-standalone/target/site/apidocs/org/gluu/conf/model/package-summary.html...
Generating /home/jenkins/.jenkins/jobs/oxCore/workspace/core-standalone/target/site/apidocs/org/gluu/conf/model/package-tree.html...
Generating /home/jenkins/.jenkins/jobs/oxCore/workspace/core-standalone/target/site/apidocs/org/gluu/conf/service/package-summary.html...
Generating /home/jenkins/.jenkins/jobs/oxCore/workspace/core-standalone/target/site/apidocs/org/gluu/conf/service/package-tree.html...
Generating /home/jenkins/.jenkins/jobs/oxCore/workspace/core-standalone/target/site/apidocs/constant-values.html...
Generating /home/jenkins/.jenkins/jobs/oxCore/workspace/core-standalone/target/site/apidocs/serialized-form.html...
Generating /home/jenkins/.jenkins/jobs/oxCore/workspace/core-standalone/target/site/apidocs/org/gluu/conf/model/class-use/AppConfiguration.html...
Generating /home/jenkins/.jenkins/jobs/oxCore/workspace/core-standalone/target/site/apidocs/org/gluu/conf/model/class-use/AppConfigurationEntry.html...
Generating /home/jenkins/.jenkins/jobs/oxCore/workspace/core-standalone/target/site/apidocs/org/gluu/conf/model/class-use/ClaimToAttributeMapping.html...
Generating /home/jenkins/.jenkins/jobs/oxCore/workspace/core-standalone/target/site/apidocs/org/gluu/conf/model/class-use/SharedConfigurationEntry.html...
Generating /home/jenkins/.jenkins/jobs/oxCore/workspace/core-standalone/target/site/apidocs/org/gluu/conf/service/class-use/ConfigurationFactory.html...
Generating /home/jenkins/.jenkins/jobs/oxCore/workspace/core-standalone/target/site/apidocs/org/gluu/conf/model/package-use.html...
Generating /home/jenkins/.jenkins/jobs/oxCore/workspace/core-standalone/target/site/apidocs/org/gluu/conf/service/package-use.html...
Building index for all the packages and classes...
Generating /home/jenkins/.jenkins/jobs/oxCore/workspace/core-standalone/target/site/apidocs/overview-tree.html...
Generating /home/jenkins/.jenkins/jobs/oxCore/workspace/core-standalone/target/site/apidocs/index-all.html...
Building index for all classes...
Generating /home/jenkins/.jenkins/jobs/oxCore/workspace/core-standalone/target/site/apidocs/allclasses-index.html...
Generating /home/jenkins/.jenkins/jobs/oxCore/workspace/core-standalone/target/site/apidocs/allpackages-index.html...
Generating /home/jenkins/.jenkins/jobs/oxCore/workspace/core-standalone/target/site/apidocs/deprecated-list.html...
Building index for all classes...
Generating /home/jenkins/.jenkins/jobs/oxCore/workspace/core-standalone/target/site/apidocs/allclasses.html...
Generating /home/jenkins/.jenkins/jobs/oxCore/workspace/core-standalone/target/site/apidocs/allclasses.html...
Generating /home/jenkins/.jenkins/jobs/oxCore/workspace/core-standalone/target/site/apidocs/index.html...
Generating /home/jenkins/.jenkins/jobs/oxCore/workspace/core-standalone/target/site/apidocs/overview-summary.html...
Generating /home/jenkins/.jenkins/jobs/oxCore/workspace/core-standalone/target/site/apidocs/help-doc.html...
1 error
[ERROR] Error while creating javadoc report: 
Exit code: 1 - javadoc: error - The code being documented uses modules but the packages defined in https://docs.oracle.com/javase/8/docs/api/ are in the unnamed module.

Command line was: /opt/java/amazon-corretto-11.0.7.10.1-linux-x64/bin/javadoc @options @packages

Refer to the generated Javadoc files in '/home/jenkins/.jenkins/jobs/oxCore/workspace/core-standalone/target/site/apidocs' dir.

org.apache.maven.reporting.MavenReportException: 
Exit code: 1 - javadoc: error - The code being documented uses modules but the packages defined in https://docs.oracle.com/javase/8/docs/api/ are in the unnamed module.

Command line was: /opt/java/amazon-corretto-11.0.7.10.1-linux-x64/bin/javadoc @options @packages

Refer to the generated Javadoc files in '/home/jenkins/.jenkins/jobs/oxCore/workspace/core-standalone/target/site/apidocs' dir.

	at org.apache.maven.plugins.javadoc.AbstractJavadocMojo.executeJavadocCommandLine(AbstractJavadocMojo.java:5298)
	at org.apache.maven.plugins.javadoc.AbstractJavadocMojo.executeReport(AbstractJavadocMojo.java:2134)
	at org.apache.maven.plugins.javadoc.JavadocReport.generate(JavadocReport.java:134)
	at org.apache.maven.plugins.javadoc.JavadocReport.doExecute(JavadocReport.java:329)
	at org.apache.maven.plugins.javadoc.AbstractJavadocMojo.execute(AbstractJavadocMojo.java:1912)
	at org.apache.maven.plugin.DefaultBuildPluginManager.executeMojo(DefaultBuildPluginManager.java:134)
	at org.apache.maven.lifecycle.internal.MojoExecutor.execute(MojoExecutor.java:207)
	at org.apache.maven.lifecycle.internal.MojoExecutor.execute(MojoExecutor.java:153)
	at org.apache.maven.lifecycle.internal.MojoExecutor.execute(MojoExecutor.java:145)
	at org.apache.maven.lifecycle.internal.LifecycleModuleBuilder.buildProject(LifecycleModuleBuilder.java:116)
	at org.apache.maven.lifecycle.internal.LifecycleModuleBuilder.buildProject(LifecycleModuleBuilder.java:80)
	at org.apache.maven.lifecycle.internal.builder.singlethreaded.SingleThreadedBuilder.build(SingleThreadedBuilder.java:51)
	at org.apache.maven.lifecycle.internal.LifecycleStarter.execute(LifecycleStarter.java:128)
	at org.apache.maven.DefaultMaven.doExecute(DefaultMaven.java:307)
	at org.apache.maven.DefaultMaven.doExecute(DefaultMaven.java:193)
	at org.apache.maven.DefaultMaven.execute(DefaultMaven.java:106)
	at org.apache.maven.cli.MavenCli.execute(MavenCli.java:863)
	at org.apache.maven.cli.MavenCli.doMain(MavenCli.java:288)
	at org.apache.maven.cli.MavenCli.main(MavenCli.java:199)
	at java.base/jdk.internal.reflect.NativeMethodAccessorImpl.invoke0(Native Method)
	at java.base/jdk.internal.reflect.NativeMethodAccessorImpl.invoke(NativeMethodAccessorImpl.java:62)
	at java.base/jdk.internal.reflect.DelegatingMethodAccessorImpl.invoke(DelegatingMethodAccessorImpl.java:43)
	at java.base/java.lang.reflect.Method.invoke(Method.java:566)
	at org.codehaus.plexus.classworlds.launcher.Launcher.launchEnhanced(Launcher.java:289)
	at org.codehaus.plexus.classworlds.launcher.Launcher.launch(Launcher.java:229)
	at org.codehaus.plexus.classworlds.launcher.Launcher.mainWithExitCode(Launcher.java:415)
	at org.codehaus.plexus.classworlds.launcher.Launcher.main(Launcher.java:356)
[INFO] 
[INFO] --- maven-site-plugin:2.1.1:site (default-site) @ oxcore-standalone ---
[INFO]                                                                         
[INFO] ------------------------------------------------------------------------
[INFO] Building oxSaml 4.3.0-SNAPSHOT
[INFO] ------------------------------------------------------------------------
[INFO] 
[INFO] --- maven-clean-plugin:2.4.1:clean (default-clean) @ oxcore-saml ---
[INFO] Deleting /home/jenkins/.jenkins/jobs/oxCore/workspace/oxSaml/target
[INFO] 
[INFO] --- maven-resources-plugin:2.4:resources (default-resources) @ oxcore-saml ---
[INFO] Using 'UTF-8' encoding to copy filtered resources.
[INFO] Copying 1 resource
[INFO] 
[INFO] --- maven-compiler-plugin:2.3.2:compile (default-compile) @ oxcore-saml ---
[INFO] Compiling 7 source files to /home/jenkins/.jenkins/jobs/oxCore/workspace/oxSaml/target/classes
[INFO] 
[INFO] --- maven-resources-plugin:2.4:resources (default-resources) @ oxcore-saml ---
[INFO] Using 'UTF-8' encoding to copy filtered resources.
[INFO] Copying 1 resource
[INFO] 
[INFO] --- maven-compiler-plugin:2.3.2:compile (default-compile) @ oxcore-saml ---
[INFO] Nothing to compile - all classes are up to date
[INFO] 
[INFO] --- maven-resources-plugin:2.4:testResources (default-testResources) @ oxcore-saml ---
[INFO] Using 'UTF-8' encoding to copy filtered resources.
[INFO] skip non existing resourceDirectory /home/jenkins/.jenkins/jobs/oxCore/workspace/oxSaml/src/test/resources
[INFO] 
[INFO] --- maven-compiler-plugin:2.3.2:testCompile (default-testCompile) @ oxcore-saml ---
[INFO] Nothing to compile - all classes are up to date
[INFO] 
[INFO] --- maven-surefire-plugin:2.7.2:test (default-test) @ oxcore-saml ---
[INFO] No tests to run.
[INFO] Surefire report directory: /home/jenkins/.jenkins/jobs/oxCore/workspace/oxSaml/target/surefire-reports

-------------------------------------------------------
 T E S T S
-------------------------------------------------------
There are no tests to run.

Results :

Tests run: 0, Failures: 0, Errors: 0, Skipped: 0

[INFO] 
[INFO] --- maven-jar-plugin:2.4:jar (default-jar) @ oxcore-saml ---
[INFO] Building jar: /home/jenkins/.jenkins/jobs/oxCore/workspace/oxSaml/target/oxcore-saml-4.3.0-SNAPSHOT.jar
[INFO] 
[INFO] --- maven-install-plugin:2.3.1:install (default-install) @ oxcore-saml ---
[INFO] Installing /home/jenkins/.jenkins/jobs/oxCore/workspace/oxSaml/target/oxcore-saml-4.3.0-SNAPSHOT.jar to /var/www/html/maven/org/gluu/oxcore-saml/4.3.0-SNAPSHOT/oxcore-saml-4.3.0-SNAPSHOT.jar
[INFO] Installing /home/jenkins/.jenkins/jobs/oxCore/workspace/oxSaml/pom.xml to /var/www/html/maven/org/gluu/oxcore-saml/4.3.0-SNAPSHOT/oxcore-saml-4.3.0-SNAPSHOT.pom
[INFO] 
[INFO] >>> maven-javadoc-plugin:3.0.1:javadoc (default-cli) > generate-sources @ oxcore-saml >>>
[INFO] 
[INFO] <<< maven-javadoc-plugin:3.0.1:javadoc (default-cli) < generate-sources @ oxcore-saml <<<
[INFO] 
[INFO] --- maven-javadoc-plugin:3.0.1:javadoc (default-cli) @ oxcore-saml ---
[ERROR] Error fetching link: /home/jenkins/.jenkins/jobs/oxCore/workspace/oxUtil/target/site/apidocs/package-list. Ignored it.
[ERROR] Error fetching link: /home/jenkins/.jenkins/jobs/oxCore/workspace/core-document-store/target/site/apidocs/package-list. Ignored it.
[INFO] 
Loading source files for package org.gluu.saml.exception...
Loading source files for package org.gluu.saml.metadata...
Loading source files for package org.gluu.saml...
Constructing Javadoc information...
Standard Doclet version 11.0.7
Building tree for all the packages and classes...
Generating /home/jenkins/.jenkins/jobs/oxCore/workspace/oxSaml/target/site/apidocs/org/gluu/saml/AuthRequest.html...
Generating /home/jenkins/.jenkins/jobs/oxCore/workspace/oxSaml/target/site/apidocs/org/gluu/saml/Response.html...
Generating /home/jenkins/.jenkins/jobs/oxCore/workspace/oxSaml/target/site/apidocs/org/gluu/saml/SamlConfiguration.html...
Generating /home/jenkins/.jenkins/jobs/oxCore/workspace/oxSaml/target/site/apidocs/org/gluu/saml/SimpleNamespaceContext.html...
Generating /home/jenkins/.jenkins/jobs/oxCore/workspace/oxSaml/target/site/apidocs/org/gluu/saml/exception/CloneFailedException.html...
Generating /home/jenkins/.jenkins/jobs/oxCore/workspace/oxSaml/target/site/apidocs/org/gluu/saml/metadata/EntityIDHandler.html...
Generating /home/jenkins/.jenkins/jobs/oxCore/workspace/oxSaml/target/site/apidocs/org/gluu/saml/metadata/SAMLMetadataParser.html...
Generating /home/jenkins/.jenkins/jobs/oxCore/workspace/oxSaml/target/site/apidocs/org/gluu/saml/package-summary.html...
Generating /home/jenkins/.jenkins/jobs/oxCore/workspace/oxSaml/target/site/apidocs/org/gluu/saml/package-tree.html...
Generating /home/jenkins/.jenkins/jobs/oxCore/workspace/oxSaml/target/site/apidocs/org/gluu/saml/exception/package-summary.html...
Generating /home/jenkins/.jenkins/jobs/oxCore/workspace/oxSaml/target/site/apidocs/org/gluu/saml/exception/package-tree.html...
Generating /home/jenkins/.jenkins/jobs/oxCore/workspace/oxSaml/target/site/apidocs/org/gluu/saml/metadata/package-summary.html...
Generating /home/jenkins/.jenkins/jobs/oxCore/workspace/oxSaml/target/site/apidocs/org/gluu/saml/metadata/package-tree.html...
Generating /home/jenkins/.jenkins/jobs/oxCore/workspace/oxSaml/target/site/apidocs/constant-values.html...
Generating /home/jenkins/.jenkins/jobs/oxCore/workspace/oxSaml/target/site/apidocs/serialized-form.html...
Generating /home/jenkins/.jenkins/jobs/oxCore/workspace/oxSaml/target/site/apidocs/org/gluu/saml/exception/class-use/CloneFailedException.html...
Generating /home/jenkins/.jenkins/jobs/oxCore/workspace/oxSaml/target/site/apidocs/org/gluu/saml/metadata/class-use/EntityIDHandler.html...
Generating /home/jenkins/.jenkins/jobs/oxCore/workspace/oxSaml/target/site/apidocs/org/gluu/saml/metadata/class-use/SAMLMetadataParser.html...
Generating /home/jenkins/.jenkins/jobs/oxCore/workspace/oxSaml/target/site/apidocs/org/gluu/saml/class-use/AuthRequest.html...
Generating /home/jenkins/.jenkins/jobs/oxCore/workspace/oxSaml/target/site/apidocs/org/gluu/saml/class-use/SamlConfiguration.html...
Generating /home/jenkins/.jenkins/jobs/oxCore/workspace/oxSaml/target/site/apidocs/org/gluu/saml/class-use/SimpleNamespaceContext.html...
Generating /home/jenkins/.jenkins/jobs/oxCore/workspace/oxSaml/target/site/apidocs/org/gluu/saml/class-use/Response.html...
Generating /home/jenkins/.jenkins/jobs/oxCore/workspace/oxSaml/target/site/apidocs/org/gluu/saml/package-use.html...
Generating /home/jenkins/.jenkins/jobs/oxCore/workspace/oxSaml/target/site/apidocs/org/gluu/saml/exception/package-use.html...
Generating /home/jenkins/.jenkins/jobs/oxCore/workspace/oxSaml/target/site/apidocs/org/gluu/saml/metadata/package-use.html...
Building index for all the packages and classes...
Generating /home/jenkins/.jenkins/jobs/oxCore/workspace/oxSaml/target/site/apidocs/overview-tree.html...
Generating /home/jenkins/.jenkins/jobs/oxCore/workspace/oxSaml/target/site/apidocs/index-all.html...
Building index for all classes...
Generating /home/jenkins/.jenkins/jobs/oxCore/workspace/oxSaml/target/site/apidocs/allclasses-index.html...
Generating /home/jenkins/.jenkins/jobs/oxCore/workspace/oxSaml/target/site/apidocs/allpackages-index.html...
Generating /home/jenkins/.jenkins/jobs/oxCore/workspace/oxSaml/target/site/apidocs/deprecated-list.html...
Building index for all classes...
Generating /home/jenkins/.jenkins/jobs/oxCore/workspace/oxSaml/target/site/apidocs/allclasses.html...
Generating /home/jenkins/.jenkins/jobs/oxCore/workspace/oxSaml/target/site/apidocs/allclasses.html...
Generating /home/jenkins/.jenkins/jobs/oxCore/workspace/oxSaml/target/site/apidocs/index.html...
Generating /home/jenkins/.jenkins/jobs/oxCore/workspace/oxSaml/target/site/apidocs/overview-summary.html...
Generating /home/jenkins/.jenkins/jobs/oxCore/workspace/oxSaml/target/site/apidocs/help-doc.html...
1 error
17 warnings
[ERROR] Error while creating javadoc report: 
Exit code: 1 - javadoc: error - The code being documented uses modules but the packages defined in https://docs.oracle.com/javase/8/docs/api/ are in the unnamed module.
/home/jenkins/.jenkins/jobs/oxCore/workspace/oxSaml/src/main/java/org/gluu/saml/AuthRequest.java:244: warning: no description for @param
     * @param samlRequest
       ^
/home/jenkins/.jenkins/jobs/oxCore/workspace/oxSaml/src/main/java/org/gluu/saml/AuthRequest.java:247: warning: no description for @return
     * @return
       ^
/home/jenkins/.jenkins/jobs/oxCore/workspace/oxSaml/src/main/java/org/gluu/saml/AuthRequest.java:248: warning: no description for @throws
     * @throws Exception
       ^
/home/jenkins/.jenkins/jobs/oxCore/workspace/oxSaml/src/main/java/org/gluu/saml/AuthRequest.java:274: warning: no description for @param
     * @param assertionConsumerServiceUrl
       ^
/home/jenkins/.jenkins/jobs/oxCore/workspace/oxSaml/src/main/java/org/gluu/saml/AuthRequest.java:277: warning: no description for @return
     * @return
       ^
/home/jenkins/.jenkins/jobs/oxCore/workspace/oxSaml/src/main/java/org/gluu/saml/AuthRequest.java:278: warning: no description for @throws
     * @throws Exception
       ^
/home/jenkins/.jenkins/jobs/oxCore/workspace/oxSaml/src/main/java/org/gluu/saml/AuthRequest.java:303: warning: no description for @param
     * @param assertionConsumerServiceUrl
       ^
/home/jenkins/.jenkins/jobs/oxCore/workspace/oxSaml/src/main/java/org/gluu/saml/AuthRequest.java:306: warning: no description for @return
     * @return
       ^
/home/jenkins/.jenkins/jobs/oxCore/workspace/oxSaml/src/main/java/org/gluu/saml/AuthRequest.java:307: warning: no description for @throws
     * @throws WSSecurityException
       ^
/home/jenkins/.jenkins/jobs/oxCore/workspace/oxSaml/src/main/java/org/gluu/saml/AuthRequest.java:308: warning: no description for @throws
     * @throws SecurityException
       ^
/home/jenkins/.jenkins/jobs/oxCore/workspace/oxSaml/src/main/java/org/gluu/saml/AuthRequest.java:309: warning: no description for @throws
     * @throws MarshallingException
       ^
/home/jenkins/.jenkins/jobs/oxCore/workspace/oxSaml/src/main/java/org/gluu/saml/AuthRequest.java:310: warning: no description for @throws
     * @throws org.opensaml.xml.signature.SignatureException
       ^
/home/jenkins/.jenkins/jobs/oxCore/workspace/oxSaml/src/main/java/org/gluu/saml/AuthRequest.java:311: warning: no description for @throws
     * @throws IOException
       ^
/home/jenkins/.jenkins/jobs/oxCore/workspace/oxSaml/src/main/java/org/gluu/saml/AuthRequest.java:312: warning: no description for @throws
     * @throws TransformerException
       ^
/home/jenkins/.jenkins/jobs/oxCore/workspace/oxSaml/src/main/java/org/gluu/saml/AuthRequest.java:313: warning: no description for @throws
     * @throws XMLStreamException
       ^
/home/jenkins/.jenkins/jobs/oxCore/workspace/oxSaml/src/main/java/org/gluu/saml/AuthRequest.java:314: warning: no description for @throws
     * @throws ParserConfigurationException
       ^
/home/jenkins/.jenkins/jobs/oxCore/workspace/oxSaml/src/main/java/org/gluu/saml/SamlConfiguration.java:136: warning: no description for @throws
     * @throws Exception
       ^

Command line was: /opt/java/amazon-corretto-11.0.7.10.1-linux-x64/bin/javadoc @options @packages

Refer to the generated Javadoc files in '/home/jenkins/.jenkins/jobs/oxCore/workspace/oxSaml/target/site/apidocs' dir.

org.apache.maven.reporting.MavenReportException: 
Exit code: 1 - javadoc: error - The code being documented uses modules but the packages defined in https://docs.oracle.com/javase/8/docs/api/ are in the unnamed module.
/home/jenkins/.jenkins/jobs/oxCore/workspace/oxSaml/src/main/java/org/gluu/saml/AuthRequest.java:244: warning: no description for @param
     * @param samlRequest
       ^
/home/jenkins/.jenkins/jobs/oxCore/workspace/oxSaml/src/main/java/org/gluu/saml/AuthRequest.java:247: warning: no description for @return
     * @return
       ^
/home/jenkins/.jenkins/jobs/oxCore/workspace/oxSaml/src/main/java/org/gluu/saml/AuthRequest.java:248: warning: no description for @throws
     * @throws Exception
       ^
/home/jenkins/.jenkins/jobs/oxCore/workspace/oxSaml/src/main/java/org/gluu/saml/AuthRequest.java:274: warning: no description for @param
     * @param assertionConsumerServiceUrl
       ^
/home/jenkins/.jenkins/jobs/oxCore/workspace/oxSaml/src/main/java/org/gluu/saml/AuthRequest.java:277: warning: no description for @return
     * @return
       ^
/home/jenkins/.jenkins/jobs/oxCore/workspace/oxSaml/src/main/java/org/gluu/saml/AuthRequest.java:278: warning: no description for @throws
     * @throws Exception
       ^
/home/jenkins/.jenkins/jobs/oxCore/workspace/oxSaml/src/main/java/org/gluu/saml/AuthRequest.java:303: warning: no description for @param
     * @param assertionConsumerServiceUrl
       ^
/home/jenkins/.jenkins/jobs/oxCore/workspace/oxSaml/src/main/java/org/gluu/saml/AuthRequest.java:306: warning: no description for @return
     * @return
       ^
/home/jenkins/.jenkins/jobs/oxCore/workspace/oxSaml/src/main/java/org/gluu/saml/AuthRequest.java:307: warning: no description for @throws
     * @throws WSSecurityException
       ^
/home/jenkins/.jenkins/jobs/oxCore/workspace/oxSaml/src/main/java/org/gluu/saml/AuthRequest.java:308: warning: no description for @throws
     * @throws SecurityException
       ^
/home/jenkins/.jenkins/jobs/oxCore/workspace/oxSaml/src/main/java/org/gluu/saml/AuthRequest.java:309: warning: no description for @throws
     * @throws MarshallingException
       ^
/home/jenkins/.jenkins/jobs/oxCore/workspace/oxSaml/src/main/java/org/gluu/saml/AuthRequest.java:310: warning: no description for @throws
     * @throws org.opensaml.xml.signature.SignatureException
       ^
/home/jenkins/.jenkins/jobs/oxCore/workspace/oxSaml/src/main/java/org/gluu/saml/AuthRequest.java:311: warning: no description for @throws
     * @throws IOException
       ^
/home/jenkins/.jenkins/jobs/oxCore/workspace/oxSaml/src/main/java/org/gluu/saml/AuthRequest.java:312: warning: no description for @throws
     * @throws TransformerException
       ^
/home/jenkins/.jenkins/jobs/oxCore/workspace/oxSaml/src/main/java/org/gluu/saml/AuthRequest.java:313: warning: no description for @throws
     * @throws XMLStreamException
       ^
/home/jenkins/.jenkins/jobs/oxCore/workspace/oxSaml/src/main/java/org/gluu/saml/AuthRequest.java:314: warning: no description for @throws
     * @throws ParserConfigurationException
       ^
/home/jenkins/.jenkins/jobs/oxCore/workspace/oxSaml/src/main/java/org/gluu/saml/SamlConfiguration.java:136: warning: no description for @throws
     * @throws Exception
       ^

Command line was: /opt/java/amazon-corretto-11.0.7.10.1-linux-x64/bin/javadoc @options @packages

Refer to the generated Javadoc files in '/home/jenkins/.jenkins/jobs/oxCore/workspace/oxSaml/target/site/apidocs' dir.

	at org.apache.maven.plugins.javadoc.AbstractJavadocMojo.executeJavadocCommandLine(AbstractJavadocMojo.java:5298)
	at org.apache.maven.plugins.javadoc.AbstractJavadocMojo.executeReport(AbstractJavadocMojo.java:2134)
	at org.apache.maven.plugins.javadoc.JavadocReport.generate(JavadocReport.java:134)
	at org.apache.maven.plugins.javadoc.JavadocReport.doExecute(JavadocReport.java:329)
	at org.apache.maven.plugins.javadoc.AbstractJavadocMojo.execute(AbstractJavadocMojo.java:1912)
	at org.apache.maven.plugin.DefaultBuildPluginManager.executeMojo(DefaultBuildPluginManager.java:134)
	at org.apache.maven.lifecycle.internal.MojoExecutor.execute(MojoExecutor.java:207)
	at org.apache.maven.lifecycle.internal.MojoExecutor.execute(MojoExecutor.java:153)
	at org.apache.maven.lifecycle.internal.MojoExecutor.execute(MojoExecutor.java:145)
	at org.apache.maven.lifecycle.internal.LifecycleModuleBuilder.buildProject(LifecycleModuleBuilder.java:116)
	at org.apache.maven.lifecycle.internal.LifecycleModuleBuilder.buildProject(LifecycleModuleBuilder.java:80)
	at org.apache.maven.lifecycle.internal.builder.singlethreaded.SingleThreadedBuilder.build(SingleThreadedBuilder.java:51)
	at org.apache.maven.lifecycle.internal.LifecycleStarter.execute(LifecycleStarter.java:128)
	at org.apache.maven.DefaultMaven.doExecute(DefaultMaven.java:307)
	at org.apache.maven.DefaultMaven.doExecute(DefaultMaven.java:193)
	at org.apache.maven.DefaultMaven.execute(DefaultMaven.java:106)
	at org.apache.maven.cli.MavenCli.execute(MavenCli.java:863)
	at org.apache.maven.cli.MavenCli.doMain(MavenCli.java:288)
	at org.apache.maven.cli.MavenCli.main(MavenCli.java:199)
	at java.base/jdk.internal.reflect.NativeMethodAccessorImpl.invoke0(Native Method)
	at java.base/jdk.internal.reflect.NativeMethodAccessorImpl.invoke(NativeMethodAccessorImpl.java:62)
	at java.base/jdk.internal.reflect.DelegatingMethodAccessorImpl.invoke(DelegatingMethodAccessorImpl.java:43)
	at java.base/java.lang.reflect.Method.invoke(Method.java:566)
	at org.codehaus.plexus.classworlds.launcher.Launcher.launchEnhanced(Launcher.java:289)
	at org.codehaus.plexus.classworlds.launcher.Launcher.launch(Launcher.java:229)
	at org.codehaus.plexus.classworlds.launcher.Launcher.mainWithExitCode(Launcher.java:415)
	at org.codehaus.plexus.classworlds.launcher.Launcher.main(Launcher.java:356)
[INFO] 
[INFO] --- maven-site-plugin:2.1.1:site (default-site) @ oxcore-saml ---
[INFO]                                                                         
[INFO] ------------------------------------------------------------------------
[INFO] Building Reusable CDI classes which not depend on specific framework 4.3.0-SNAPSHOT
[INFO] ------------------------------------------------------------------------
[INFO] 
[INFO] --- maven-clean-plugin:2.4.1:clean (default-clean) @ oxcore-cdi ---
[INFO] Deleting /home/jenkins/.jenkins/jobs/oxCore/workspace/core-cdi/target
[INFO] 
[INFO] --- maven-resources-plugin:2.4:resources (default-resources) @ oxcore-cdi ---
[INFO] Using 'UTF-8' encoding to copy filtered resources.
[INFO] Copying 1 resource
[INFO] 
[INFO] --- maven-compiler-plugin:2.3.2:compile (default-compile) @ oxcore-cdi ---
[INFO] Compiling 5 source files to /home/jenkins/.jenkins/jobs/oxCore/workspace/core-cdi/target/classes
[INFO] 
[INFO] --- maven-resources-plugin:2.4:resources (default-resources) @ oxcore-cdi ---
[INFO] Using 'UTF-8' encoding to copy filtered resources.
[INFO] Copying 1 resource
[INFO] 
[INFO] --- maven-compiler-plugin:2.3.2:compile (default-compile) @ oxcore-cdi ---
[INFO] Nothing to compile - all classes are up to date
[INFO] 
[INFO] --- maven-resources-plugin:2.4:testResources (default-testResources) @ oxcore-cdi ---
[INFO] Using 'UTF-8' encoding to copy filtered resources.
[INFO] skip non existing resourceDirectory /home/jenkins/.jenkins/jobs/oxCore/workspace/core-cdi/src/test/resources
[INFO] 
[INFO] --- maven-compiler-plugin:2.3.2:testCompile (default-testCompile) @ oxcore-cdi ---
[INFO] No sources to compile
[INFO] 
[INFO] --- maven-surefire-plugin:2.7.2:test (default-test) @ oxcore-cdi ---
[INFO] No tests to run.
[INFO] Surefire report directory: /home/jenkins/.jenkins/jobs/oxCore/workspace/core-cdi/target/surefire-reports

-------------------------------------------------------
 T E S T S
-------------------------------------------------------
There are no tests to run.

Results :

Tests run: 0, Failures: 0, Errors: 0, Skipped: 0

[INFO] 
[INFO] --- maven-jar-plugin:2.4:jar (default-jar) @ oxcore-cdi ---
[INFO] Building jar: /home/jenkins/.jenkins/jobs/oxCore/workspace/core-cdi/target/oxcore-cdi-4.3.0-SNAPSHOT.jar
[INFO] 
[INFO] --- maven-install-plugin:2.3.1:install (default-install) @ oxcore-cdi ---
[INFO] Installing /home/jenkins/.jenkins/jobs/oxCore/workspace/core-cdi/target/oxcore-cdi-4.3.0-SNAPSHOT.jar to /var/www/html/maven/org/gluu/oxcore-cdi/4.3.0-SNAPSHOT/oxcore-cdi-4.3.0-SNAPSHOT.jar
[INFO] Installing /home/jenkins/.jenkins/jobs/oxCore/workspace/core-cdi/pom.xml to /var/www/html/maven/org/gluu/oxcore-cdi/4.3.0-SNAPSHOT/oxcore-cdi-4.3.0-SNAPSHOT.pom
[INFO] 
[INFO] >>> maven-javadoc-plugin:3.0.1:javadoc (default-cli) > generate-sources @ oxcore-cdi >>>
[INFO] 
[INFO] <<< maven-javadoc-plugin:3.0.1:javadoc (default-cli) < generate-sources @ oxcore-cdi <<<
[INFO] 
[INFO] --- maven-javadoc-plugin:3.0.1:javadoc (default-cli) @ oxcore-cdi ---
[INFO] 
Loading source files for package org.gluu.service.cdi.async...
Loading source files for package org.gluu.service.cdi.event...
Loading source files for package org.gluu.service.timer.event...
Loading source files for package org.gluu.service.timer.schedule...
Constructing Javadoc information...
Standard Doclet version 11.0.7
Building tree for all the packages and classes...
Generating /home/jenkins/.jenkins/jobs/oxCore/workspace/core-cdi/target/site/apidocs/org/gluu/service/cdi/async/Asynchronous.html...
Generating /home/jenkins/.jenkins/jobs/oxCore/workspace/core-cdi/target/site/apidocs/org/gluu/service/cdi/event/Scheduled.html...
Generating /home/jenkins/.jenkins/jobs/oxCore/workspace/core-cdi/target/site/apidocs/org/gluu/service/cdi/event/Scheduled.Literal.html...
Generating /home/jenkins/.jenkins/jobs/oxCore/workspace/core-cdi/target/site/apidocs/org/gluu/service/timer/event/TimerEvent.html...
Generating /home/jenkins/.jenkins/jobs/oxCore/workspace/core-cdi/target/site/apidocs/org/gluu/service/timer/schedule/JobShedule.html...
Generating /home/jenkins/.jenkins/jobs/oxCore/workspace/core-cdi/target/site/apidocs/org/gluu/service/timer/schedule/TimerSchedule.html...
Generating /home/jenkins/.jenkins/jobs/oxCore/workspace/core-cdi/target/site/apidocs/org/gluu/service/cdi/async/package-summary.html...
Generating /home/jenkins/.jenkins/jobs/oxCore/workspace/core-cdi/target/site/apidocs/org/gluu/service/cdi/async/package-tree.html...
Generating /home/jenkins/.jenkins/jobs/oxCore/workspace/core-cdi/target/site/apidocs/org/gluu/service/cdi/event/package-summary.html...
Generating /home/jenkins/.jenkins/jobs/oxCore/workspace/core-cdi/target/site/apidocs/org/gluu/service/cdi/event/package-tree.html...
Generating /home/jenkins/.jenkins/jobs/oxCore/workspace/core-cdi/target/site/apidocs/org/gluu/service/timer/event/package-summary.html...
Generating /home/jenkins/.jenkins/jobs/oxCore/workspace/core-cdi/target/site/apidocs/org/gluu/service/timer/event/package-tree.html...
Generating /home/jenkins/.jenkins/jobs/oxCore/workspace/core-cdi/target/site/apidocs/org/gluu/service/timer/schedule/package-summary.html...
Generating /home/jenkins/.jenkins/jobs/oxCore/workspace/core-cdi/target/site/apidocs/org/gluu/service/timer/schedule/package-tree.html...
Generating /home/jenkins/.jenkins/jobs/oxCore/workspace/core-cdi/target/site/apidocs/constant-values.html...
Generating /home/jenkins/.jenkins/jobs/oxCore/workspace/core-cdi/target/site/apidocs/serialized-form.html...
Generating /home/jenkins/.jenkins/jobs/oxCore/workspace/core-cdi/target/site/apidocs/org/gluu/service/cdi/async/class-use/Asynchronous.html...
Generating /home/jenkins/.jenkins/jobs/oxCore/workspace/core-cdi/target/site/apidocs/org/gluu/service/cdi/event/class-use/Scheduled.html...
Generating /home/jenkins/.jenkins/jobs/oxCore/workspace/core-cdi/target/site/apidocs/org/gluu/service/cdi/event/class-use/Scheduled.Literal.html...
Generating /home/jenkins/.jenkins/jobs/oxCore/workspace/core-cdi/target/site/apidocs/org/gluu/service/timer/event/class-use/TimerEvent.html...
Generating /home/jenkins/.jenkins/jobs/oxCore/workspace/core-cdi/target/site/apidocs/org/gluu/service/timer/schedule/class-use/JobShedule.html...
Generating /home/jenkins/.jenkins/jobs/oxCore/workspace/core-cdi/target/site/apidocs/org/gluu/service/timer/schedule/class-use/TimerSchedule.html...
Generating /home/jenkins/.jenkins/jobs/oxCore/workspace/core-cdi/target/site/apidocs/org/gluu/service/cdi/async/package-use.html...
Generating /home/jenkins/.jenkins/jobs/oxCore/workspace/core-cdi/target/site/apidocs/org/gluu/service/cdi/event/package-use.html...
Generating /home/jenkins/.jenkins/jobs/oxCore/workspace/core-cdi/target/site/apidocs/org/gluu/service/timer/event/package-use.html...
Generating /home/jenkins/.jenkins/jobs/oxCore/workspace/core-cdi/target/site/apidocs/org/gluu/service/timer/schedule/package-use.html...
Building index for all the packages and classes...
Generating /home/jenkins/.jenkins/jobs/oxCore/workspace/core-cdi/target/site/apidocs/overview-tree.html...
Generating /home/jenkins/.jenkins/jobs/oxCore/workspace/core-cdi/target/site/apidocs/index-all.html...
Building index for all classes...
Generating /home/jenkins/.jenkins/jobs/oxCore/workspace/core-cdi/target/site/apidocs/allclasses-index.html...
Generating /home/jenkins/.jenkins/jobs/oxCore/workspace/core-cdi/target/site/apidocs/allpackages-index.html...
Generating /home/jenkins/.jenkins/jobs/oxCore/workspace/core-cdi/target/site/apidocs/deprecated-list.html...
Building index for all classes...
Generating /home/jenkins/.jenkins/jobs/oxCore/workspace/core-cdi/target/site/apidocs/allclasses.html...
Generating /home/jenkins/.jenkins/jobs/oxCore/workspace/core-cdi/target/site/apidocs/allclasses.html...
Generating /home/jenkins/.jenkins/jobs/oxCore/workspace/core-cdi/target/site/apidocs/index.html...
Generating /home/jenkins/.jenkins/jobs/oxCore/workspace/core-cdi/target/site/apidocs/overview-summary.html...
Generating /home/jenkins/.jenkins/jobs/oxCore/workspace/core-cdi/target/site/apidocs/help-doc.html...
1 error
[ERROR] Error while creating javadoc report: 
Exit code: 1 - javadoc: error - The code being documented uses modules but the packages defined in https://docs.oracle.com/javase/8/docs/api/ are in the unnamed module.

Command line was: /opt/java/amazon-corretto-11.0.7.10.1-linux-x64/bin/javadoc @options @packages

Refer to the generated Javadoc files in '/home/jenkins/.jenkins/jobs/oxCore/workspace/core-cdi/target/site/apidocs' dir.

org.apache.maven.reporting.MavenReportException: 
Exit code: 1 - javadoc: error - The code being documented uses modules but the packages defined in https://docs.oracle.com/javase/8/docs/api/ are in the unnamed module.

Command line was: /opt/java/amazon-corretto-11.0.7.10.1-linux-x64/bin/javadoc @options @packages

Refer to the generated Javadoc files in '/home/jenkins/.jenkins/jobs/oxCore/workspace/core-cdi/target/site/apidocs' dir.

	at org.apache.maven.plugins.javadoc.AbstractJavadocMojo.executeJavadocCommandLine(AbstractJavadocMojo.java:5298)
	at org.apache.maven.plugins.javadoc.AbstractJavadocMojo.executeReport(AbstractJavadocMojo.java:2134)
	at org.apache.maven.plugins.javadoc.JavadocReport.generate(JavadocReport.java:134)
	at org.apache.maven.plugins.javadoc.JavadocReport.doExecute(JavadocReport.java:329)
	at org.apache.maven.plugins.javadoc.AbstractJavadocMojo.execute(AbstractJavadocMojo.java:1912)
	at org.apache.maven.plugin.DefaultBuildPluginManager.executeMojo(DefaultBuildPluginManager.java:134)
	at org.apache.maven.lifecycle.internal.MojoExecutor.execute(MojoExecutor.java:207)
	at org.apache.maven.lifecycle.internal.MojoExecutor.execute(MojoExecutor.java:153)
	at org.apache.maven.lifecycle.internal.MojoExecutor.execute(MojoExecutor.java:145)
	at org.apache.maven.lifecycle.internal.LifecycleModuleBuilder.buildProject(LifecycleModuleBuilder.java:116)
	at org.apache.maven.lifecycle.internal.LifecycleModuleBuilder.buildProject(LifecycleModuleBuilder.java:80)
	at org.apache.maven.lifecycle.internal.builder.singlethreaded.SingleThreadedBuilder.build(SingleThreadedBuilder.java:51)
	at org.apache.maven.lifecycle.internal.LifecycleStarter.execute(LifecycleStarter.java:128)
	at org.apache.maven.DefaultMaven.doExecute(DefaultMaven.java:307)
	at org.apache.maven.DefaultMaven.doExecute(DefaultMaven.java:193)
	at org.apache.maven.DefaultMaven.execute(DefaultMaven.java:106)
	at org.apache.maven.cli.MavenCli.execute(MavenCli.java:863)
	at org.apache.maven.cli.MavenCli.doMain(MavenCli.java:288)
	at org.apache.maven.cli.MavenCli.main(MavenCli.java:199)
	at java.base/jdk.internal.reflect.NativeMethodAccessorImpl.invoke0(Native Method)
	at java.base/jdk.internal.reflect.NativeMethodAccessorImpl.invoke(NativeMethodAccessorImpl.java:62)
	at java.base/jdk.internal.reflect.DelegatingMethodAccessorImpl.invoke(DelegatingMethodAccessorImpl.java:43)
	at java.base/java.lang.reflect.Method.invoke(Method.java:566)
	at org.codehaus.plexus.classworlds.launcher.Launcher.launchEnhanced(Launcher.java:289)
	at org.codehaus.plexus.classworlds.launcher.Launcher.launch(Launcher.java:229)
	at org.codehaus.plexus.classworlds.launcher.Launcher.mainWithExitCode(Launcher.java:415)
	at org.codehaus.plexus.classworlds.launcher.Launcher.main(Launcher.java:356)
[INFO] 
[INFO] --- maven-site-plugin:2.1.1:site (default-site) @ oxcore-cdi ---
[INFO]                                                                         
[INFO] ------------------------------------------------------------------------
[INFO] Building Reusable CDI Script implementation 4.3.0-SNAPSHOT
[INFO] ------------------------------------------------------------------------
[INFO] 
[INFO] --- maven-clean-plugin:2.4.1:clean (default-clean) @ oxcore-script ---
[INFO] Deleting /home/jenkins/.jenkins/jobs/oxCore/workspace/core-script/target
[INFO] 
[INFO] --- maven-resources-plugin:2.4:resources (default-resources) @ oxcore-script ---
[INFO] Using 'UTF-8' encoding to copy filtered resources.
[INFO] Copying 1 resource
[INFO] 
[INFO] --- maven-compiler-plugin:2.3.2:compile (default-compile) @ oxcore-script ---
[INFO] Compiling 63 source files to /home/jenkins/.jenkins/jobs/oxCore/workspace/core-script/target/classes
[INFO] 
[INFO] --- maven-resources-plugin:2.4:resources (default-resources) @ oxcore-script ---
[INFO] Using 'UTF-8' encoding to copy filtered resources.
[INFO] Copying 1 resource
[INFO] 
[INFO] --- maven-compiler-plugin:2.3.2:compile (default-compile) @ oxcore-script ---
[INFO] Nothing to compile - all classes are up to date
[INFO] 
[INFO] --- maven-resources-plugin:2.4:testResources (default-testResources) @ oxcore-script ---
[INFO] Using 'UTF-8' encoding to copy filtered resources.
[INFO] skip non existing resourceDirectory /home/jenkins/.jenkins/jobs/oxCore/workspace/core-script/src/test/resources
[INFO] 
[INFO] --- maven-compiler-plugin:2.3.2:testCompile (default-testCompile) @ oxcore-script ---
[INFO] Compiling 2 source files to /home/jenkins/.jenkins/jobs/oxCore/workspace/core-script/target/test-classes
[INFO] 
[INFO] --- maven-surefire-plugin:2.7.2:test (default-test) @ oxcore-script ---
[INFO] Surefire report directory: /home/jenkins/.jenkins/jobs/oxCore/workspace/core-script/target/surefire-reports

-------------------------------------------------------
 T E S T S
-------------------------------------------------------
Running org.gluu.service.custom.script.test.StandaloneCustomScriptManagerTest
Tests run: 0, Failures: 0, Errors: 0, Skipped: 0, Time elapsed: 0.006 sec
There are no tests to run.

Results :

Tests run: 0, Failures: 0, Errors: 0, Skipped: 0

[INFO] 
[INFO] --- maven-jar-plugin:2.4:jar (default-jar) @ oxcore-script ---
[INFO] Building jar: /home/jenkins/.jenkins/jobs/oxCore/workspace/core-script/target/oxcore-script-4.3.0-SNAPSHOT.jar
[INFO] 
[INFO] --- maven-install-plugin:2.3.1:install (default-install) @ oxcore-script ---
[INFO] Installing /home/jenkins/.jenkins/jobs/oxCore/workspace/core-script/target/oxcore-script-4.3.0-SNAPSHOT.jar to /var/www/html/maven/org/gluu/oxcore-script/4.3.0-SNAPSHOT/oxcore-script-4.3.0-SNAPSHOT.jar
[INFO] Installing /home/jenkins/.jenkins/jobs/oxCore/workspace/core-script/pom.xml to /var/www/html/maven/org/gluu/oxcore-script/4.3.0-SNAPSHOT/oxcore-script-4.3.0-SNAPSHOT.pom
[INFO] 
[INFO] >>> maven-javadoc-plugin:3.0.1:javadoc (default-cli) > generate-sources @ oxcore-script >>>
[INFO] 
[INFO] <<< maven-javadoc-plugin:3.0.1:javadoc (default-cli) < generate-sources @ oxcore-script <<<
[INFO] 
[INFO] --- maven-javadoc-plugin:3.0.1:javadoc (default-cli) @ oxcore-script ---
[ERROR] Error fetching link: /home/jenkins/.jenkins/jobs/oxCore/workspace/oxUtil/target/site/apidocs/package-list. Ignored it.
[ERROR] Error fetching link: /home/jenkins/.jenkins/jobs/oxCore/workspace/oxModel/target/site/apidocs/package-list. Ignored it.
[ERROR] Error fetching link: /home/jenkins/.jenkins/jobs/oxCore/workspace/core-cdi/target/site/apidocs/package-list. Ignored it.
[INFO] 
Loading source files for package org.gluu.exception...
Loading source files for package org.gluu.model.custom.script.conf...
Loading source files for package org.gluu.model.custom.script.model...
Loading source files for package org.gluu.model.custom.script.model.auth...
Loading source files for package org.gluu.model.custom.script.model.bind...
Loading source files for package org.gluu.model.custom.script.type...
Loading source files for package org.gluu.model.custom.script.type.auth...
Loading source files for package org.gluu.model.custom.script.type.authz...
Loading source files for package org.gluu.model.custom.script.type.ciba...
Loading source files for package org.gluu.model.custom.script.type.client...
Loading source files for package org.gluu.model.custom.script.type.id...
Loading source files for package org.gluu.model.custom.script.type.idp...
Loading source files for package org.gluu.model.custom.script.type.introspection...
Loading source files for package org.gluu.model.custom.script.type.logout...
Loading source files for package org.gluu.model.custom.script.type.owner...
Loading source files for package org.gluu.model.custom.script.type.persistence...
Loading source files for package org.gluu.model.custom.script.type.postauthn...
Loading source files for package org.gluu.model.custom.script.type.scim...
Loading source files for package org.gluu.model.custom.script.type.scope...
Loading source files for package org.gluu.model.custom.script.type.session...
Loading source files for package org.gluu.model.custom.script.type.spontaneous...
Loading source files for package org.gluu.model.custom.script.type.uma...
Loading source files for package org.gluu.model.custom.script.type.user...
Loading source files for package org.gluu.model.custom.script.type.revoke...
Loading source files for package org.gluu.model.custom.script.type.token...
Loading source files for package org.gluu.model.custom.script...
Loading source files for package org.gluu.service...
Loading source files for package org.gluu.service.cdi.event...
Loading source files for package org.gluu.service.custom.inject...
Loading source files for package org.gluu.service.custom.script...
Constructing Javadoc information...
Standard Doclet version 11.0.7
Building tree for all the packages and classes...
Generating /home/jenkins/.jenkins/jobs/oxCore/workspace/core-script/target/site/apidocs/org/gluu/exception/PythonException.html...
Generating /home/jenkins/.jenkins/jobs/oxCore/workspace/core-script/target/site/apidocs/org/gluu/model/custom/script/CustomScriptType.html...
Generating /home/jenkins/.jenkins/jobs/oxCore/workspace/core-script/target/site/apidocs/org/gluu/model/custom/script/conf/CustomScriptConfiguration.html...
Generating /home/jenkins/.jenkins/jobs/oxCore/workspace/core-script/target/site/apidocs/org/gluu/model/custom/script/model/CustomScript.html...
Generating /home/jenkins/.jenkins/jobs/oxCore/workspace/core-script/target/site/apidocs/org/gluu/model/custom/script/model/ScriptError.html...
Generating /home/jenkins/.jenkins/jobs/oxCore/workspace/core-script/target/site/apidocs/org/gluu/model/custom/script/model/ScriptTemplate.html...
Generating /home/jenkins/.jenkins/jobs/oxCore/workspace/core-script/target/site/apidocs/org/gluu/model/custom/script/model/auth/AuthenticationCustomScript.html...
Generating /home/jenkins/.jenkins/jobs/oxCore/workspace/core-script/target/site/apidocs/org/gluu/model/custom/script/model/bind/BindCredentials.html...
Generating /home/jenkins/.jenkins/jobs/oxCore/workspace/core-script/target/site/apidocs/org/gluu/model/custom/script/type/BaseExternalType.html...
Generating /home/jenkins/.jenkins/jobs/oxCore/workspace/core-script/target/site/apidocs/org/gluu/model/custom/script/type/auth/DummyPersonAuthenticationType.html...
Generating /home/jenkins/.jenkins/jobs/oxCore/workspace/core-script/target/site/apidocs/org/gluu/model/custom/script/type/auth/PersonAuthenticationType.html...
Generating /home/jenkins/.jenkins/jobs/oxCore/workspace/core-script/target/site/apidocs/org/gluu/model/custom/script/type/authz/ConsentGatheringType.html...
Generating /home/jenkins/.jenkins/jobs/oxCore/workspace/core-script/target/site/apidocs/org/gluu/model/custom/script/type/authz/DummyConsentGatheringType.html...
Generating /home/jenkins/.jenkins/jobs/oxCore/workspace/core-script/target/site/apidocs/org/gluu/model/custom/script/type/ciba/DummyEndUserNotificationType.html...
Generating /home/jenkins/.jenkins/jobs/oxCore/workspace/core-script/target/site/apidocs/org/gluu/model/custom/script/type/ciba/EndUserNotificationType.html...
Generating /home/jenkins/.jenkins/jobs/oxCore/workspace/core-script/target/site/apidocs/org/gluu/model/custom/script/type/client/ClientRegistrationType.html...
Generating /home/jenkins/.jenkins/jobs/oxCore/workspace/core-script/target/site/apidocs/org/gluu/model/custom/script/type/client/DummyClientRegistrationType.html...
Generating /home/jenkins/.jenkins/jobs/oxCore/workspace/core-script/target/site/apidocs/org/gluu/model/custom/script/type/id/DummyIdGeneratorType.html...
Generating /home/jenkins/.jenkins/jobs/oxCore/workspace/core-script/target/site/apidocs/org/gluu/model/custom/script/type/id/IdGeneratorType.html...
Generating /home/jenkins/.jenkins/jobs/oxCore/workspace/core-script/target/site/apidocs/org/gluu/model/custom/script/type/idp/DummyIdpType.html...
Generating /home/jenkins/.jenkins/jobs/oxCore/workspace/core-script/target/site/apidocs/org/gluu/model/custom/script/type/idp/IdpType.html...
Generating /home/jenkins/.jenkins/jobs/oxCore/workspace/core-script/target/site/apidocs/org/gluu/model/custom/script/type/introspection/DummyIntrospectionType.html...
Generating /home/jenkins/.jenkins/jobs/oxCore/workspace/core-script/target/site/apidocs/org/gluu/model/custom/script/type/introspection/IntrospectionType.html...
Generating /home/jenkins/.jenkins/jobs/oxCore/workspace/core-script/target/site/apidocs/org/gluu/model/custom/script/type/logout/DummyEndSessionType.html...
Generating /home/jenkins/.jenkins/jobs/oxCore/workspace/core-script/target/site/apidocs/org/gluu/model/custom/script/type/logout/EndSessionType.html...
Generating /home/jenkins/.jenkins/jobs/oxCore/workspace/core-script/target/site/apidocs/org/gluu/model/custom/script/type/owner/DummyResourceOwnerPasswordCredentialsType.html...
Generating /home/jenkins/.jenkins/jobs/oxCore/workspace/core-script/target/site/apidocs/org/gluu/model/custom/script/type/owner/ResourceOwnerPasswordCredentialsType.html...
Generating /home/jenkins/.jenkins/jobs/oxCore/workspace/core-script/target/site/apidocs/org/gluu/model/custom/script/type/persistence/DummyPeristenceType.html...
Generating /home/jenkins/.jenkins/jobs/oxCore/workspace/core-script/target/site/apidocs/org/gluu/model/custom/script/type/persistence/PersistenceType.html...
Generating /home/jenkins/.jenkins/jobs/oxCore/workspace/core-script/target/site/apidocs/org/gluu/model/custom/script/type/postauthn/DummyPostAuthnType.html...
Generating /home/jenkins/.jenkins/jobs/oxCore/workspace/core-script/target/site/apidocs/org/gluu/model/custom/script/type/postauthn/PostAuthnType.html...
Generating /home/jenkins/.jenkins/jobs/oxCore/workspace/core-script/target/site/apidocs/org/gluu/model/custom/script/type/revoke/DummyRevokeTokenType.html...
Generating /home/jenkins/.jenkins/jobs/oxCore/workspace/core-script/target/site/apidocs/org/gluu/model/custom/script/type/revoke/RevokeTokenType.html...
Generating /home/jenkins/.jenkins/jobs/oxCore/workspace/core-script/target/site/apidocs/org/gluu/model/custom/script/type/scim/DummyScimType.html...
Generating /home/jenkins/.jenkins/jobs/oxCore/workspace/core-script/target/site/apidocs/org/gluu/model/custom/script/type/scim/ScimType.html...
Generating /home/jenkins/.jenkins/jobs/oxCore/workspace/core-script/target/site/apidocs/org/gluu/model/custom/script/type/scope/DummyDynamicScopeType.html...
Generating /home/jenkins/.jenkins/jobs/oxCore/workspace/core-script/target/site/apidocs/org/gluu/model/custom/script/type/scope/DynamicScopeType.html...
Generating /home/jenkins/.jenkins/jobs/oxCore/workspace/core-script/target/site/apidocs/org/gluu/model/custom/script/type/session/ApplicationSessionType.html...
Generating /home/jenkins/.jenkins/jobs/oxCore/workspace/core-script/target/site/apidocs/org/gluu/model/custom/script/type/session/DummyApplicationSessionType.html...
Generating /home/jenkins/.jenkins/jobs/oxCore/workspace/core-script/target/site/apidocs/org/gluu/model/custom/script/type/spontaneous/DummySpontaneousScopeType.html...
Generating /home/jenkins/.jenkins/jobs/oxCore/workspace/core-script/target/site/apidocs/org/gluu/model/custom/script/type/spontaneous/SpontaneousScopeType.html...
Generating /home/jenkins/.jenkins/jobs/oxCore/workspace/core-script/target/site/apidocs/org/gluu/model/custom/script/type/token/DummyUpdateTokenType.html...
Generating /home/jenkins/.jenkins/jobs/oxCore/workspace/core-script/target/site/apidocs/org/gluu/model/custom/script/type/token/UpdateTokenType.html...
Generating /home/jenkins/.jenkins/jobs/oxCore/workspace/core-script/target/site/apidocs/org/gluu/model/custom/script/type/uma/UmaClaimsGatheringType.html...
Generating /home/jenkins/.jenkins/jobs/oxCore/workspace/core-script/target/site/apidocs/org/gluu/model/custom/script/type/uma/UmaDummyClaimsGatheringType.html...
Generating /home/jenkins/.jenkins/jobs/oxCore/workspace/core-script/target/site/apidocs/org/gluu/model/custom/script/type/uma/UmaDummyRptClaimsType.html...
Generating /home/jenkins/.jenkins/jobs/oxCore/workspace/core-script/target/site/apidocs/org/gluu/model/custom/script/type/uma/UmaDummyRptPolicyType.html...
Generating /home/jenkins/.jenkins/jobs/oxCore/workspace/core-script/target/site/apidocs/org/gluu/model/custom/script/type/uma/UmaRptClaimsType.html...
Generating /home/jenkins/.jenkins/jobs/oxCore/workspace/core-script/target/site/apidocs/org/gluu/model/custom/script/type/uma/UmaRptPolicyType.html...
Generating /home/jenkins/.jenkins/jobs/oxCore/workspace/core-script/target/site/apidocs/org/gluu/model/custom/script/type/user/CacheRefreshType.html...
Generating /home/jenkins/.jenkins/jobs/oxCore/workspace/core-script/target/site/apidocs/org/gluu/model/custom/script/type/user/DummyCacheRefreshType.html...
Generating /home/jenkins/.jenkins/jobs/oxCore/workspace/core-script/target/site/apidocs/org/gluu/model/custom/script/type/user/DummyUpdateUserType.html...
Generating /home/jenkins/.jenkins/jobs/oxCore/workspace/core-script/target/site/apidocs/org/gluu/model/custom/script/type/user/DummyUserRegistrationType.html...
Generating /home/jenkins/.jenkins/jobs/oxCore/workspace/core-script/target/site/apidocs/org/gluu/model/custom/script/type/user/UpdateUserType.html...
Generating /home/jenkins/.jenkins/jobs/oxCore/workspace/core-script/target/site/apidocs/org/gluu/model/custom/script/type/user/UserRegistrationType.html...
Generating /home/jenkins/.jenkins/jobs/oxCore/workspace/core-script/target/site/apidocs/org/gluu/service/PythonService.html...
Generating /home/jenkins/.jenkins/jobs/oxCore/workspace/core-script/target/site/apidocs/org/gluu/service/cdi/event/UpdateScriptEvent.html...
Generating /home/jenkins/.jenkins/jobs/oxCore/workspace/core-script/target/site/apidocs/org/gluu/service/custom/inject/ReloadScript.html...
Generating /home/jenkins/.jenkins/jobs/oxCore/workspace/core-script/target/site/apidocs/org/gluu/service/custom/inject/ReloadScript.Literal.html...
Generating /home/jenkins/.jenkins/jobs/oxCore/workspace/core-script/target/site/apidocs/org/gluu/service/custom/script/AbstractCustomScriptService.html...
Generating /home/jenkins/.jenkins/jobs/oxCore/workspace/core-script/target/site/apidocs/org/gluu/service/custom/script/CustomScriptManager.html...
Generating /home/jenkins/.jenkins/jobs/oxCore/workspace/core-script/target/site/apidocs/org/gluu/service/custom/script/ExternalScriptService.html...
Generating /home/jenkins/.jenkins/jobs/oxCore/workspace/core-script/target/site/apidocs/org/gluu/service/custom/script/StandaloneCustomScriptManager.html...
Generating /home/jenkins/.jenkins/jobs/oxCore/workspace/core-script/target/site/apidocs/org/gluu/service/custom/script/StandaloneCustomScriptService.html...
Generating /home/jenkins/.jenkins/jobs/oxCore/workspace/core-script/target/site/apidocs/org/gluu/exception/package-summary.html...
Generating /home/jenkins/.jenkins/jobs/oxCore/workspace/core-script/target/site/apidocs/org/gluu/exception/package-tree.html...
Generating /home/jenkins/.jenkins/jobs/oxCore/workspace/core-script/target/site/apidocs/org/gluu/model/custom/script/package-summary.html...
Generating /home/jenkins/.jenkins/jobs/oxCore/workspace/core-script/target/site/apidocs/org/gluu/model/custom/script/package-tree.html...
Generating /home/jenkins/.jenkins/jobs/oxCore/workspace/core-script/target/site/apidocs/org/gluu/model/custom/script/conf/package-summary.html...
Generating /home/jenkins/.jenkins/jobs/oxCore/workspace/core-script/target/site/apidocs/org/gluu/model/custom/script/conf/package-tree.html...
Generating /home/jenkins/.jenkins/jobs/oxCore/workspace/core-script/target/site/apidocs/org/gluu/model/custom/script/model/package-summary.html...
Generating /home/jenkins/.jenkins/jobs/oxCore/workspace/core-script/target/site/apidocs/org/gluu/model/custom/script/model/package-tree.html...
Generating /home/jenkins/.jenkins/jobs/oxCore/workspace/core-script/target/site/apidocs/org/gluu/model/custom/script/model/auth/package-summary.html...
Generating /home/jenkins/.jenkins/jobs/oxCore/workspace/core-script/target/site/apidocs/org/gluu/model/custom/script/model/auth/package-tree.html...
Generating /home/jenkins/.jenkins/jobs/oxCore/workspace/core-script/target/site/apidocs/org/gluu/model/custom/script/model/bind/package-summary.html...
Generating /home/jenkins/.jenkins/jobs/oxCore/workspace/core-script/target/site/apidocs/org/gluu/model/custom/script/model/bind/package-tree.html...
Generating /home/jenkins/.jenkins/jobs/oxCore/workspace/core-script/target/site/apidocs/org/gluu/model/custom/script/type/package-summary.html...
Generating /home/jenkins/.jenkins/jobs/oxCore/workspace/core-script/target/site/apidocs/org/gluu/model/custom/script/type/package-tree.html...
Generating /home/jenkins/.jenkins/jobs/oxCore/workspace/core-script/target/site/apidocs/org/gluu/model/custom/script/type/auth/package-summary.html...
Generating /home/jenkins/.jenkins/jobs/oxCore/workspace/core-script/target/site/apidocs/org/gluu/model/custom/script/type/auth/package-tree.html...
Generating /home/jenkins/.jenkins/jobs/oxCore/workspace/core-script/target/site/apidocs/org/gluu/model/custom/script/type/authz/package-summary.html...
Generating /home/jenkins/.jenkins/jobs/oxCore/workspace/core-script/target/site/apidocs/org/gluu/model/custom/script/type/authz/package-tree.html...
Generating /home/jenkins/.jenkins/jobs/oxCore/workspace/core-script/target/site/apidocs/org/gluu/model/custom/script/type/ciba/package-summary.html...
Generating /home/jenkins/.jenkins/jobs/oxCore/workspace/core-script/target/site/apidocs/org/gluu/model/custom/script/type/ciba/package-tree.html...
Generating /home/jenkins/.jenkins/jobs/oxCore/workspace/core-script/target/site/apidocs/org/gluu/model/custom/script/type/client/package-summary.html...
Generating /home/jenkins/.jenkins/jobs/oxCore/workspace/core-script/target/site/apidocs/org/gluu/model/custom/script/type/client/package-tree.html...
Generating /home/jenkins/.jenkins/jobs/oxCore/workspace/core-script/target/site/apidocs/org/gluu/model/custom/script/type/id/package-summary.html...
Generating /home/jenkins/.jenkins/jobs/oxCore/workspace/core-script/target/site/apidocs/org/gluu/model/custom/script/type/id/package-tree.html...
Generating /home/jenkins/.jenkins/jobs/oxCore/workspace/core-script/target/site/apidocs/org/gluu/model/custom/script/type/idp/package-summary.html...
Generating /home/jenkins/.jenkins/jobs/oxCore/workspace/core-script/target/site/apidocs/org/gluu/model/custom/script/type/idp/package-tree.html...
Generating /home/jenkins/.jenkins/jobs/oxCore/workspace/core-script/target/site/apidocs/org/gluu/model/custom/script/type/introspection/package-summary.html...
Generating /home/jenkins/.jenkins/jobs/oxCore/workspace/core-script/target/site/apidocs/org/gluu/model/custom/script/type/introspection/package-tree.html...
Generating /home/jenkins/.jenkins/jobs/oxCore/workspace/core-script/target/site/apidocs/org/gluu/model/custom/script/type/logout/package-summary.html...
Generating /home/jenkins/.jenkins/jobs/oxCore/workspace/core-script/target/site/apidocs/org/gluu/model/custom/script/type/logout/package-tree.html...
Generating /home/jenkins/.jenkins/jobs/oxCore/workspace/core-script/target/site/apidocs/org/gluu/model/custom/script/type/owner/package-summary.html...
Generating /home/jenkins/.jenkins/jobs/oxCore/workspace/core-script/target/site/apidocs/org/gluu/model/custom/script/type/owner/package-tree.html...
Generating /home/jenkins/.jenkins/jobs/oxCore/workspace/core-script/target/site/apidocs/org/gluu/model/custom/script/type/persistence/package-summary.html...
Generating /home/jenkins/.jenkins/jobs/oxCore/workspace/core-script/target/site/apidocs/org/gluu/model/custom/script/type/persistence/package-tree.html...
Generating /home/jenkins/.jenkins/jobs/oxCore/workspace/core-script/target/site/apidocs/org/gluu/model/custom/script/type/postauthn/package-summary.html...
Generating /home/jenkins/.jenkins/jobs/oxCore/workspace/core-script/target/site/apidocs/org/gluu/model/custom/script/type/postauthn/package-tree.html...
Generating /home/jenkins/.jenkins/jobs/oxCore/workspace/core-script/target/site/apidocs/org/gluu/model/custom/script/type/revoke/package-summary.html...
Generating /home/jenkins/.jenkins/jobs/oxCore/workspace/core-script/target/site/apidocs/org/gluu/model/custom/script/type/revoke/package-tree.html...
Generating /home/jenkins/.jenkins/jobs/oxCore/workspace/core-script/target/site/apidocs/org/gluu/model/custom/script/type/scim/package-summary.html...
Generating /home/jenkins/.jenkins/jobs/oxCore/workspace/core-script/target/site/apidocs/org/gluu/model/custom/script/type/scim/package-tree.html...
Generating /home/jenkins/.jenkins/jobs/oxCore/workspace/core-script/target/site/apidocs/org/gluu/model/custom/script/type/scope/package-summary.html...
Generating /home/jenkins/.jenkins/jobs/oxCore/workspace/core-script/target/site/apidocs/org/gluu/model/custom/script/type/scope/package-tree.html...
Generating /home/jenkins/.jenkins/jobs/oxCore/workspace/core-script/target/site/apidocs/org/gluu/model/custom/script/type/session/package-summary.html...
Generating /home/jenkins/.jenkins/jobs/oxCore/workspace/core-script/target/site/apidocs/org/gluu/model/custom/script/type/session/package-tree.html...
Generating /home/jenkins/.jenkins/jobs/oxCore/workspace/core-script/target/site/apidocs/org/gluu/model/custom/script/type/spontaneous/package-summary.html...
Generating /home/jenkins/.jenkins/jobs/oxCore/workspace/core-script/target/site/apidocs/org/gluu/model/custom/script/type/spontaneous/package-tree.html...
Generating /home/jenkins/.jenkins/jobs/oxCore/workspace/core-script/target/site/apidocs/org/gluu/model/custom/script/type/token/package-summary.html...
Generating /home/jenkins/.jenkins/jobs/oxCore/workspace/core-script/target/site/apidocs/org/gluu/model/custom/script/type/token/package-tree.html...
Generating /home/jenkins/.jenkins/jobs/oxCore/workspace/core-script/target/site/apidocs/org/gluu/model/custom/script/type/uma/package-summary.html...
Generating /home/jenkins/.jenkins/jobs/oxCore/workspace/core-script/target/site/apidocs/org/gluu/model/custom/script/type/uma/package-tree.html...
Generating /home/jenkins/.jenkins/jobs/oxCore/workspace/core-script/target/site/apidocs/org/gluu/model/custom/script/type/user/package-summary.html...
Generating /home/jenkins/.jenkins/jobs/oxCore/workspace/core-script/target/site/apidocs/org/gluu/model/custom/script/type/user/package-tree.html...
Generating /home/jenkins/.jenkins/jobs/oxCore/workspace/core-script/target/site/apidocs/org/gluu/service/package-summary.html...
Generating /home/jenkins/.jenkins/jobs/oxCore/workspace/core-script/target/site/apidocs/org/gluu/service/package-tree.html...
Generating /home/jenkins/.jenkins/jobs/oxCore/workspace/core-script/target/site/apidocs/org/gluu/service/cdi/event/package-summary.html...
Generating /home/jenkins/.jenkins/jobs/oxCore/workspace/core-script/target/site/apidocs/org/gluu/service/cdi/event/package-tree.html...
Generating /home/jenkins/.jenkins/jobs/oxCore/workspace/core-script/target/site/apidocs/org/gluu/service/custom/inject/package-summary.html...
Generating /home/jenkins/.jenkins/jobs/oxCore/workspace/core-script/target/site/apidocs/org/gluu/service/custom/inject/package-tree.html...
Generating /home/jenkins/.jenkins/jobs/oxCore/workspace/core-script/target/site/apidocs/org/gluu/service/custom/script/package-summary.html...
Generating /home/jenkins/.jenkins/jobs/oxCore/workspace/core-script/target/site/apidocs/org/gluu/service/custom/script/package-tree.html...
Generating /home/jenkins/.jenkins/jobs/oxCore/workspace/core-script/target/site/apidocs/constant-values.html...
Generating /home/jenkins/.jenkins/jobs/oxCore/workspace/core-script/target/site/apidocs/serialized-form.html...
Generating /home/jenkins/.jenkins/jobs/oxCore/workspace/core-script/target/site/apidocs/org/gluu/exception/class-use/PythonException.html...
Generating /home/jenkins/.jenkins/jobs/oxCore/workspace/core-script/target/site/apidocs/org/gluu/model/custom/script/conf/class-use/CustomScriptConfiguration.html...
Generating /home/jenkins/.jenkins/jobs/oxCore/workspace/core-script/target/site/apidocs/org/gluu/model/custom/script/model/class-use/ScriptError.html...
Generating /home/jenkins/.jenkins/jobs/oxCore/workspace/core-script/target/site/apidocs/org/gluu/model/custom/script/model/class-use/CustomScript.html...
Generating /home/jenkins/.jenkins/jobs/oxCore/workspace/core-script/target/site/apidocs/org/gluu/model/custom/script/model/class-use/ScriptTemplate.html...
Generating /home/jenkins/.jenkins/jobs/oxCore/workspace/core-script/target/site/apidocs/org/gluu/model/custom/script/model/auth/class-use/AuthenticationCustomScript.html...
Generating /home/jenkins/.jenkins/jobs/oxCore/workspace/core-script/target/site/apidocs/org/gluu/model/custom/script/model/bind/class-use/BindCredentials.html...
Generating /home/jenkins/.jenkins/jobs/oxCore/workspace/core-script/target/site/apidocs/org/gluu/model/custom/script/type/class-use/BaseExternalType.html...
Generating /home/jenkins/.jenkins/jobs/oxCore/workspace/core-script/target/site/apidocs/org/gluu/model/custom/script/type/auth/class-use/DummyPersonAuthenticationType.html...
Generating /home/jenkins/.jenkins/jobs/oxCore/workspace/core-script/target/site/apidocs/org/gluu/model/custom/script/type/auth/class-use/PersonAuthenticationType.html...
Generating /home/jenkins/.jenkins/jobs/oxCore/workspace/core-script/target/site/apidocs/org/gluu/model/custom/script/type/authz/class-use/ConsentGatheringType.html...
Generating /home/jenkins/.jenkins/jobs/oxCore/workspace/core-script/target/site/apidocs/org/gluu/model/custom/script/type/authz/class-use/DummyConsentGatheringType.html...
Generating /home/jenkins/.jenkins/jobs/oxCore/workspace/core-script/target/site/apidocs/org/gluu/model/custom/script/type/ciba/class-use/DummyEndUserNotificationType.html...
Generating /home/jenkins/.jenkins/jobs/oxCore/workspace/core-script/target/site/apidocs/org/gluu/model/custom/script/type/ciba/class-use/EndUserNotificationType.html...
Generating /home/jenkins/.jenkins/jobs/oxCore/workspace/core-script/target/site/apidocs/org/gluu/model/custom/script/type/client/class-use/ClientRegistrationType.html...
Generating /home/jenkins/.jenkins/jobs/oxCore/workspace/core-script/target/site/apidocs/org/gluu/model/custom/script/type/client/class-use/DummyClientRegistrationType.html...
Generating /home/jenkins/.jenkins/jobs/oxCore/workspace/core-script/target/site/apidocs/org/gluu/model/custom/script/type/id/class-use/DummyIdGeneratorType.html...
Generating /home/jenkins/.jenkins/jobs/oxCore/workspace/core-script/target/site/apidocs/org/gluu/model/custom/script/type/id/class-use/IdGeneratorType.html...
Generating /home/jenkins/.jenkins/jobs/oxCore/workspace/core-script/target/site/apidocs/org/gluu/model/custom/script/type/idp/class-use/DummyIdpType.html...
Generating /home/jenkins/.jenkins/jobs/oxCore/workspace/core-script/target/site/apidocs/org/gluu/model/custom/script/type/idp/class-use/IdpType.html...
Generating /home/jenkins/.jenkins/jobs/oxCore/workspace/core-script/target/site/apidocs/org/gluu/model/custom/script/type/introspection/class-use/DummyIntrospectionType.html...
Generating /home/jenkins/.jenkins/jobs/oxCore/workspace/core-script/target/site/apidocs/org/gluu/model/custom/script/type/introspection/class-use/IntrospectionType.html...
Generating /home/jenkins/.jenkins/jobs/oxCore/workspace/core-script/target/site/apidocs/org/gluu/model/custom/script/type/logout/class-use/DummyEndSessionType.html...
Generating /home/jenkins/.jenkins/jobs/oxCore/workspace/core-script/target/site/apidocs/org/gluu/model/custom/script/type/logout/class-use/EndSessionType.html...
Generating /home/jenkins/.jenkins/jobs/oxCore/workspace/core-script/target/site/apidocs/org/gluu/model/custom/script/type/owner/class-use/DummyResourceOwnerPasswordCredentialsType.html...
Generating /home/jenkins/.jenkins/jobs/oxCore/workspace/core-script/target/site/apidocs/org/gluu/model/custom/script/type/owner/class-use/ResourceOwnerPasswordCredentialsType.html...
Generating /home/jenkins/.jenkins/jobs/oxCore/workspace/core-script/target/site/apidocs/org/gluu/model/custom/script/type/persistence/class-use/DummyPeristenceType.html...
Generating /home/jenkins/.jenkins/jobs/oxCore/workspace/core-script/target/site/apidocs/org/gluu/model/custom/script/type/persistence/class-use/PersistenceType.html...
Generating /home/jenkins/.jenkins/jobs/oxCore/workspace/core-script/target/site/apidocs/org/gluu/model/custom/script/type/postauthn/class-use/DummyPostAuthnType.html...
Generating /home/jenkins/.jenkins/jobs/oxCore/workspace/core-script/target/site/apidocs/org/gluu/model/custom/script/type/postauthn/class-use/PostAuthnType.html...
Generating /home/jenkins/.jenkins/jobs/oxCore/workspace/core-script/target/site/apidocs/org/gluu/model/custom/script/type/scim/class-use/DummyScimType.html...
Generating /home/jenkins/.jenkins/jobs/oxCore/workspace/core-script/target/site/apidocs/org/gluu/model/custom/script/type/scim/class-use/ScimType.html...
Generating /home/jenkins/.jenkins/jobs/oxCore/workspace/core-script/target/site/apidocs/org/gluu/model/custom/script/type/scope/class-use/DummyDynamicScopeType.html...
Generating /home/jenkins/.jenkins/jobs/oxCore/workspace/core-script/target/site/apidocs/org/gluu/model/custom/script/type/scope/class-use/DynamicScopeType.html...
Generating /home/jenkins/.jenkins/jobs/oxCore/workspace/core-script/target/site/apidocs/org/gluu/model/custom/script/type/session/class-use/ApplicationSessionType.html...
Generating /home/jenkins/.jenkins/jobs/oxCore/workspace/core-script/target/site/apidocs/org/gluu/model/custom/script/type/session/class-use/DummyApplicationSessionType.html...
Generating /home/jenkins/.jenkins/jobs/oxCore/workspace/core-script/target/site/apidocs/org/gluu/model/custom/script/type/spontaneous/class-use/DummySpontaneousScopeType.html...
Generating /home/jenkins/.jenkins/jobs/oxCore/workspace/core-script/target/site/apidocs/org/gluu/model/custom/script/type/spontaneous/class-use/SpontaneousScopeType.html...
Generating /home/jenkins/.jenkins/jobs/oxCore/workspace/core-script/target/site/apidocs/org/gluu/model/custom/script/type/uma/class-use/UmaClaimsGatheringType.html...
Generating /home/jenkins/.jenkins/jobs/oxCore/workspace/core-script/target/site/apidocs/org/gluu/model/custom/script/type/uma/class-use/UmaDummyClaimsGatheringType.html...
Generating /home/jenkins/.jenkins/jobs/oxCore/workspace/core-script/target/site/apidocs/org/gluu/model/custom/script/type/uma/class-use/UmaDummyRptClaimsType.html...
Generating /home/jenkins/.jenkins/jobs/oxCore/workspace/core-script/target/site/apidocs/org/gluu/model/custom/script/type/uma/class-use/UmaDummyRptPolicyType.html...
Generating /home/jenkins/.jenkins/jobs/oxCore/workspace/core-script/target/site/apidocs/org/gluu/model/custom/script/type/uma/class-use/UmaRptClaimsType.html...
Generating /home/jenkins/.jenkins/jobs/oxCore/workspace/core-script/target/site/apidocs/org/gluu/model/custom/script/type/uma/class-use/UmaRptPolicyType.html...
Generating /home/jenkins/.jenkins/jobs/oxCore/workspace/core-script/target/site/apidocs/org/gluu/model/custom/script/type/user/class-use/CacheRefreshType.html...
Generating /home/jenkins/.jenkins/jobs/oxCore/workspace/core-script/target/site/apidocs/org/gluu/model/custom/script/type/user/class-use/DummyCacheRefreshType.html...
Generating /home/jenkins/.jenkins/jobs/oxCore/workspace/core-script/target/site/apidocs/org/gluu/model/custom/script/type/user/class-use/DummyUpdateUserType.html...
Generating /home/jenkins/.jenkins/jobs/oxCore/workspace/core-script/target/site/apidocs/org/gluu/model/custom/script/type/user/class-use/DummyUserRegistrationType.html...
Generating /home/jenkins/.jenkins/jobs/oxCore/workspace/core-script/target/site/apidocs/org/gluu/model/custom/script/type/user/class-use/UpdateUserType.html...
Generating /home/jenkins/.jenkins/jobs/oxCore/workspace/core-script/target/site/apidocs/org/gluu/model/custom/script/type/user/class-use/UserRegistrationType.html...
Generating /home/jenkins/.jenkins/jobs/oxCore/workspace/core-script/target/site/apidocs/org/gluu/model/custom/script/type/revoke/class-use/DummyRevokeTokenType.html...
Generating /home/jenkins/.jenkins/jobs/oxCore/workspace/core-script/target/site/apidocs/org/gluu/model/custom/script/type/revoke/class-use/RevokeTokenType.html...
Generating /home/jenkins/.jenkins/jobs/oxCore/workspace/core-script/target/site/apidocs/org/gluu/model/custom/script/type/token/class-use/DummyUpdateTokenType.html...
Generating /home/jenkins/.jenkins/jobs/oxCore/workspace/core-script/target/site/apidocs/org/gluu/model/custom/script/type/token/class-use/UpdateTokenType.html...
Generating /home/jenkins/.jenkins/jobs/oxCore/workspace/core-script/target/site/apidocs/org/gluu/model/custom/script/class-use/CustomScriptType.html...
Generating /home/jenkins/.jenkins/jobs/oxCore/workspace/core-script/target/site/apidocs/org/gluu/service/class-use/PythonService.html...
Generating /home/jenkins/.jenkins/jobs/oxCore/workspace/core-script/target/site/apidocs/org/gluu/service/cdi/event/class-use/UpdateScriptEvent.html...
Generating /home/jenkins/.jenkins/jobs/oxCore/workspace/core-script/target/site/apidocs/org/gluu/service/custom/inject/class-use/ReloadScript.html...
Generating /home/jenkins/.jenkins/jobs/oxCore/workspace/core-script/target/site/apidocs/org/gluu/service/custom/inject/class-use/ReloadScript.Literal.html...
Generating /home/jenkins/.jenkins/jobs/oxCore/workspace/core-script/target/site/apidocs/org/gluu/service/custom/script/class-use/ExternalScriptService.html...
Generating /home/jenkins/.jenkins/jobs/oxCore/workspace/core-script/target/site/apidocs/org/gluu/service/custom/script/class-use/StandaloneCustomScriptManager.html...
Generating /home/jenkins/.jenkins/jobs/oxCore/workspace/core-script/target/site/apidocs/org/gluu/service/custom/script/class-use/StandaloneCustomScriptService.html...
Generating /home/jenkins/.jenkins/jobs/oxCore/workspace/core-script/target/site/apidocs/org/gluu/service/custom/script/class-use/AbstractCustomScriptService.html...
Generating /home/jenkins/.jenkins/jobs/oxCore/workspace/core-script/target/site/apidocs/org/gluu/service/custom/script/class-use/CustomScriptManager.html...
Generating /home/jenkins/.jenkins/jobs/oxCore/workspace/core-script/target/site/apidocs/org/gluu/exception/package-use.html...
Generating /home/jenkins/.jenkins/jobs/oxCore/workspace/core-script/target/site/apidocs/org/gluu/model/custom/script/package-use.html...
Generating /home/jenkins/.jenkins/jobs/oxCore/workspace/core-script/target/site/apidocs/org/gluu/model/custom/script/conf/package-use.html...
Generating /home/jenkins/.jenkins/jobs/oxCore/workspace/core-script/target/site/apidocs/org/gluu/model/custom/script/model/package-use.html...
Generating /home/jenkins/.jenkins/jobs/oxCore/workspace/core-script/target/site/apidocs/org/gluu/model/custom/script/model/auth/package-use.html...
Generating /home/jenkins/.jenkins/jobs/oxCore/workspace/core-script/target/site/apidocs/org/gluu/model/custom/script/model/bind/package-use.html...
Generating /home/jenkins/.jenkins/jobs/oxCore/workspace/core-script/target/site/apidocs/org/gluu/model/custom/script/type/package-use.html...
Generating /home/jenkins/.jenkins/jobs/oxCore/workspace/core-script/target/site/apidocs/org/gluu/model/custom/script/type/auth/package-use.html...
Generating /home/jenkins/.jenkins/jobs/oxCore/workspace/core-script/target/site/apidocs/org/gluu/model/custom/script/type/authz/package-use.html...
Generating /home/jenkins/.jenkins/jobs/oxCore/workspace/core-script/target/site/apidocs/org/gluu/model/custom/script/type/ciba/package-use.html...
Generating /home/jenkins/.jenkins/jobs/oxCore/workspace/core-script/target/site/apidocs/org/gluu/model/custom/script/type/client/package-use.html...
Generating /home/jenkins/.jenkins/jobs/oxCore/workspace/core-script/target/site/apidocs/org/gluu/model/custom/script/type/id/package-use.html...
Generating /home/jenkins/.jenkins/jobs/oxCore/workspace/core-script/target/site/apidocs/org/gluu/model/custom/script/type/idp/package-use.html...
Generating /home/jenkins/.jenkins/jobs/oxCore/workspace/core-script/target/site/apidocs/org/gluu/model/custom/script/type/introspection/package-use.html...
Generating /home/jenkins/.jenkins/jobs/oxCore/workspace/core-script/target/site/apidocs/org/gluu/model/custom/script/type/logout/package-use.html...
Generating /home/jenkins/.jenkins/jobs/oxCore/workspace/core-script/target/site/apidocs/org/gluu/model/custom/script/type/owner/package-use.html...
Generating /home/jenkins/.jenkins/jobs/oxCore/workspace/core-script/target/site/apidocs/org/gluu/model/custom/script/type/persistence/package-use.html...
Generating /home/jenkins/.jenkins/jobs/oxCore/workspace/core-script/target/site/apidocs/org/gluu/model/custom/script/type/postauthn/package-use.html...
Generating /home/jenkins/.jenkins/jobs/oxCore/workspace/core-script/target/site/apidocs/org/gluu/model/custom/script/type/revoke/package-use.html...
Generating /home/jenkins/.jenkins/jobs/oxCore/workspace/core-script/target/site/apidocs/org/gluu/model/custom/script/type/scim/package-use.html...
Generating /home/jenkins/.jenkins/jobs/oxCore/workspace/core-script/target/site/apidocs/org/gluu/model/custom/script/type/scope/package-use.html...
Generating /home/jenkins/.jenkins/jobs/oxCore/workspace/core-script/target/site/apidocs/org/gluu/model/custom/script/type/session/package-use.html...
Generating /home/jenkins/.jenkins/jobs/oxCore/workspace/core-script/target/site/apidocs/org/gluu/model/custom/script/type/spontaneous/package-use.html...
Generating /home/jenkins/.jenkins/jobs/oxCore/workspace/core-script/target/site/apidocs/org/gluu/model/custom/script/type/token/package-use.html...
Generating /home/jenkins/.jenkins/jobs/oxCore/workspace/core-script/target/site/apidocs/org/gluu/model/custom/script/type/uma/package-use.html...
Generating /home/jenkins/.jenkins/jobs/oxCore/workspace/core-script/target/site/apidocs/org/gluu/model/custom/script/type/user/package-use.html...
Generating /home/jenkins/.jenkins/jobs/oxCore/workspace/core-script/target/site/apidocs/org/gluu/service/package-use.html...
Generating /home/jenkins/.jenkins/jobs/oxCore/workspace/core-script/target/site/apidocs/org/gluu/service/cdi/event/package-use.html...
Generating /home/jenkins/.jenkins/jobs/oxCore/workspace/core-script/target/site/apidocs/org/gluu/service/custom/inject/package-use.html...
Generating /home/jenkins/.jenkins/jobs/oxCore/workspace/core-script/target/site/apidocs/org/gluu/service/custom/script/package-use.html...
Building index for all the packages and classes...
Generating /home/jenkins/.jenkins/jobs/oxCore/workspace/core-script/target/site/apidocs/overview-tree.html...
Generating /home/jenkins/.jenkins/jobs/oxCore/workspace/core-script/target/site/apidocs/index-all.html...
Building index for all classes...
Generating /home/jenkins/.jenkins/jobs/oxCore/workspace/core-script/target/site/apidocs/allclasses-index.html...
Generating /home/jenkins/.jenkins/jobs/oxCore/workspace/core-script/target/site/apidocs/allpackages-index.html...
Generating /home/jenkins/.jenkins/jobs/oxCore/workspace/core-script/target/site/apidocs/deprecated-list.html...
Building index for all classes...
Generating /home/jenkins/.jenkins/jobs/oxCore/workspace/core-script/target/site/apidocs/allclasses.html...
Generating /home/jenkins/.jenkins/jobs/oxCore/workspace/core-script/target/site/apidocs/allclasses.html...
Generating /home/jenkins/.jenkins/jobs/oxCore/workspace/core-script/target/site/apidocs/index.html...
Generating /home/jenkins/.jenkins/jobs/oxCore/workspace/core-script/target/site/apidocs/overview-summary.html...
Generating /home/jenkins/.jenkins/jobs/oxCore/workspace/core-script/target/site/apidocs/help-doc.html...
1 error
1 warning
[ERROR] Error while creating javadoc report: 
Exit code: 1 - javadoc: error - The code being documented uses modules but the packages defined in https://docs.oracle.com/javase/8/docs/api/ are in the unnamed module.
/home/jenkins/.jenkins/jobs/oxCore/workspace/core-script/src/main/java/org/gluu/service/custom/script/ExternalScriptService.java:64: warning: no @param for customScriptManager
	public void configure(StandaloneCustomScriptManager customScriptManager) {
	            ^

Command line was: /opt/java/amazon-corretto-11.0.7.10.1-linux-x64/bin/javadoc @options @packages

Refer to the generated Javadoc files in '/home/jenkins/.jenkins/jobs/oxCore/workspace/core-script/target/site/apidocs' dir.

org.apache.maven.reporting.MavenReportException: 
Exit code: 1 - javadoc: error - The code being documented uses modules but the packages defined in https://docs.oracle.com/javase/8/docs/api/ are in the unnamed module.
/home/jenkins/.jenkins/jobs/oxCore/workspace/core-script/src/main/java/org/gluu/service/custom/script/ExternalScriptService.java:64: warning: no @param for customScriptManager
	public void configure(StandaloneCustomScriptManager customScriptManager) {
	            ^

Command line was: /opt/java/amazon-corretto-11.0.7.10.1-linux-x64/bin/javadoc @options @packages

Refer to the generated Javadoc files in '/home/jenkins/.jenkins/jobs/oxCore/workspace/core-script/target/site/apidocs' dir.

	at org.apache.maven.plugins.javadoc.AbstractJavadocMojo.executeJavadocCommandLine(AbstractJavadocMojo.java:5298)
	at org.apache.maven.plugins.javadoc.AbstractJavadocMojo.executeReport(AbstractJavadocMojo.java:2134)
	at org.apache.maven.plugins.javadoc.JavadocReport.generate(JavadocReport.java:134)
	at org.apache.maven.plugins.javadoc.JavadocReport.doExecute(JavadocReport.java:329)
	at org.apache.maven.plugins.javadoc.AbstractJavadocMojo.execute(AbstractJavadocMojo.java:1912)
	at org.apache.maven.plugin.DefaultBuildPluginManager.executeMojo(DefaultBuildPluginManager.java:134)
	at org.apache.maven.lifecycle.internal.MojoExecutor.execute(MojoExecutor.java:207)
	at org.apache.maven.lifecycle.internal.MojoExecutor.execute(MojoExecutor.java:153)
	at org.apache.maven.lifecycle.internal.MojoExecutor.execute(MojoExecutor.java:145)
	at org.apache.maven.lifecycle.internal.LifecycleModuleBuilder.buildProject(LifecycleModuleBuilder.java:116)
	at org.apache.maven.lifecycle.internal.LifecycleModuleBuilder.buildProject(LifecycleModuleBuilder.java:80)
	at org.apache.maven.lifecycle.internal.builder.singlethreaded.SingleThreadedBuilder.build(SingleThreadedBuilder.java:51)
	at org.apache.maven.lifecycle.internal.LifecycleStarter.execute(LifecycleStarter.java:128)
	at org.apache.maven.DefaultMaven.doExecute(DefaultMaven.java:307)
	at org.apache.maven.DefaultMaven.doExecute(DefaultMaven.java:193)
	at org.apache.maven.DefaultMaven.execute(DefaultMaven.java:106)
	at org.apache.maven.cli.MavenCli.execute(MavenCli.java:863)
	at org.apache.maven.cli.MavenCli.doMain(MavenCli.java:288)
	at org.apache.maven.cli.MavenCli.main(MavenCli.java:199)
	at java.base/jdk.internal.reflect.NativeMethodAccessorImpl.invoke0(Native Method)
	at java.base/jdk.internal.reflect.NativeMethodAccessorImpl.invoke(NativeMethodAccessorImpl.java:62)
	at java.base/jdk.internal.reflect.DelegatingMethodAccessorImpl.invoke(DelegatingMethodAccessorImpl.java:43)
	at java.base/java.lang.reflect.Method.invoke(Method.java:566)
	at org.codehaus.plexus.classworlds.launcher.Launcher.launchEnhanced(Launcher.java:289)
	at org.codehaus.plexus.classworlds.launcher.Launcher.launch(Launcher.java:229)
	at org.codehaus.plexus.classworlds.launcher.Launcher.mainWithExitCode(Launcher.java:415)
	at org.codehaus.plexus.classworlds.launcher.Launcher.main(Launcher.java:356)
[INFO] 
[INFO] --- maven-site-plugin:2.1.1:site (default-site) @ oxcore-script ---
[INFO]                                                                         
[INFO] ------------------------------------------------------------------------
[INFO] Building oxService 4.3.0-SNAPSHOT
[INFO] ------------------------------------------------------------------------
[INFO] 
[INFO] --- maven-clean-plugin:2.4.1:clean (default-clean) @ oxcore-service ---
[INFO] Deleting /home/jenkins/.jenkins/jobs/oxCore/workspace/oxService/target
[INFO] 
[INFO] --- maven-resources-plugin:2.4:resources (default-resources) @ oxcore-service ---
[INFO] Using 'UTF-8' encoding to copy filtered resources.
[INFO] Copying 1 resource
[INFO] 
[INFO] --- maven-compiler-plugin:2.3.2:compile (default-compile) @ oxcore-service ---
[INFO] Compiling 86 source files to /home/jenkins/.jenkins/jobs/oxCore/workspace/oxService/target/classes
[INFO] -------------------------------------------------------------
[ERROR] COMPILATION ERROR : 
[INFO] -------------------------------------------------------------
[ERROR] /home/jenkins/.jenkins/jobs/oxCore/workspace/oxService/src/main/java/org/gluu/service/MailService.java:[132,37] error: cannot access DataSource
[INFO] 1 error
[INFO] -------------------------------------------------------------
[INFO] ------------------------------------------------------------------------
[INFO] Reactor Summary:
[INFO] 
[INFO] oxCore ............................................. SUCCESS [  1.639 s]
[INFO] oxUtil ............................................. SUCCESS [  9.789 s]
[INFO] oxModel ............................................ SUCCESS [  4.305 s]
[INFO] Caches support ..................................... SUCCESS [  5.045 s]
[INFO] Caches support ..................................... SUCCESS [  5.108 s]
[INFO] Configuration factories for standalone applications  SUCCESS [  4.173 s]
[INFO] oxSaml ............................................. SUCCESS [  4.397 s]
[INFO] Reusable CDI classes which not depend on specific framework SUCCESS [  2.970 s]
[INFO] Reusable CDI Script implementation ................. SUCCESS [ 10.206 s]
[INFO] oxService .......................................... FAILURE [  1.553 s]
[INFO] oxJsfUtil .......................................... SKIPPED
[INFO] Java extensions .................................... SKIPPED
[INFO] Weld CDI timer implementation ...................... SKIPPED
[INFO] Reusable CDI security extension .................... SKIPPED
[INFO] Reusable CDI exception handler extension ........... SKIPPED
[INFO] Web application specific classes ................... SKIPPED
[INFO] oxRadius ........................................... SKIPPED
[INFO] Demo CDI services .................................. SKIPPED
[INFO] ------------------------------------------------------------------------
[INFO] BUILD FAILURE
[INFO] ------------------------------------------------------------------------
[INFO] Total time: 51.200 s
[INFO] Finished at: 2021-07-16T11:39:09+00:00
[INFO] Final Memory: 50M/174M
[INFO] ------------------------------------------------------------------------
[ERROR] Failed to execute goal org.apache.maven.plugins:maven-compiler-plugin:2.3.2:compile (default-compile) on project oxcore-service: Compilation failure
[ERROR] /home/jenkins/.jenkins/jobs/oxCore/workspace/oxService/src/main/java/org/gluu/service/MailService.java:[132,37] error: cannot access DataSource
[ERROR] -> [Help 1]
[ERROR] 
[ERROR] To see the full stack trace of the errors, re-run Maven with the -e switch.
[ERROR] Re-run Maven using the -X switch to enable full debug logging.
[ERROR] 
[ERROR] For more information about the errors and possible solutions, please read the following articles:
[ERROR] [Help 1] http://cwiki.apache.org/confluence/display/MAVEN/MojoFailureException
[ERROR] 
[ERROR] After correcting the problems, you can resume the build with the command
[ERROR]   mvn <goals> -rf :oxcore-service
Build step 'Invoke top-level Maven targets' marked build as failure
[FINDBUGS] Skipping publisher since build result is FAILURE
TestNG Reports Processing: START
Looking for TestNG results report in workspace using pattern: **/testng-results.xml
Saving reports...
Processing '/home/jenkins/.jenkins/jobs/oxCore/builds/1322/testng/testng-results-1.xml'
Processing '/home/jenkins/.jenkins/jobs/oxCore/builds/1322/testng/testng-results.xml'
TestNG Reports Processing: FINISH
Not sending mail to unregistered user Yuriy.Movchan@gmail.com
Sending e-mails to: support@gluu.org
ERROR: Couldn't connect to host, port: webmail.gluu.org, 465; timeout 60000
com.sun.mail.util.MailConnectException: Couldn't connect to host, port: webmail.gluu.org, 465; timeout 60000;
  nested exception is:
	java.net.SocketTimeoutException: connect timed out
	at com.sun.mail.smtp.SMTPTransport.openServer(SMTPTransport.java:2210)
	at com.sun.mail.smtp.SMTPTransport.protocolConnect(SMTPTransport.java:722)
	at javax.mail.Service.connect(Service.java:310)
	at javax.mail.Service.connect(Service.java:169)
	at javax.mail.Service.connect(Service.java:118)
	at javax.mail.Transport.send0(Transport.java:188)
	at javax.mail.Transport.send(Transport.java:118)
	at hudson.tasks.MailSender.run(MailSender.java:130)
	at hudson.tasks.Mailer.perform(Mailer.java:176)
	at hudson.tasks.Mailer.perform(Mailer.java:139)
	at hudson.tasks.BuildStepMonitor$1.perform(BuildStepMonitor.java:20)
	at hudson.model.AbstractBuild$AbstractBuildExecution.perform(AbstractBuild.java:741)
	at hudson.model.AbstractBuild$AbstractBuildExecution.performAllBuildSteps(AbstractBuild.java:690)
	at hudson.model.Build$BuildExecution.post2(Build.java:186)
	at hudson.model.AbstractBuild$AbstractBuildExecution.post(AbstractBuild.java:635)
	at hudson.model.Run.execute(Run.java:1905)
	at hudson.model.FreeStyleBuild.run(FreeStyleBuild.java:43)
	at hudson.model.ResourceController.execute(ResourceController.java:97)
	at hudson.model.Executor.run(Executor.java:428)
Caused by: java.net.SocketTimeoutException: connect timed out
	at java.net.PlainSocketImpl.socketConnect(Native Method)
	at java.net.AbstractPlainSocketImpl.doConnect(AbstractPlainSocketImpl.java:350)
	at java.net.AbstractPlainSocketImpl.connectToAddress(AbstractPlainSocketImpl.java:206)
	at java.net.AbstractPlainSocketImpl.connect(AbstractPlainSocketImpl.java:188)
	at java.net.SocksSocketImpl.connect(SocksSocketImpl.java:392)
	at java.net.Socket.connect(Socket.java:589)
	at com.sun.mail.util.SocketFetcher.createSocket(SocketFetcher.java:333)
	at com.sun.mail.util.SocketFetcher.getSocket(SocketFetcher.java:193)
	at com.sun.mail.smtp.SMTPTransport.openServer(SMTPTransport.java:2160)
	... 18 more
Finished: FAILURE